{"text_format":"1","workbook":"xlsx","n_sheets":15,"sheets":["Instructions","Do Minimum Forecast Assessment","Intervention ForecastAssessment","Urban DSi Indices","Rural DSi indices","Example of DSI Calc","Infrastructure Risk Rating","Sheet3","Speeds 2","IRR Lookup Data","Error Margins","NZ","Region","LA","Popn"],"not_rendered":{"charts":93,"images":5,"macros":1,"external_links":1,"defined_names":9,"comments":1,"pivot_tables":0},"unopened":[],"bounds":{"document_bytes":16777216,"sheet_cells":100000,"rows_first":2000,"rows_last":500,"rows_between":2000,"halvings":0,"cell_chars":16384,"cell_head_chars":4096},"cells_cut":0,"cells_raw":0,"read":"whole","date_system":"1900"}

{"sheet":"Instructions","index":0,"n_rows":49,"n_cols":5,"rows_kept":49,"cut":false,"hidden":false,"merged":[[20,3,22,4]]}
["Determining Safety Risk"]
[]
["The purpose of this spreadsheet is to assist practitioners to determine the safety risk of intersections or corridors where 'road improvement projects' are proposed."]
[]
["This method is appropriate for  strategic case, programme business cases, single-stage or detailed business cases as this gives a more accurate measures of DSI casualty equivalents using Crash Analysis System (CAS) data for the last 5 or 10 years.",null,null,"Movement crash codes "]
[null,null,null,"A","Overtaking and lane change"]
["Information requirements are:",null,null,"B","Head on"]
["1. Crash Analysis System (CAS) data for the last 5 or 10 years.",null,null,"C","Lost control or off road (straight roads)"]
["2. Traffic Volume information (AADT- Annual Average Daily Traffic).",null,null,"D","Cornering"]
["3. Corridor length measurement for the section under consideration.",null,null,"E","Collision with obstruction"]
{"$rows_left_out":40}
{"sheet":"Do Minimum Forecast Assessment","index":1,"n_rows":53,"n_cols":88,"rows_kept":53,"cut":false,"hidden":false,"merged":[[0,14,3,18],[16,0,16,17],[36,20,36,34],[36,37,36,51],[18,5,18,7],[18,8,18,10],[18,11,18,13],[18,14,18,16],[16,19,16,34],[17,20,17,34],[18,20,18,22],[18,32,18,34],[17,2,17,17],[29,0,29,1],[30,0,30,1],[0,11,0,12],[57,3,57,4],[18,2,18,4],[18,23,18,25],[18,26,18,28],[18,29,18,31],[37,20,37,22],[37,23,37,25],[37,26,37,28],[37,29,37,31],[37,14,37,16],[16,54,16,69],[17,55,17,69],[16,71,16,86],[17,72,17,86],[37,55,37,57],[37,58,37,60],[37,61,37,63],[37,64,37,66],[37,67,37,69],[18,55,18,57],[18,58,18,60],[18,61,18,63],[18,64,18,66],[18,67,18,69],[18,72,18,74],[36,55,36,69],[18,78,18,80],[18,81,18,83],[18,84,18,86],[37,72,37,74],[37,75,37,77],[37,78,37,80],[37,81,37,83],[37,84,37,86],[36,72,36,86],[18,75,18,77],[26,0,26,1],[27,0,27,1],[28,0,28,1],[37,49,37,51],[16,36,16,51],[17,37,17,51],[18,37,18,39],[18,40,18,42],[18,43,18,45],[18,46,18,48],[18,49,18,51],[37,37,37,39],[37,40,37,42],[37,43,37,45],[37,46,37,48],[1,11,1,12],[2,11,2,12],[3,11,3,12],[37,32,37,34],[24,0,24,1],[25,0,25,1],[17,0,18,1],[19,0,19,1],[20,0,20,1],[21,0,21,1],[22,0,22,1],[23,0,23,1],[31,0,31,1],[32,0,32,1],[33,0,33,1],[34,0,34,1]]}
["Project Name","SNP Boost 3: SH2 Te Puke - Otamarakau",null,null,null,null,null,"Assessment Date",null,"2020-11-02",null,"Key ",null,null,"B - DSI Equivalents"]
["Local govt area","Western Bay Of Plenty District",null,null,null,null,null,null,null,null,null,"Input required "]
["Model Type ","Standard Model (designed for an input of coded crash data and provides a more accurate risk score) ",null,null,null,null,null,null,null,null,null,"Leave blank "]
["Corridor or Intersection","Corridor",null,null,null,null,null,null,null,null,null,"Leave value"]
["Speed Limit",100,"(km/h)"]
["Speed Environment",{"$f":"IF(B5<79,\"Urban\",\"Rural\")","v":"Rural"}]
[{"$f":"IF(B4=\"Intersection\",\"Major Road AADT\",\"Corridor AADT\")","v":"Corridor AADT"},4925,{"$f":"IF(B4=\"Intersection\",\"Average of the two major intersection approaches\",\"Two-way AADT in vehicles/day\")","v":"Two-way AADT in vehicles/day"}]
[{"$f":"IF(B4=\"Intersection\",\"Minor Road AADT\",\" \")","v":" "}]
[{"$f":"IF(B4=\"Intersection\",\"Product of Flow (PoF)\",\"\")","v":""},{"$f":"IF(A9=\"\",\"\",(B7*B8)^0.4)","v":""},"Only populated for intersections"]
[{"$f":"IF(B4=\"intersection\",\"\",\"Corridor Length (km)\")","v":"Corridor Length (km)"},20.010000000000002]
{"$rows_left_out":44}
{"sheet":"Intervention ForecastAssessment","index":2,"n_rows":72,"n_cols":87,"rows_kept":72,"cut":false,"hidden":false,"merged":[[62,2,62,3],[63,2,63,3],[64,2,64,3],[66,1,66,3],[37,74,37,76],[37,48,37,50],[37,19,37,21],[37,22,37,24],[37,25,37,27],[37,28,37,30],[37,77,37,79],[37,80,37,82],[37,83,37,85],[36,1,36,5],[37,54,37,56],[37,57,37,59],[37,60,37,62],[37,63,37,65],[37,66,37,68],[37,71,37,73],[37,31,37,33],[37,36,37,38],[37,39,37,41],[37,42,37,44],[37,45,37,47],[36,7,36,12],[18,83,18,85],[36,19,36,33],[36,36,36,50],[36,54,36,68],[36,71,36,85],[18,63,18,65],[18,66,18,68],[18,71,18,73],[18,74,18,76],[18,77,18,79],[18,80,18,82],[18,42,18,44],[18,45,18,47],[18,48,18,50],[18,54,18,56],[18,57,18,59],[18,60,18,62],[18,22,18,24],[18,25,18,27],[18,28,18,30],[18,31,18,33],[18,36,18,38],[18,39,18,41],[16,70,16,85],[17,1,17,16],[17,19,17,33],[17,36,17,50],[17,54,17,68],[17,71,17,85],[16,53,16,68],[16,18,16,33],[16,35,16,50],[18,19,18,21],[18,1,18,3],[18,4,18,6],[18,7,18,9],[18,10,18,12],[18,13,18,15],[4,4,4,5],[16,0,16,16],[0,1,0,6],[0,11,0,12],[1,11,1,12],[2,11,2,12],[3,11,3,12],[0,14,3,18]]}
["Project Name",{"$f":"'Do Minimum Forecast Assessment'!B1","v":"SNP Boost 3: SH2 Te Puke - Otamarakau"},null,null,null,null,null,"Assessment Date",null,{"$f":"'Do Minimum Forecast Assessment'!J1","v":"2020-11-02"},null,"Key ",null,null,"B - DSI Equivalents"]
["Local govt area",{"$f":"'Do Minimum Forecast Assessment'!B2","v":"Western Bay Of Plenty District"},null,null,null,null,null,null,null,null,null,"Input required "]
["Model Type ",{"$f":"'Do Minimum Forecast Assessment'!B3","v":"Standard Model (designed for an input of coded crash data and provides a more accurate risk score) "},null,null,null,null,null,null,null,null,null,"Leave blank "]
["Corridor or Intersection",{"$f":"'Do Minimum Forecast Assessment'!B4","v":"Corridor"},null,null,null,null,null,null,null,null,null,"Leave value"]
["Speed Limit",{"$f":"'Do Minimum Forecast Assessment'!B5","v":100},"(km/h)"]
["Speed Environment",{"$f":"'Do Minimum Forecast Assessment'!B6","v":"Rural"}]
[{"$f":"IF(B4=\"Intersection\",\"Major Road AADT\",\"Corridor AADT\")","v":"Corridor AADT"},{"$f":"'Do Minimum Forecast Assessment'!B7","v":4925},{"$f":"IF(B4=\"Intersection\",\"Average of the two major intersection approaches\",\"Two-way AADT in vehicles/day\")","v":"Two-way AADT in vehicles/day"}]
[{"$f":"IF(B4=\"Intersection\",\"Minor Road AADT\",\" \")","v":" "}]
[{"$f":"IF(B4=\"Intersection\",\"Product of Flow (PoF)\",\"\")","v":""},{"$f":"IF(A9=\"\",\"\",(B7*B8)^0.4)","v":""},"Only populated for intersections"]
[{"$f":"IF(B4=\"intersection\",\"\",\"Corridor Length (km)\")","v":"Corridor Length (km)"},{"$f":"'Do Minimum Forecast Assessment'!B10","v":20.010000000000002}]
{"$rows_left_out":63}
{"sheet":"Urban DSi Indices","index":3,"n_rows":0,"n_cols":0,"rows_kept":0,"cut":false,"hidden":true,"merged":[]}

{"sheet":"Rural DSi indices","index":4,"n_rows":0,"n_cols":0,"rows_kept":0,"cut":false,"hidden":true,"merged":[]}

{"sheet":"Example of DSI Calc","index":5,"n_rows":0,"n_cols":0,"rows_kept":0,"cut":false,"hidden":true,"merged":[]}

{"sheet":"Infrastructure Risk Rating","index":6,"n_rows":19,"n_cols":7,"rows_kept":19,"cut":false,"hidden":false,"merged":[[0,0,0,2],[42,0,42,2]]}
["Corridor Assessment"]
[]
["Infrastructure Risk Rating",{"$f":"LOG10(B5*B7*B9*B11*B13*B15*B17*B19)","v":1.2322999978107627},{"$f":"IF(B3<0.8,\"LOW\",IF(B3<1.2,\"LOW MEDIUM\",IF(B3<1.6,\"MEDIUM\",IF(B3<2,\"MEDIUM HIGH\",\"HIGH\"))))","v":"MEDIUM"}]
["Road Stereotype"]
["Two Lane Undivided",{"$f":"LOOKUP(A5,'IRR Lookup Data'!$A$3:$A$8,'IRR Lookup Data'!$B$3:$B$8)","v":3.7}]
["Alignment"]
["Straight",{"$f":"LOOKUP(A7,'IRR Lookup Data'!$A$12:$A$15,'IRR Lookup Data'!$B$12:$B$15)","v":1}]
["Carriageway"]
["Shoulder 1.0+ to 2.0",{"$f":"LOOKUP(A9,'IRR Lookup Data'!$A$19:$A$22,'IRR Lookup Data'!$B$19:$B$22)","v":1}]
["Roadside Hazard"]
{"$rows_left_out":10}
{"sheet":"Sheet3","index":7,"n_rows":17,"n_cols":1,"rows_kept":17,"cut":false,"hidden":true,"merged":[]}
["Model types "]
["Standard Model (designed for an input of coded crash data and provides a more accurate risk score) "]
["Simple Model (reduces the complexity of the input data but provides a less accurate indicatiuon of risk score) "]
[]
["Corridor"]
["intersection"]
[]
[]
[]
[]
{"$rows_left_out":8}
{"sheet":"Speeds 2","index":8,"n_rows":8,"n_cols":1,"rows_kept":8,"cut":false,"hidden":true,"merged":[]}
["Speeds"]
["<=30"]
[40]
[50]
[60]
[70]
[80]
[100]

{"sheet":"IRR Lookup Data","index":9,"n_rows":67,"n_cols":3,"rows_kept":67,"cut":false,"hidden":false,"merged":[]}
["Road Stereotype","Risk Score"]
["Please select…"]
["Divided Non-Traversable",1]
["Divided Traversable",3]
["Multi-lane Undivided",3.4]
["One Way",1]
["Two Lane Undivided",3.7]
["Unsealed",10]
[]
["Alignment","Risk Score"]
{"$rows_left_out":58}
{"sheet":"Error Margins","index":10,"n_rows":69,"n_cols":40,"rows_kept":69,"cut":false,"hidden":false,"merged":[[0,0,0,34],[2,4,2,6],[7,2,7,8],[7,11,7,14],[7,19,7,23],[7,25,7,29],[7,31,7,33],[8,2,8,4],[8,6,8,8],[8,11,8,13],[8,16,8,17],[8,19,8,23]]}
["Do Minimum Projections for Deaths and Serious Injuries"]
[]
[null,null,"Select local authority",null,{"$f":"'Do Minimum Forecast Assessment'!B2","v":"Western Bay Of Plenty District"},null,null,"Cells shaded yellow are for alternative assumptions and sensitivity analysis. They will over-ride default values."]
[null,null,"  Implied region",null,{"$f":"HLOOKUP(E3,LA!B3:BS4,2,FALSE)","v":"BP"},null,null,"Results are given in cells shaded light blue."]
[null,null,"  Region name",null,{"$f":"VLOOKUP(E4,Region!R3:S17,2,FALSE)","v":"Bay of Plenty"}]
[null,null,"End year for Figure 5 ",null,{"$f":"'Do Minimum Forecast Assessment'!B14+'Do Minimum Forecast Assessment'!B15-1","v":2029}]
[null,null," (see below)"]
[null,null,"New Zealand",null,null,null,null,null,null,null,null,{"$f":"E3","v":"Western Bay Of Plenty District"},null,null,null,null,{"$f":"E3","v":"Western Bay Of Plenty District"},null,null,{"$f":"E5","v":"Bay of Plenty"},null,null,null,null,null,{"$f":"E3","v":"Western Bay Of Plenty District"},null,null,null,null,null,"Area within LA"]
[null,null,"V/P",null,null,null,"T/V",null,null,null,null,"P",null,null,null,null,"T",null,null,"DSI/T ",null,null,null,null,null,"DSI","DSI-1se","DSI+1se","DSI-1sd","DSI+1sd",null,"DSI","DSI-1sd","DSI+1sd"]
[null,null,"level","endog change","exog change","selected change","level","endog change","exog change","selected change",null,"level","endog change","exog change","selected change",null,"level","change",null,"value","endog change","exog change","selected change","error"]
{"$rows_left_out":60}
{"sheet":"NZ","index":11,"n_rows":46,"n_cols":3,"rows_kept":46,"cut":false,"hidden":true,"merged":[]}
["T/V and P/V for New Zealand"]
[]
[null,"T/V","V/P"]
[2001,13266.491568926967,0.66063960829789981]
[{"$f":"A4+1","v":2002},13256.971995931872,0.67060934532100802]
[{"$f":"A5+1","v":2003},13106.600156557475,0.68518325387365908]
[2004,12949.357285569082,0.70138568807339452]
[2005,12607.21145806055,0.71774813130457926]
[2006,12314.916950171291,0.72399727572527828]
[2007,12254.349184672194,0.73124556086935932]
{"$rows_left_out":37}
{"sheet":"Region","index":12,"n_rows":68,"n_cols":19,"rows_kept":68,"cut":false,"hidden":true,"merged":[]}
["DSI/T (T in billion km) by region"]
[]
[null,"NL","AK","WK","BP","GS","HB","TN","MW","WL","NM","WC","CB","OT","SL","NZ",null,"NL","Northland"]
[2001,88.146827101901934,57.319396058368028,89.807136273752477,86.876515341838598,86.799886804502222,98.158925642535408,86.94435844849589,92.827907774948358,57.408220230567302,93.062294793447975,121.99584298226608,78.69225937147138,133.5175653784278,143.46928601123275,84.974665093515938,null,"AK","Auckland"]
[2002,91.03889786844627,63.964167136775316,78.654513646793163,94.277539361517057,53.320510569668016,97.21000717725785,62.031232244454458,92.86391446061964,63.322283925661495,102.35502470044453,103.43884437957557,67.799448137658402,151.51256293303703,168.82019697151443,85.604854576722829,null,"WK","Waikato"]
[2003,84.372936458967473,52.952515099711547,93.342979417668488,99.506038282530625,80.762960395111051,102.98439072887292,78.161842744056543,97.047992445399601,60.293727277454479,93.054520078678209,83.701133920627029,71.645063673107273,138.89368696900186,153.64154537888223,84.029293319056563,null,"BP","Bay of Plenty"]
[2004,100.94008186317441,52.471892429160398,93.767539365774709,82.541744005701375,66.751963399668298,91.545109823444136,91.657820329111274,91.885041803766043,58.366019515717326,87.230395367246203,84.285040502069975,61.689500212643708,128.19881483264223,104.85452516065402,78.815465097068483,null,"GS","Gisborne"]
[2005,87.211722967566075,45.667743050159025,84.450659447563197,74.794329951924084,110.6848926345473,110.5000938845631,65.765168055435126,102.60252388997058,59.970305351013522,61.748537337922578,95.045479187867144,71.209196479506872,143.48956453544244,144.6853123536153,78.48830978552914,null,"HB","Hawkes Bay"]
[2006,90.022437974510694,56.526856249668121,80.792067534228252,91.033601570249459,74.558643973946474,118.96828909126485,65.542837403869228,98.045787360615037,61.976774914303974,81.479492308888183,96.527661224707131,62.84483066407391,114.98162703009889,162.52973439663282,80.997588657454088,null,"TN","Taranaki"]
[2007,102.94825468715584,42.892175011137006,92.648187468443851,99.745049530313111,93.59735733477406,103.23390971840003,80.053776483214349,98.615397364026038,71.521176291780918,81.126845510938892,91.596013127815382,79.162264297457568,105.63324332323018,127.03128601601607,81.243435576311285,null,"MW","Manawatu/Wanganui"]
{"$rows_left_out":59}
{"sheet":"LA","index":13,"n_rows":26,"n_cols":72,"rows_kept":26,"cut":false,"hidden":true,"merged":[]}
["DSI by Local Authority (historical)",null,null,null,null,null,null,null,null,null,null,null,null,null,null,null,null,null,null,null,null,null,null,null,null,null,null,null,null,null,null,null,null,null,null,null,null,null,null,null,null,null,null,null,null,null,null,null,null,null,null,null,null,null,null,null,null,null,null,null,null,null,null,null,null,null,null,null,null,null,null,"Actual sum "]
[null,null,null,null,null,null,null,null,null,null,null,null,null,null,null,null,null,null,null,null,null,null,null,null,null,null,null,null,null,null,null,null,null,null,null,null,null,null,null,null,null,null,null,null,null,null,null,null,null,null,null,null,null,null,null,null,null,null,null,null,null,null,null,null,null,null,null,null,null,null,null,"not equal total"]
[null,"Far North District","Whangarei District","Kaipara District","Akl North","Akl West","Akl Central","Akl South","Thames-Coromandel District","Hauraki District","Waikato District","Matamata-Piako District","Hamilton City","Waipa District","Otorohanga District","South Waikato District","Waitomo District","Taupo District","Western Bay Of Plenty District","Tauranga City","Rotorua District","Whakatane District","Kawerau District","Opotiki District","Gisborne District","Wairoa District","Hastings District","Napier City","Central Hawkes Bay District","New Plymouth District","Stratford District","South Taranaki District","Ruapehu District","Wanganui District","Rangitikei District","Manawatu District","Palmerston North City","Tararua District","Horowhenua District","Kapiti Coast District","Porirua City","Upper Hutt City","Hutt City","Wellington City","Masterton District","Carterton District","South Wairarapa District","Tasman District","Nelson City","Marlborough District","Kaikoura District","Buller District","Grey District","Westland District","Hurunui District","Waimakariri District","Christchurch City","Selwyn District","Ashburton District","Timaru District","Mackenzie District","Waimate District","Waitaki District","Central Otago District","Queenstown-Lakes District","Dunedin City","Clutha District","Southland District","Gore District","Invercargill City","NZ"]
[null,"NL","NL","NL","AK","AK","AK","AK","WK","WK","WK","WK","WK","WK","WK","WK","WK","WK","BP","BP","BP","BP","BP","BP","GS","HB","HB","HB","HB","TN","TN","TN","MW","MW","MW","MW","MW","MW","MW","WL","WL","WL","WL","WL","WL","WL","WL","NM","NM","NM","CB","WC","WC","WC","CB","CB","CB","CB","CB","CB","CB","CB","CB","OT","OT","OT","OT","SL","SL","SL","NZ"]
[2000,69,61,32,165,69,179,163,13,36,100,49,57,44,17,42,14,55,52,45,45,21,4,7,44,18,66,21,19,51,6,37,29,30,43,40,35,27,32,28,31,20,30,50,13,7,17,45,13,35,3,18,13,17,21,34,142,42,16,36,7,11,22,22,26,57,38,58,4,34,{"$f":"SUM(B5:BR5)","v":2747}]
[2001,61,61,35,174,85,167,183,18,26,78,31,41,36,16,52,16,68,49,36,51,35,3,9,37,23,66,26,23,46,10,33,22,27,39,32,37,22,26,36,16,12,38,65,12,6,11,59,31,21,5,23,13,16,26,30,183,42,17,35,5,17,32,22,31,134,44,91,11,44,2890,{"$f":"SUM(B6:BR6)","v":2928}]
[2002,82,60,20,182,116,187,222,13,25,78,32,47,26,16,47,16,44,47,58,52,32,2,12,23,13,74,30,23,35,8,22,20,30,23,36,39,19,41,40,26,11,44,69,10,10,12,55,22,49,11,18,9,18,30,15,171,22,16,29,16,7,33,36,56,150,42,93,17,62,3005,3051]
[2003,75,63,14,135,100,172,203,23,33,86,29,62,27,19,45,25,69,63,54,48,40,2,16,35,11,76,42,22,55,3,25,17,52,20,40,37,30,24,21,24,19,45,61,22,9,16,68,20,30,1,10,16,12,28,27,178,29,27,33,10,7,45,40,43,140,45,80,17,62,3039,3077]
[2004,79,75,30,194,85,155,192,12,35,114,35,47,45,20,40,28,53,45,49,53,32,1,16,29,12,77,33,15,70,3,26,31,34,23,34,42,18,29,36,36,8,44,58,16,3,15,41,26,48,15,18,10,12,14,31,152,28,20,21,6,17,40,35,40,145,29,59,10,41,2926,2985]
[2005,73,52,33,159,64,162,170,22,44,79,36,53,43,10,33,24,45,31,43,52,43,2,13,47,22,96,26,21,36,6,29,25,32,34,35,47,33,29,40,27,32,35,60,13,11,5,34,16,32,14,14,15,16,37,24,190,39,19,24,10,16,27,46,52,142,42,80,18,54,2936,2988]
{"$rows_left_out":17}
{"sheet":"Popn","index":14,"n_rows":62,"n_cols":95,"rows_kept":62,"cut":false,"hidden":true,"merged":[[7,0,22,0],[24,0,30,0],[33,0,37,0]]}
["Population Projections by Local Authority (base 2013)"]
["The calculations in cols K-O are temporary until Stats NZ releases projections based on the 2018 census."]
[]
[null,"end June","Far North District","Whangarei District","Kaipara District","Akl North","Akl West","Akl Central","Akl South","Thames-Coromandel District","Hauraki District","Waikato District","Matamata-Piako District","Hamilton City","Waipa District","Otorohanga District","South Waikato District","Waitomo District","Taupo District","Western Bay Of Plenty District","Tauranga City","Rotorua District","Whakatane District","Kawerau District","Opotiki District","Gisborne District","Wairoa District","Hastings District","Napier City","Central Hawkes Bay District","New Plymouth District","Stratford District","South Taranaki District","Ruapehu District","Wanganui District","Rangitikei District","Manawatu District","Palmerston North City","Tararua District","Horowhenua District","Kapiti Coast District","Porirua City","Upper Hutt City","Hutt City","Wellington City","Masterton District","Carterton District","South Wairarapa District","Tasman District","Nelson City","Marlborough District","Kaikoura District","Buller District","Grey District","Westland District","Hurunui District","Waimakariri District","Christchurch City","Selwyn District","Ashburton District","Timaru District","Mackenzie District","Waimate District","Waitaki District","Central Otago District","Queenstown-Lakes District","Dunedin City","Clutha District","Southland District","Gore District","Invercargill City","NZ",null,"  Auckland","  Rodney local board area","  Hibiscus and Bays local board area","  Upper Harbour local board area","  Kaipatiki local board area","  Devonport-Takapuna local board area","  Henderson-Massey local board area","  Waitakere Ranges local board area","  Great Barrier local board area","  Waiheke local board area","  Waitemata local board area","  Whau local board area","  Albert-Eden local board area","  Puketapapa local board area","  Orakei local board area","  Maungakiekie-Tamaki local board area","  Howick local board area","  Mangere-Otahuhu local board area","  Otara-Papatoetoe local board area","  Manurewa local board area","  Papakura local board area","  Franklin local board area"]
[null,null,"","","",null,null,null,null,"","","","","","","","","","","","","","","","","","","","","","","","","","","","","","","","","","","","","","","","","","","","","","","","","","","","","","","","","","","","","","",null,null,"","","","","","","","","","","","","","","","","","","","","",""]
["Stats NZ",2001,56400,70000,17950,{"$f":"SUM(BW6:CA6)","v":283400},{"$f":"CB6+CC6+CG6","v":201300},{"$f":"SUM(CD6:CJ6)-CG6","v":273960},{"$f":"SUM(CK6:CQ6)","v":459600},25800,18000,53700,30300,121200,40000,9590,24200,9780,32500,39000,93500,66900,34100,7290,9490,45500,9260,69600,55200,13200,68400,9110,28400,15000,44400,15500,26300,77100,18350,30600,43600,49500,37700,99100,171100,23200,7000,8940,42400,42900,40700,3580,9860,13200,7990,10150,37900,335300,28300,26000,42800,3790,7220,20500,14750,17850,119300,17550,29400,12750,51100,{"$f":"SUM(C6:BS6)","v":3879310},null,1218300,44100,75100,33700,78200,52300,90900,44200,1100,7560,52500,66200,90000,49800,73000,66400,97300,64600,70400,69100,38900,52900]
[null,{"$f":"B6+1","v":2002},56600,71300,18100,{"$f":"SUM(BW7:CA7)","v":291400},{"$f":"CB7+CC7+CG7","v":207200},{"$f":"SUM(CD7:CJ7)-CG7","v":282670},{"$f":"SUM(CK7:CQ7)","v":474600},26000,18050,55000,30400,124000,40600,9560,24000,9720,32700,39700,96000,67400,34200,7310,9470,45500,9190,70400,55500,13200,69000,9070,28100,14800,44300,15450,26300,77800,18250,30600,44300,49800,38100,99800,174400,23300,7050,8990,43200,43100,41200,3620,9830,13200,8100,10250,39000,340500,29600,26300,43100,3790,7230,20500,15200,19150,120200,17500,29300,12650,51500,3947200,null,1255800,45400,77300,36400,79300,53000,94000,44900,1080,7790,54100,68300,92700,51600,75400,68300,102200,66400,71800,71800,39800,54300]
["Dataset: Subnational population estimates (TA, SA2), by age and sex, at 30 June 1996-2019 (2020 boundaries)",{"$f":"B7+1","v":2003},56900,72700,18250,301100,213300,292800,490400,26200,18150,56300,30600,127100,41400,9490,23900,9750,33000,40600,99000,67900,34200,7290,9460,45800,9070,71100,55900,13200,69700,9090,28000,14750,44100,15450,26400,79000,18200,30600,45100,50300,38500,100300,178800,23300,7120,8990,44100,43600,41800,3660,9870,13250,8230,10350,40200,347600,30900,26800,43300,3840,7280,20600,15700,20400,120900,17450,29400,12650,52100,4026540,null,1297600,46800,80100,38900,81100,54200,97200,45800,1050,8050,59100,70300,94400,52900,77300,69600,107200,68300,73300,75200,40800,56000]
[null,2004,57000,74100,18350,308600,217200,297970,502200,26400,18200,57300,30900,130000,42100,9410,23800,9740,33200,41400,101900,68100,34400,7230,9440,45800,8920,71900,56200,13200,70100,9150,27700,14500,43900,15350,26400,79900,18150,30600,45900,50500,38900,100900,182100,23300,7170,9020,45000,44000,42500,3700,9870,13300,8360,10550,41500,353200,32200,27200,43600,3860,7340,20600,16150,21800,121600,17400,29300,12600,52200,4086330,null,1326000,48200,82100,41200,82300,54800,99700,46600,1020,8150,63600,70900,94800,53000,77400,69400,111900,70000,74300,77500,41600,57500]
[null,2005,57200,75300,18450,314600,220500,301430,512500,26500,18250,58400,31100,132300,43000,9360,23600,9710,33300,42300,104600,68000,34300,7200,9330,45800,8800,72400,56500,13200,70400,9140,27400,14200,43800,15250,26600,80200,18100,30600,46700,50400,39200,101200,184500,23300,7200,9050,45500,44100,43000,3710,9870,13400,8490,10650,42800,357200,33400,27600,43700,3880,7340,20600,16550,22900,122000,17300,29200,12500,52000,4132860,null,1348900,49700,83700,43200,82900,55100,101600,47000,970,8160,66200,71900,95300,53200,77600,69500,115700,71100,75300,79600,42400,58900]
{"$rows_left_out":52}