{"text_format":"1","workbook":"xlsx","n_sheets":13,"sheets":["vba_refs","drop_col_ref","SCR Form","Stop Works Order","NNC","RAMM Data","Reference List","Auditor & RCA List","Road ID Lookup","TTM Company list","TTM Contractor List","Contractor list","Principal list"],"not_rendered":{"charts":0,"images":0,"macros":1,"external_links":0,"defined_names":147,"comments":0,"pivot_tables":0},"unopened":[],"bounds":{"document_bytes":16777216,"sheet_cells":100000,"rows_first":2000,"rows_last":500,"rows_between":2000,"halvings":0,"cell_chars":16384,"cell_head_chars":4096},"cells_cut":0,"cells_raw":0,"read":"whole","date_system":"1900"}

{"sheet":"vba_refs","index":0,"n_rows":81,"n_cols":10,"rows_kept":81,"cut":false,"hidden":true,"merged":[]}
["Range Names","RAMM Data Names","drop_col","data_row","Inputs","Format","RAMM Input"]
["sp_address","sp_address",{"$f":"VLOOKUP(MATCH($B2,'RAMM Data'!$1:$1,0),drop_col_ref!$A:$B,2,0)","v":"A"},{"$f":"ROW()","v":2},{"$f":"IF(INDIRECT(A2)=0,\"\",INDIRECT(A2))","v":{"$error":"#N/A"}},9,{"$f":"SUBSTITUTE(SUBSTITUTE(E2,\",\",\" -\"),\"/\",\"-\")","v":{"$error":"#N/A"}},null,null,"vba_date"]
["car_app_no","car_app_no",{"$f":"VLOOKUP(MATCH($B3,'RAMM Data'!$1:$1,0),drop_col_ref!$A:$B,2,0)","v":"D"},{"$f":"ROW()","v":3},"",0,{"$f":"IF(E3 = \"N/A\", \"NA\",E3)","v":""},null,null,"vba_time"]
["ttm_level","ttm_level",{"$f":"VLOOKUP(MATCH($B4,'RAMM Data'!$1:$1,0),drop_col_ref!$A:$B,2,0)","v":"C"},{"$f":"ROW()","v":4},"",0,{"$f":"E4","v":""}]
["vba_date","date",{"$f":"VLOOKUP(MATCH($B5,'RAMM Data'!$1:$1,0),drop_col_ref!$A:$B,2,0)","v":"E"},{"$f":"ROW()","v":5},"",1,""]
["road_id","road_id",{"$f":"VLOOKUP(MATCH($B6,'RAMM Data'!$1:$1,0),drop_col_ref!$A:$B,2,0)","v":"F"},{"$f":"ROW()","v":6},"",0,""]
["vba_time","time",{"$f":"VLOOKUP(MATCH($B7,'RAMM Data'!$1:$1,0),drop_col_ref!$A:$B,2,0)","v":"G"},{"$f":"ROW()","v":7},"",2,""]
["activ_desc","activ_desc",{"$f":"VLOOKUP(MATCH($B8,'RAMM Data'!$1:$1,0),drop_col_ref!$A:$B,2,0)","v":"H"},{"$f":"ROW()","v":8},"",0,""]
["crm_callout","crm_callout",{"$f":"VLOOKUP(MATCH($B9,'RAMM Data'!$1:$1,0),drop_col_ref!$A:$B,2,0)","v":"I"},{"$f":"ROW()","v":9},"",0,{"$f":"IF(E9=\"y\", TRUE, FALSE)","v":false}]
["ttm_method","ttm_method",{"$f":"VLOOKUP(MATCH($B10,'RAMM Data'!$1:$1,0),drop_col_ref!$A:$B,2,0)","v":"K"},{"$f":"ROW()","v":10},{"$f":"IF(INDIRECT(A10)=0,\"\",INDIRECT(A10))","v":""},0,{"$f":"VLOOKUP(E10,'Reference List'!$N:$O,2,FALSE)","v":{"$error":"#N/A"}}]
["ttm_contractor","ttm_contractor",{"$f":"VLOOKUP(MATCH($B11,'RAMM Data'!$1:$1,0),drop_col_ref!$A:$B,2,0)","v":"L"},{"$f":"ROW()","v":11},"",0,{"$f":"VLOOKUP(E11,'TTM Contractor List'!$A:$B,2,FALSE)","v":{"$error":"#N/A"}}]
["ttm_main","main_contractor",{"$f":"VLOOKUP(MATCH($B12,'RAMM Data'!$1:$1,0),drop_col_ref!$A:$B,2,0)","v":"N"},{"$f":"ROW()","v":12},"",0,{"$f":"VLOOKUP(E12,'Contractor list'!A:B,2,FALSE)","v":{"$error":"#N/A"}}]
["client_principal","client_principal",{"$f":"VLOOKUP(MATCH($B13,'RAMM Data'!$1:$1,0),drop_col_ref!$A:$B,2,0)","v":"O"},{"$f":"ROW()","v":13},"",0,{"$f":"VLOOKUP(E13,'Principal list'!A:B,2,FALSE)","v":{"$error":"#N/A"}}]
["added_on","added_on",{"$f":"VLOOKUP(MATCH($B14,'RAMM Data'!$1:$1,0),drop_col_ref!$A:$B,2,0)","v":"P"},{"$f":"ROW()","v":14},{"$f":"TODAY()","v":"2017-09-21"},1,{"$f":"E14","v":"2017-09-21"}]
["auditor_name","added_by",{"$f":"VLOOKUP(MATCH($B15,'RAMM Data'!$1:$1,0),drop_col_ref!$A:$B,2,0)","v":"Q"},{"$f":"ROW()","v":15},{"$f":"IF(INDIRECT(A15)=0,\"\",INDIRECT(A15))","v":"Stuart Fraser"},9,{"$f":"IFERROR(VLOOKUP(E15,'Auditor & RCA List'!A:B,2,FALSE),\"Missing User\")","v":"StuartF"}]
["active_site","active_site",{"$f":"VLOOKUP(MATCH($B16,'RAMM Data'!$1:$1,0),drop_col_ref!$A:$B,2,0)","v":"J"},{"$f":"ROW()","v":16},"",0,{"$f":"IF(E16=\"Attended\", TRUE, FALSE)","v":false}]
["A_1","a1_tally_box",{"$f":"VLOOKUP(MATCH($B17,'RAMM Data'!$1:$1,0),drop_col_ref!$A:$B,2,0)","v":"R"},{"$f":"ROW()","v":17},"",0,{"$f":"IF(E17 = \"\",0,E17)","v":0}]
["A_2","a2_tally_box",{"$f":"VLOOKUP(MATCH($B18,'RAMM Data'!$1:$1,0),drop_col_ref!$A:$B,2,0)","v":"S"},{"$f":"ROW()","v":18},"",0,{"$f":"IF(E18 = \"\",0,E18)","v":0}]
["A_3","a3_tally_box",{"$f":"VLOOKUP(MATCH($B19,'RAMM Data'!$1:$1,0),drop_col_ref!$A:$B,2,0)","v":"T"},{"$f":"ROW()","v":19},"",0,0]
["A_4","a4_tally_box",{"$f":"VLOOKUP(MATCH($B20,'RAMM Data'!$1:$1,0),drop_col_ref!$A:$B,2,0)","v":"U"},{"$f":"ROW()","v":20},"",0,0]
["A_5","a5_tally_box",{"$f":"VLOOKUP(MATCH($B21,'RAMM Data'!$1:$1,0),drop_col_ref!$A:$B,2,0)","v":"V"},{"$f":"ROW()","v":21},"",0,0]
["A_6","a6_tally_box",{"$f":"VLOOKUP(MATCH($B22,'RAMM Data'!$1:$1,0),drop_col_ref!$A:$B,2,0)","v":"W"},{"$f":"ROW()","v":22},"",0,0]
["A_7","a7_tally_box",{"$f":"VLOOKUP(MATCH($B23,'RAMM Data'!$1:$1,0),drop_col_ref!$A:$B,2,0)","v":"X"},{"$f":"ROW()","v":23},"",0,0]
["A_8","a8_tally_box",{"$f":"VLOOKUP(MATCH($B24,'RAMM Data'!$1:$1,0),drop_col_ref!$A:$B,2,0)","v":"Y"},{"$f":"ROW()","v":24},"",0,0]
["B_1","b1_tally_box",{"$f":"VLOOKUP(MATCH($B25,'RAMM Data'!$1:$1,0),drop_col_ref!$A:$B,2,0)","v":"Z"},{"$f":"ROW()","v":25},"",0,0]
["B_2","b2_tally_box",{"$f":"VLOOKUP(MATCH($B26,'RAMM Data'!$1:$1,0),drop_col_ref!$A:$B,2,0)","v":"AA"},{"$f":"ROW()","v":26},"",0,0]
["B_3","b3_tally_box",{"$f":"VLOOKUP(MATCH($B27,'RAMM Data'!$1:$1,0),drop_col_ref!$A:$B,2,0)","v":"AB"},{"$f":"ROW()","v":27},"",0,0]
["B_4","b5_tally_box",{"$f":"VLOOKUP(MATCH($B28,'RAMM Data'!$1:$1,0),drop_col_ref!$A:$B,2,0)","v":"AC"},{"$f":"ROW()","v":28},"",0,0]
["B_5","b4_tally_box",{"$f":"VLOOKUP(MATCH($B29,'RAMM Data'!$1:$1,0),drop_col_ref!$A:$B,2,0)","v":"AD"},{"$f":"ROW()","v":29},"",0,0]
["C_1","c1_tally_box",{"$f":"VLOOKUP(MATCH($B30,'RAMM Data'!$1:$1,0),drop_col_ref!$A:$B,2,0)","v":"AE"},{"$f":"ROW()","v":30},"",0,0]
{"$rows_left_out":52}
{"sheet":"drop_col_ref","index":1,"n_rows":130,"n_cols":2,"rows_kept":130,"cut":false,"hidden":true,"merged":[]}
[1,"A"]
[2,"B"]
[3,"C"]
[4,"D"]
[5,"E"]
[6,"F"]
[7,"G"]
[8,"H"]
[9,"I"]
[10,"J"]
[11,"K"]
[12,"L"]
[13,"M"]
[14,"N"]
[15,"O"]
[16,"P"]
[17,"Q"]
[18,"R"]
[19,"S"]
[20,"T"]
[21,"U"]
[22,"V"]
[23,"W"]
[24,"X"]
[25,"Y"]
[26,"Z"]
[27,{"$f":"$B$1&B1","v":"AA"}]
[28,"AB"]
[29,"AC"]
[30,"AD"]
{"$rows_left_out":101}
{"sheet":"SCR Form","index":2,"n_rows":60,"n_cols":17,"rows_kept":60,"cut":false,"hidden":false,"merged":[[6,9,6,10],[6,11,6,12],[3,7,3,8],[3,9,3,12],[7,0,7,1],[7,7,7,8],[7,9,7,12],[5,11,5,12],[5,9,5,10],[5,0,5,1],[5,7,5,8],[6,0,6,1],[6,2,6,3],[5,2,5,3],[7,2,7,5],[6,7,6,8],[48,0,51,12],[53,0,53,5],[42,0,45,12],[47,0,47,3],[47,6,47,12],[40,0,41,2],[33,7,33,12],[28,8,28,11],[29,8,29,11],[30,8,30,11],[31,8,31,11],[36,7,36,12],[37,7,37,9],[37,10,37,12],[32,7,32,12],[34,7,35,12],[40,6,40,9],[41,6,41,9],[28,0,28,5],[54,0,54,1],[54,2,54,5],[54,7,54,8],[54,9,54,11],[53,7,53,8],[53,9,53,12],[59,0,60,12],[55,0,55,1],[55,2,55,5],[55,7,55,8],[55,9,55,12],[56,0,56,1],[56,2,56,3],[56,7,56,8],[56,9,56,10],[57,0,57,1],[57,2,57,5],[57,7,57,8],[57,9,57,12],[0,0,0,10],[2,0,2,5],[2,7,2,12],[4,0,4,1],[4,2,4,5],[4,7,4,8],[4,9,4,12],[3,0,3,1],[3,2,3,5],[9,0,9,2],[17,15,17,16],[20,15,20,16],[30,15,31,15],[18,0,18,5],[9,7,9,9],[25,0,25,5],[11,16,12,16],[30,16,31,16],[21,15,25,16],[11,15,12,15],[41,13,42,14],[43,15,43,16],[43,13,45,14],[27,9,27,11],[23,7,23,12],[25,8,25,11],[26,8,26,11],[24,8,24,11],[37,15,40,16],[38,7,38,8],[38,10,38,12],[36,15,36,16],[32,15,33,16]]}
["TTM SITE CONDITION RATING FORM",null,null,null,null,null,null,null,null,null,null,"Logo to go here",null,null,null,"V48.3N"]
[]
["SITE DETAILS",null,null,null,null,null,null,"OPERATIONAL DETAILS"]
["RCA",null,"PCC",null,null,null,null,"Activity description"]
["Suburb",null,{"$f":"VLOOKUP(road_id,'Road ID Lookup'!A:C,3,FALSE)","v":{"$error":"#N/A"}},null,null,null,null,"TTM method"]
["Road name",null,{"$f":"VLOOKUP(road_id,'Road ID Lookup'!A:B,2,FALSE)","v":{"$error":"#N/A"}},null,"Road ID",null,null,null,null,"TTM Contractor",null,"Contractor - working space"]
["CAR / WAP number",null,null,null,"TTM level",null,null,"Contractor (TTM/Working space)"]
["Date / Time",null,null,null,null,null,null,"Client / Principal"]
[]
["SIGNS",null,null,"Weighting","Tally Box","Total",null,"MISCELLANEOUS",null,null,"Weighting","Tally Box","Total"]
["A1","Missing ","Sign",5,null,{"$f":"E11*D11","v":0},null,"E1","Working in live lanes","Individual",20,null,{"$f":"L11*K11","v":0}]
["A2","Position","Sign",2,null,{"$f":"E12*D12","v":0},null,"E2","Missing or ineffective controller","Individual",20,null,0,null,null,"Type of Audit/ Review Undertaken","Full Audit/Review"]
["A3","Not visible/fallen over","Sign",5,null,{"$f":"E13*D13","v":0},null,"E3","Safety zone compromised","Individual",10,null,0]
["A4","Wrong sign","Sign",5,null,0,null,"E4","High visibility garment not acceptable","Individual",5,null,0]
["A5","Condition unacceptable","Sign",4,null,0,null,"E5","Marginal surface condition (carriageway only)","Occasion",15,null,0,null,null,"Audit ID",{"$f":"IF(Q12=\"Full Audit/Review\",\"\",IF(Q12=\"Audit/Partial Review or Short Form\",2,IF(Q12=\"TMP Only\",3,IF(Q12=\"CAR Only\",4,IF(Q12=\"On-Site Record Only\",5,IF(Q12=\"STMS Only\",6,IF(Q12=\"Other Checks Only\",1,IF(Q12=\"TTM Only\",7,IF(Q12=\"TSL Audit/Review\",8,\"Please Select the Correct Review Type\")))))))))","v":""}]
["A6","Permanent sign","Sign",5,null,0,null,"E6","Unacceptable surface condition (peds, cyclists or carriageway)","Occasion",30,null,{"$f":"L16*K16","v":0}]
["A7","Unapproved sign used / too small","Sign",4,null,0,null,"E7","Barrier defects (missing or incorrect components)","Component",10,null,0,null,null,"TOTAL SCR",{"$f":"SUM(F11:F18,F20:F24,F27:F28,F30:F39,M11:M23)","v":0}]
["A8","Non-compliant support / sign too low","Support",2,null,0,null,"E8","Unsafe or redundant TTM","Equipment",5,null,0,null,null,"Note that this score does not appear on the final printout"]
["MOBILE & SEMI STATIC",null,null,null,null,null,null,"E9","VMS message incorrect or inappropriate","VMS",15,null,{"$f":"L19*K19","v":0}]
["B1","Tail pilot vehicle / AWVMS omitted or incorrect location","Vehicle",30,null,{"$f":"E20*D20","v":0},null,"E10","Flashing beacons / indicator lights not used or ineffective","Vehicle",3,null,{"$f":"L20*K20","v":0}]
["B2","Lead pilot vehicle omitted or incorrect location","Vehicle",20,null,{"$f":"E21*D21","v":0},null,"E11","Parking / stopping features not relocated","Feature",5,null,{"$f":"L21*K21","v":0},null,null,"SCR OVERRIDE"]
["B3","Shadow vehicle omitted or incorrect location","Vehicle",26,null,{"$f":"E22*D22","v":0},null,"E12","Unsafe and illegal parking of plant/equip.","Feature",20,null,{"$f":"L22*K22","v":0},null,null,"This function can only be used if certain criteria below are not met (and only if required):"]
["B4","TMA missing or non compliant","TMA",26,null,{"$f":"E23*D23","v":0},null,"E13","Marginal items (signs, delineators, Hi vis garments) ","Feature",1,null,{"$f":"L23*K23","v":0}]
["B5","AWVMS/arrowboard non compliant","Vehicle",26,null,{"$f":"E24*D24","v":0},null,"OTHER WORKSITE ASPECTS"]
[null,null,null,null,null,null,null,"G1","QUALIFIED PERSON ON SITE  [REFER TO A5 OF COPTTM]"]
["PEDESTRIANS / CYCLISTS ",null,null,null,null,null,null,"G2","TSL APPROPRIATE [REFER TO C4 OF COPTTM]"]
["C1","Inadequate provision for pedestrians","Feature",10,null,{"$f":"D27*E27","v":0},null,"G3","ROAD USER FLOW ACCEPTABLE",null,null,null,null,null,null,"Any single SCR column with a weighting of 20 or over is blank?",{"$f":"IF(SUM(E20:E24)+E30+E38+L16+L22+L12+L11>0,\"N\",\"Y\")","v":"Y"}]
["C2","Inadequate provision for cyclists","Feature",10,null,{"$f":"D28*E28","v":0},null,"G4","ON-SITE RECORD","[FORM MUST INCLUDE STMS AUTHORITY, 2 HOURLY CHECKS AND TSL DETAILS]",null,null,null,null,null,"The site passes all areas of Key worksite aspects? [NOT G4]",{"$f":"IF(OR(M25=\"N\",M26=\"N\",M27=\"N\",M29=\"N\",M30=\"N\",M31=\"N\",M32=\"N\"),\"N\",\"Y\")","v":"Y"}]
["DELINEATION",null,null,null,null,null,null,"G5","TMP APPROVED?",null,null,null,null,null,null,"The SCR does not exceed 150 points?",{"$f":"IF(Q17>150,\"N\",\"Y\")","v":"Y"}]
["D1","Missing or ineffective taper","Leading taper",26,null,{"$f":"D30*E30","v":0},null,"G6","APPROVED TMP SIGHTED?",null,null,null,null,null,null,"Could the SCR Change?",{"$f":"IF(AND(Q17>50,OR(M42=\"N\",Q27=\"N\", Q28=\"N\",Q29=\"N\")),\"Y\",IF(OR(M42=\"SELECT ONE\",M42=\"\"),\"PLEASE COMPLETE OVERRIDE CHECKS\",\"N\"))","v":"PLEASE COMPLETE OVERRIDE CHECKS"}]
{"$rows_left_out":31}
{"sheet":"Stop Works Order","index":3,"n_rows":65,"n_cols":11,"rows_kept":65,"cut":false,"hidden":false,"merged":[[64,1,64,3],[64,4,64,11],[3,1,5,6],[12,1,13,3],[14,1,15,3],[16,1,17,3],[12,4,13,11],[14,4,15,11],[55,1,59,11],[61,1,61,3],[61,4,61,11],[62,1,62,3],[62,4,62,11],[63,1,63,3],[63,4,63,11],[46,4,46,11],[47,4,47,9],[47,10,47,11],[50,1,53,11],[46,1,46,3],[47,1,47,3],[44,1,44,3],[45,1,45,3],[43,4,43,11],[44,4,44,11],[45,4,45,11],[8,1,11,11],[19,1,20,11],[21,1,33,11],[36,1,42,11],[43,1,43,3],[16,4,17,11]]}
[]
[]
[]
[null,"STOP WORK ORDER"]
[]
[]
[]
[]
[null,"Pursuant to the authority and responsibilities of the RCA  as stated or assumed in any of the Local Government Act, Health and Safety in Employment Act, and various Utility Acts, an order is hereby given to stop work on the following job/s:"]
[]
[]
[]
[null,"CAR NUMBER:",null,null,{"$f":"IF('SCR Form'!Q42=\"YES\",'SCR Form'!C7,\"\")","v":""}]
[]
[null,"ROAD NAME:",null,null,{"$f":"IF('SCR Form'!Q42=\"YES\",'SCR Form'!C6,\"\")","v":""}]
[]
[null,"SPECIFIC LOCATION:",null,null,{"$f":"IF('SCR Form'!Q42=\"YES\",'SCR Form'!C5,\"\")","v":""}]
[]
[]
[null,"The reason for this is that the Work does not comply with the following requirements:"]
[]
[null,{"$f":"IF('SCR Form'!Q42=\"YES\",'SCR Form'!A43,\"\")","v":""}]
[]
[]
[]
[]
[]
[]
[]
[]
{"$rows_left_out":36}
{"sheet":"NNC","index":4,"n_rows":43,"n_cols":12,"rows_kept":43,"cut":false,"hidden":false,"merged":[[1,0,2,5],[3,0,5,5],[1,7,5,9],[12,1,12,9],[10,0,10,1],[10,2,10,9],[28,0,28,9],[29,0,29,9],[14,0,14,9],[15,0,15,9],[16,0,16,9],[17,0,17,9],[22,0,22,9],[23,0,23,9],[24,0,24,9],[18,0,18,9],[19,0,19,9],[20,0,20,9],[21,0,21,9],[40,0,40,1],[40,2,40,4],[30,0,30,9],[35,0,35,9],[36,0,36,9],[38,0,38,9],[40,6,40,9],[37,0,37,9],[39,0,39,9],[31,0,31,9],[33,0,33,9],[34,0,34,9],[32,0,32,9],[41,0,41,1],[41,2,41,4],[42,0,42,4],[41,6,41,9],[42,6,42,9],[7,11,8,14],[9,11,9,14],[7,2,7,9],[27,0,27,9],[25,0,25,9],[26,0,26,9],[8,7,8,9],[9,7,9,9],[7,0,7,1],[8,0,8,1],[9,0,9,1],[8,2,8,5],[9,2,9,5],[11,0,11,9],[13,0,13,9]]}
[]
["Temporary Traffic Management (TTM)",null,null,null,null,null,null,"Logo and address to go here"]
[]
["Notice of Non-Conformance"]
[]
[]
[]
["Date/Time of audit",null,{"$f":"IF(L10=\"YES\",'SCR Form'!C8,\"\")","v":""},null,null,null,null,null,null,null,null,"Do you need to issue an NNC for this audit/review?"]
["Audited by",null,{"$f":"IF(L10=\"YES\",'SCR Form'!C56:F56,\"\")","v":""},null,null,null,"of "]
["Contractor",null,"ENTER DETAILS HERE",null,null,null,"CAR number",{"$f":"IF(L10=\"YES\",'SCR Form'!C7,\"\")","v":""}]
["STMS/Responsible parties:"]
["This notice is to inform you that the temporary traffic management at the following worksite is not in accordance with accepted traffic management practices:"]
["Roads:",{"$f":"IF(L10=\"YES\",CONCATENATE('SCR Form'!C5,\",\",\" \",'SCR Form'!C6),\"\")","v":""}]
["This notice of non-conformance is issued in respect of the following temporary traffic management defects: (delete those that do not apply)"]
["·         STMS nominated in TMP not on worksite"]
["·         TC nominated in TMP and briefed by STMS (level LV and level 1) not on worksite"]
["·         Copy of signed and approved TMP not on worksite"]
["·         Safety audit of temporary traffic management site condition rating ‘Unacceptable’ OR 'Dangerous'"]
["·         Temporary traffic management not in accordance with the CoPTTM"]
["·         Inappropriate or excessive TSL"]
["The details of non-conforming temporary traffic management are:"]
["·    "]
["·    "]
["·    "]
["·    "]
["·    "]
["·    "]
["The actions required to be implemented are to:"]
["Identify and investigate the root causes of the non-conforming temporary traffic management identified in the SCR and this NNC to find a permanent cure to prevent the problem recurring."]
["Implement a Corrective Action Plan to:"]
{"$rows_left_out":14}
{"sheet":"RAMM Data","index":5,"n_rows":1,"n_cols":82,"rows_kept":1,"cut":false,"hidden":false,"merged":[]}
["sp_address","suburb","ttm_level","car_app_no","date","road_id","time","activ_desc","crm_callout","active_site","ttm_method","ttm_contractor","ttm_contractor_oth","main_contractor","client_principal","added_on","added_by","a1_tally_box","a2_tally_box","a3_tally_box","a4_tally_box","a5_tally_box","a6_tally_box","a7_tally_box","a8_tally_box","b1_tally_box","b2_tally_box","b3_tally_box","b5_tally_box","b4_tally_box","c1_tally_box","c2_tally_box","d1_tally_box","d2_tally_box","d3_tally_box","d4_tally_box","d5_tally_box","d6_tally_box","d7_tally_box","d8_tally_box","d9_tally_box","d10_tally_box","e1_tally_box","e2_tally_box","e3_tally_box","e4_tally_box","e5_tally_box","e6_tally_box","e7_tally_box","e8_tally_box","e9_tally_box","e10_tally_box","e11_tally_box","e12_tally_box","e13_tally_box","g1_other_checks","g2_other_checks","g3_other_checks","g4_other_checks","g5_other_checks","g6_other_checks","g7_other_checks","g8_other_checks","g9_other_checks","g10_other_checks","actions_stms","tmp_design_issue","site_safe","site_close_by","stop_works_issue","key_points","actions_to_take","auditor_name","auditor_quali","auditor_contact_no","aud_nzta_id_no","stms_name","stms_qualification","stms_contact_no","stms_nzta_id_no","audit_id","planned"]

{"sheet":"Reference List","index":6,"n_rows":22,"n_cols":25,"rows_kept":22,"cut":false,"hidden":true,"merged":[]}
["TTM Level",0,null,"Site Activity Ceased by",null,"Low Risk?",null,"Y / N / NA",null,"Notifications",null,"Actions planned by STMS, Fix site?",null,"TTM Method",null,null,"Site Activity Status",null,"Audit status",null,null,"Type of Audit/Review","Audit ID",null,"Qualifications"]
["LV",5,null,"STMS","STMS","Y",null,"Y",null,"Y",null,"Y",null,"Berm Closure",13,null,"Attended",null,"Planned","P",null,"Full Audit/Review",null,null,"TC"]
[1,null,null,"Auditor/Reviewer","Auditor","N",null,"N",null,"N",null,"N",null,"Bus/Transit Lane Closure",12,null,"Unattended",null,"Unplanned","U",null,"Audit/Partial Review or Short Form",2,null,"L1 STMS"]
[2,null,null,"Non STMS","Non STMS",null,null,"N/A",null,"NA",null,"N/A",null,"Contraflow",8,null,null,null,null,null,null,"TMP Only",3,null,"L2/3 NP"]
["2LS",null,null,"RCA Representative","NA",null,null,null,null,null,null,null,null,"Cycle Lane Closure",19,null,null,null,null,null,null,"CAR Only",4,null,"L2/3 P"]
[3,null,null,"Police","Police",null,null,null,null,null,null,null,null,"Footpath Closure",11,null,null,null,null,null,null,"On-Site Record Only",5,null,"L1 T"]
[null,null,null,"Fire Service","Fire",null,null,null,null,null,null,null,null,"Inspection",18,null,null,null,null,null,null,"STMS Only",6,null,"L2/3 NP / L1 T"]
[null,null,null,"Engineer","Engineer",null,null,null,null,null,null,null,null,"Lane Closure",10,null,null,null,null,null,null,"Other Checks Only",1,null,"L2/3 P / L1 T"]
[null,null,null,"WorkSafe","Worksafe",null,null,null,null,null,null,null,null,"Lane Shift",23,null,null,null,null,null,null,"TTM Only",7,null,"TCI"]
[null,null,null,"Civil Defence","Defence",null,null,null,null,null,null,null,null,"Mobile Closure",15,null,null,null,null,null,null,"TSL Audit/Review",8,null,"KCTL"]
[null,null,null,"Not Applicable","NA",null,null,null,null,null,null,null,null,"Nothing",22,null,null,null,null,null,null,null,null,null,"NONE"]
[null,null,null,null,null,null,null,null,null,null,null,null,null,"Partial Road Closure",7,null,null,null,null,null,null,null,null,null,"Assessor"]
[null,null,null,null,null,null,null,null,null,null,null,null,null,"Pilot Vehicle Static",25]
[null,null,null,null,null,null,null,null,null,null,null,null,null,"Priority Control",14]
[null,null,null,null,null,null,null,null,null,null,null,null,null,"Road Closure",5]
[null,null,null,null,null,null,null,null,null,null,null,null,null,"Semi-Static Closure",16]
[null,null,null,null,null,null,null,null,null,null,null,null,null,"Shoulder Closure",6]
[null,null,null,null,null,null,null,null,null,null,null,null,null,"Special Mobile",17]
[null,null,null,null,null,null,null,null,null,null,null,null,null,"Stop/Go",9]
[null,null,null,null,null,null,null,null,null,null,null,null,null,"Temporary Signals",20]
[null,null,null,null,null,null,null,null,null,null,null,null,null,"TSL",21]
[null,null,null,null,null,null,null,null,null,null,null,null,null,"Warning Only",24]

{"sheet":"Auditor & RCA List","index":7,"n_rows":6,"n_cols":6,"rows_kept":6,"cut":false,"hidden":false,"merged":[]}
["Auditor/Reviewer","RAMM ID",null,null,null,"RCA List"]
["Stuart Fraser","StuartF",null,null,null,"LHCC"]
["Tony Stella","TonyS",null,null,null,"UHCC"]
["Neil Greaves","NeilG",null,null,null,"PCC"]
[null,null,null,null,null,"WCC"]
[null,null,null,null,null,"NZTA"]

{"sheet":"Road ID Lookup","index":8,"n_rows":15789,"n_cols":3,"rows_kept":15789,"cut":false,"hidden":false,"merged":[]}
["Road ID","Road Name","Contract Region"]
[70513,"A.RENALL RD","South Rural"]
[53216,"AARONVILLE WAY","South East Urban"]
[50660,"AARTS AVE","South West Urban"]
[35651,"ABATTOIR LANE (PVT)","Central East"]
[30002,"ABBEY ST","Central"]
[22001,"ABBEYGATE ST","North Urban West"]
[41154,"ABBOTLEIGH AVE","West"]
[20747,"ABBOTSFORD TCE","North Urban East"]
[30003,"ABBOTTS WAY","Central East"]
[15266,"ABBOTTS WAY ACWAY/WAIATARUA RES LINK CYWAY","Central East"]
[33119,"ABBOTTS WAY HLA (#2 - #36)","Central East"]
[15265,"ABBOTTS WAY/GRAND DR CYWAY","Central East"]
[35808,"ABBOTTS/CELTIC WWAY (RP1158 RHS)","Central East"]
[70001,"ABBY CLOSE","South Rural"]
[11197,"ABEL RD","North Rural"]
[40186,"ABEL TASMAN AVE","West"]
[48175,"ABEL TASMAN AVE WWAY","West"]
[50661,"ABELIA PL","South West Urban"]
[50662,"ABERCROMBIE ST","South East Urban"]
[53590,"ABERDEEN CRES","South West Urban"]
[15433,"ABERDEEN CRES LINK CYWAY (RP285)","South West Urban"]
[15755,"ABERDEEN CRES LINK CYWAY (RP660)","South West Urban"]
[15430,"ABERDEEN CRES/ALLERTON PL LOOP CYWAY","South West Urban"]
[15428,"ABERDEEN CRES/WATTLE DOWNS ESP RES CYWAY (RP30)","South West Urban"]
[20054,"ABERDEEN RD","North Urban East"]
[50663,"ABERFELDY AVE","South East Urban"]
[54537,"ABERFELDY/HIGHLAND PARK RAB","South East Urban"]
[30004,"ABERFOYLE ST","Central"]
[22963,"ABERLEY RD","North Urban West"]
{"$rows_left_out":15760}
{"sheet":"TTM Company list","index":9,"n_rows":160,"n_cols":2,"rows_kept":160,"cut":false,"hidden":false,"merged":[]}
["TTM Companies"]
[]
["(STMS / TTM employer)"]
["TTM Companies","Code"]
["Abernethy Contractors Ltd",138]
["ABO",124]
["Absolute Traffic Solutions Ltd",1]
["Action Traffic Control Ltd",2]
["APS",125]
["Arrow International (NZ) Ltd",3]
["Asphalt & Repairs Ltd",70]
["Asplundh",4]
["Auckland Council",5]
["Auckland Motorway Alliance",6]
["Auckland Traffic Ltd",44]
["Auckland Transport",71]
["AWF Ltd",126]
["Beesafe Traffic Control Ltd",7]
["Best Communications Ltd",143]
["Broadspectrum (New Zealand) Ltd",59]
["Bryce Traffic Solutions Ltd",8]
["C.S.R Ltd",73]
["Cablenet",75]
["CAM NZ Ltd",127]
["Camhut Ltd",9]
["CDS New Zealand Ltd.",72]
["CEW Ltd",10]
["Chevron Traffic Solutions Ltd",11]
["Chicane Traffic Control Ltd",65]
["Chorus",67]
{"$rows_left_out":131}
{"sheet":"TTM Contractor List","index":10,"n_rows":162,"n_cols":2,"rows_kept":162,"cut":false,"hidden":true,"merged":[]}
["TTM Contractor"]
[]
["(STMS / TTM employer)"]
["TTM Companies","Code"]
["Abernethy Contractors Ltd",138]
["ABO",124]
["Absolute Traffic Solutions Ltd",1]
["Action Traffic Control Ltd",2]
["APS",125]
["Arrow International (NZ) Ltd",3]
["Asphalt & Repairs Ltd",70]
["Asplundh",4]
["Auckland Council",5]
["Auckland Motorway Alliance",6]
["Auckland Traffic Ltd",44]
["Auckland Transport",71]
["AWF Ltd",126]
["Beesafe Traffic Control Ltd",7]
["Best Communications Ltd",143]
["Broadspectrum (New Zealand) Ltd",59]
["Bryce Traffic Solutions Ltd",8]
["C.S.R Ltd",73]
["Cablenet",75]
["CAM NZ Ltd",127]
["Camhut Ltd",9]
["CDS New Zealand Ltd.",72]
["CEW Ltd",10]
["Chevron Traffic Solutions Ltd",11]
["Chicane Traffic Control Ltd",65]
["Chorus",67]
{"$rows_left_out":133}
{"sheet":"Contractor list","index":11,"n_rows":203,"n_cols":2,"rows_kept":203,"cut":false,"hidden":false,"merged":[]}
["Contractors - working space"]
["(Note this is to be the main contractor)"]
["Contractors","Code"]
["A1 Civil Engineering & Construction Ltd",43]
["AAA Excavations & Drainage NZ Ltd",197]
["ASI Signage Ltd",51]
["Aadvark Contractors Ltd",190]
["Abernethy Contractors Ltd",45]
["Adshel",47]
["Advanced Drilling Ltd",171]
["All About Drains Ltd",189]
["Andrew Property Services",48]
["Arrow International",49]
["Aspec Construction",52]
["Asplundh",1]
["Auckland Civil",53]
["Auckland Council",2]
["Auckland Motorway Alliance",54]
["Auckland Transport",55]
["Basset Plumbing and Drainage Ltd",56]
["Best Communications Ltd",57]
["Blue Rock Civil",58]
["Bracewell Construction Ltd",59]
["Brian James Contracting Ltd",178]
["Broadspectrum (New Zealand) Ltd",36]
["Brosnan Construction Ltd",60]
["CAM NZ Ltd",99]
["CDS NZ Ltd",63]
["CL Drainage Limited",67]
["CMP Construction Ltd",68]
{"$rows_left_out":174}
{"sheet":"Principal list","index":12,"n_rows":18,"n_cols":2,"rows_kept":18,"cut":false,"hidden":false,"merged":[]}
["Standard Client / Principal Names"]
["(Private for non company principals)"]
["Principals","Code"]
["Auckland Council",1]
["Auckland Transport",2]
["Chorus",3]
["Counties Power Ltd",4]
["Housing NZ / Creating Communities Ltd",5]
["KiwiRail",6]
["NZTA",7]
["Panuku Development Auckland",89]
["Private",9]
["Transpower",81]
["Unknown",11]
["Vector Gas",12]
["Vector Power",13]
["Vodafone",14]
["WaterCare Services Ltd",15]