{"text_format":"1","workbook":"xlsx","n_sheets":13,"sheets":["vba_refs","drop_col_ref","SCR Form","Stop Works Order","NNC","RAMM Data","Reference List","Auditor & RCA List","Road ID Lookup","TTM Company list","TTM Contractor List","Contractor list","Principal list"],"not_rendered":{"charts":0,"images":0,"macros":1,"external_links":0,"defined_names":147,"comments":0,"pivot_tables":0},"unopened":[],"bounds":{"document_bytes":16777216,"sheet_cells":100000,"rows_first":2000,"rows_last":500,"rows_between":2000,"halvings":0,"cell_chars":16384,"cell_head_chars":4096},"cells_cut":0,"cells_raw":0,"read":"whole","date_system":"1900"}

{"sheet":"vba_refs","index":0,"n_rows":81,"n_cols":10,"rows_kept":81,"cut":false,"hidden":true,"merged":[]}
["Range Names","RAMM Data Names","drop_col","data_row","Inputs","Format","RAMM Input"]
["sp_address","sp_address",{"$f":"VLOOKUP(MATCH($B2,'RAMM Data'!$1:$1,0),drop_col_ref!$A:$B,2,0)","v":"A"},{"$f":"ROW()","v":2},{"$f":"IF(INDIRECT(A2)=0,\"\",INDIRECT(A2))","v":{"$error":"#N/A"}},9,{"$f":"SUBSTITUTE(SUBSTITUTE(E2,\",\",\" -\"),\"/\",\"-\")","v":{"$error":"#N/A"}},null,null,"vba_date"]
["car_app_no","car_app_no",{"$f":"VLOOKUP(MATCH($B3,'RAMM Data'!$1:$1,0),drop_col_ref!$A:$B,2,0)","v":"D"},{"$f":"ROW()","v":3},"",0,{"$f":"IF(E3 = \"N/A\", \"NA\",E3)","v":""},null,null,"vba_time"]
["ttm_level","ttm_level",{"$f":"VLOOKUP(MATCH($B4,'RAMM Data'!$1:$1,0),drop_col_ref!$A:$B,2,0)","v":"C"},{"$f":"ROW()","v":4},"",0,{"$f":"E4","v":""}]
["vba_date","date",{"$f":"VLOOKUP(MATCH($B5,'RAMM Data'!$1:$1,0),drop_col_ref!$A:$B,2,0)","v":"E"},{"$f":"ROW()","v":5},"",1,""]
["road_id","road_id",{"$f":"VLOOKUP(MATCH($B6,'RAMM Data'!$1:$1,0),drop_col_ref!$A:$B,2,0)","v":"F"},{"$f":"ROW()","v":6},"",0,""]
["vba_time","time",{"$f":"VLOOKUP(MATCH($B7,'RAMM Data'!$1:$1,0),drop_col_ref!$A:$B,2,0)","v":"G"},{"$f":"ROW()","v":7},"",2,""]
["activ_desc","activ_desc",{"$f":"VLOOKUP(MATCH($B8,'RAMM Data'!$1:$1,0),drop_col_ref!$A:$B,2,0)","v":"H"},{"$f":"ROW()","v":8},"",0,""]
["crm_callout","crm_callout",{"$f":"VLOOKUP(MATCH($B9,'RAMM Data'!$1:$1,0),drop_col_ref!$A:$B,2,0)","v":"I"},{"$f":"ROW()","v":9},"",0,{"$f":"IF(E9=\"y\", TRUE, FALSE)","v":false}]
["ttm_method","ttm_method",{"$f":"VLOOKUP(MATCH($B10,'RAMM Data'!$1:$1,0),drop_col_ref!$A:$B,2,0)","v":"K"},{"$f":"ROW()","v":10},{"$f":"IF(INDIRECT(A10)=0,\"\",INDIRECT(A10))","v":""},0,{"$f":"VLOOKUP(E10,'Reference List'!$N:$O,2,FALSE)","v":{"$error":"#N/A"}}]
["ttm_contractor","ttm_contractor",{"$f":"VLOOKUP(MATCH($B11,'RAMM Data'!$1:$1,0),drop_col_ref!$A:$B,2,0)","v":"L"},{"$f":"ROW()","v":11},"",0,{"$f":"VLOOKUP(E11,'TTM Contractor List'!$A:$B,2,FALSE)","v":{"$error":"#N/A"}}]
["ttm_main","main_contractor",{"$f":"VLOOKUP(MATCH($B12,'RAMM Data'!$1:$1,0),drop_col_ref!$A:$B,2,0)","v":"N"},{"$f":"ROW()","v":12},"",0,{"$f":"VLOOKUP(E12,'Contractor list'!A:B,2,FALSE)","v":{"$error":"#N/A"}}]
["client_principal","client_principal",{"$f":"VLOOKUP(MATCH($B13,'RAMM Data'!$1:$1,0),drop_col_ref!$A:$B,2,0)","v":"O"},{"$f":"ROW()","v":13},"",0,{"$f":"VLOOKUP(E13,'Principal list'!A:B,2,FALSE)","v":{"$error":"#N/A"}}]
["added_on","added_on",{"$f":"VLOOKUP(MATCH($B14,'RAMM Data'!$1:$1,0),drop_col_ref!$A:$B,2,0)","v":"P"},{"$f":"ROW()","v":14},{"$f":"TODAY()","v":"2017-09-21"},1,{"$f":"E14","v":"2017-09-21"}]
["auditor_name","added_by",{"$f":"VLOOKUP(MATCH($B15,'RAMM Data'!$1:$1,0),drop_col_ref!$A:$B,2,0)","v":"Q"},{"$f":"ROW()","v":15},{"$f":"IF(INDIRECT(A15)=0,\"\",INDIRECT(A15))","v":"Stuart Fraser"},9,{"$f":"IFERROR(VLOOKUP(E15,'Auditor & RCA List'!A:B,2,FALSE),\"Missing User\")","v":"StuartF"}]
["active_site","active_site",{"$f":"VLOOKUP(MATCH($B16,'RAMM Data'!$1:$1,0),drop_col_ref!$A:$B,2,0)","v":"J"},{"$f":"ROW()","v":16},"",0,{"$f":"IF(E16=\"Attended\", TRUE, FALSE)","v":false}]
["A_1","a1_tally_box",{"$f":"VLOOKUP(MATCH($B17,'RAMM Data'!$1:$1,0),drop_col_ref!$A:$B,2,0)","v":"R"},{"$f":"ROW()","v":17},"",0,{"$f":"IF(E17 = \"\",0,E17)","v":0}]
["A_2","a2_tally_box",{"$f":"VLOOKUP(MATCH($B18,'RAMM Data'!$1:$1,0),drop_col_ref!$A:$B,2,0)","v":"S"},{"$f":"ROW()","v":18},"",0,{"$f":"IF(E18 = \"\",0,E18)","v":0}]
["A_3","a3_tally_box",{"$f":"VLOOKUP(MATCH($B19,'RAMM Data'!$1:$1,0),drop_col_ref!$A:$B,2,0)","v":"T"},{"$f":"ROW()","v":19},"",0,0]
["A_4","a4_tally_box",{"$f":"VLOOKUP(MATCH($B20,'RAMM Data'!$1:$1,0),drop_col_ref!$A:$B,2,0)","v":"U"},{"$f":"ROW()","v":20},"",0,0]
["A_5","a5_tally_box",{"$f":"VLOOKUP(MATCH($B21,'RAMM Data'!$1:$1,0),drop_col_ref!$A:$B,2,0)","v":"V"},{"$f":"ROW()","v":21},"",0,0]
["A_6","a6_tally_box",{"$f":"VLOOKUP(MATCH($B22,'RAMM Data'!$1:$1,0),drop_col_ref!$A:$B,2,0)","v":"W"},{"$f":"ROW()","v":22},"",0,0]
["A_7","a7_tally_box",{"$f":"VLOOKUP(MATCH($B23,'RAMM Data'!$1:$1,0),drop_col_ref!$A:$B,2,0)","v":"X"},{"$f":"ROW()","v":23},"",0,0]
["A_8","a8_tally_box",{"$f":"VLOOKUP(MATCH($B24,'RAMM Data'!$1:$1,0),drop_col_ref!$A:$B,2,0)","v":"Y"},{"$f":"ROW()","v":24},"",0,0]
["B_1","b1_tally_box",{"$f":"VLOOKUP(MATCH($B25,'RAMM Data'!$1:$1,0),drop_col_ref!$A:$B,2,0)","v":"Z"},{"$f":"ROW()","v":25},"",0,0]
["B_2","b2_tally_box",{"$f":"VLOOKUP(MATCH($B26,'RAMM Data'!$1:$1,0),drop_col_ref!$A:$B,2,0)","v":"AA"},{"$f":"ROW()","v":26},"",0,0]
["B_3","b3_tally_box",{"$f":"VLOOKUP(MATCH($B27,'RAMM Data'!$1:$1,0),drop_col_ref!$A:$B,2,0)","v":"AB"},{"$f":"ROW()","v":27},"",0,0]
["B_4","b5_tally_box",{"$f":"VLOOKUP(MATCH($B28,'RAMM Data'!$1:$1,0),drop_col_ref!$A:$B,2,0)","v":"AC"},{"$f":"ROW()","v":28},"",0,0]
["B_5","b4_tally_box",{"$f":"VLOOKUP(MATCH($B29,'RAMM Data'!$1:$1,0),drop_col_ref!$A:$B,2,0)","v":"AD"},{"$f":"ROW()","v":29},"",0,0]
["C_1","c1_tally_box",{"$f":"VLOOKUP(MATCH($B30,'RAMM Data'!$1:$1,0),drop_col_ref!$A:$B,2,0)","v":"AE"},{"$f":"ROW()","v":30},"",0,0]
["C_2","c2_tally_box",{"$f":"VLOOKUP(MATCH($B31,'RAMM Data'!$1:$1,0),drop_col_ref!$A:$B,2,0)","v":"AF"},{"$f":"ROW()","v":31},"",0,0]
["D_1","d1_tally_box",{"$f":"VLOOKUP(MATCH($B32,'RAMM Data'!$1:$1,0),drop_col_ref!$A:$B,2,0)","v":"AG"},{"$f":"ROW()","v":32},"",0,0]
["D_2","d2_tally_box",{"$f":"VLOOKUP(MATCH($B33,'RAMM Data'!$1:$1,0),drop_col_ref!$A:$B,2,0)","v":"AH"},{"$f":"ROW()","v":33},"",0,0]
["D_3","d3_tally_box",{"$f":"VLOOKUP(MATCH($B34,'RAMM Data'!$1:$1,0),drop_col_ref!$A:$B,2,0)","v":"AI"},{"$f":"ROW()","v":34},"",0,0]
["D_4","d4_tally_box",{"$f":"VLOOKUP(MATCH($B35,'RAMM Data'!$1:$1,0),drop_col_ref!$A:$B,2,0)","v":"AJ"},{"$f":"ROW()","v":35},"",0,0]
["D_5","d5_tally_box",{"$f":"VLOOKUP(MATCH($B36,'RAMM Data'!$1:$1,0),drop_col_ref!$A:$B,2,0)","v":"AK"},{"$f":"ROW()","v":36},"",0,0]
["D_6","d6_tally_box",{"$f":"VLOOKUP(MATCH($B37,'RAMM Data'!$1:$1,0),drop_col_ref!$A:$B,2,0)","v":"AL"},{"$f":"ROW()","v":37},"",0,0]
["D_7","d7_tally_box",{"$f":"VLOOKUP(MATCH($B38,'RAMM Data'!$1:$1,0),drop_col_ref!$A:$B,2,0)","v":"AM"},{"$f":"ROW()","v":38},"",0,0]
["D_8","d8_tally_box",{"$f":"VLOOKUP(MATCH($B39,'RAMM Data'!$1:$1,0),drop_col_ref!$A:$B,2,0)","v":"AN"},{"$f":"ROW()","v":39},"",0,0]
["D_9","d9_tally_box",{"$f":"VLOOKUP(MATCH($B40,'RAMM Data'!$1:$1,0),drop_col_ref!$A:$B,2,0)","v":"AO"},{"$f":"ROW()","v":40},"",0,0]
["D_10","d10_tally_box",{"$f":"VLOOKUP(MATCH($B41,'RAMM Data'!$1:$1,0),drop_col_ref!$A:$B,2,0)","v":"AP"},{"$f":"ROW()","v":41},"",0,0]
["E_1","e1_tally_box",{"$f":"VLOOKUP(MATCH($B42,'RAMM Data'!$1:$1,0),drop_col_ref!$A:$B,2,0)","v":"AQ"},{"$f":"ROW()","v":42},"",0,0]
["E_2","e2_tally_box",{"$f":"VLOOKUP(MATCH($B43,'RAMM Data'!$1:$1,0),drop_col_ref!$A:$B,2,0)","v":"AR"},{"$f":"ROW()","v":43},"",0,0]
["E_3","e3_tally_box",{"$f":"VLOOKUP(MATCH($B44,'RAMM Data'!$1:$1,0),drop_col_ref!$A:$B,2,0)","v":"AS"},{"$f":"ROW()","v":44},"",0,0]
["E_4","e4_tally_box",{"$f":"VLOOKUP(MATCH($B45,'RAMM Data'!$1:$1,0),drop_col_ref!$A:$B,2,0)","v":"AT"},{"$f":"ROW()","v":45},"",0,0]
["E_5","e5_tally_box",{"$f":"VLOOKUP(MATCH($B46,'RAMM Data'!$1:$1,0),drop_col_ref!$A:$B,2,0)","v":"AU"},{"$f":"ROW()","v":46},"",0,0]
["E_6","e6_tally_box",{"$f":"VLOOKUP(MATCH($B47,'RAMM Data'!$1:$1,0),drop_col_ref!$A:$B,2,0)","v":"AV"},{"$f":"ROW()","v":47},{"$f":"IF(INDIRECT(A47)=0,\"\",INDIRECT(A47))","v":""},0,0]
["E_7","e7_tally_box",{"$f":"VLOOKUP(MATCH($B48,'RAMM Data'!$1:$1,0),drop_col_ref!$A:$B,2,0)","v":"AW"},{"$f":"ROW()","v":48},"",0,0]
["E_8","e8_tally_box",{"$f":"VLOOKUP(MATCH($B49,'RAMM Data'!$1:$1,0),drop_col_ref!$A:$B,2,0)","v":"AX"},{"$f":"ROW()","v":49},"",0,0]
["E_9","e9_tally_box",{"$f":"VLOOKUP(MATCH($B50,'RAMM Data'!$1:$1,0),drop_col_ref!$A:$B,2,0)","v":"AY"},{"$f":"ROW()","v":50},"",0,0]
["E_10","e10_tally_box",{"$f":"VLOOKUP(MATCH($B51,'RAMM Data'!$1:$1,0),drop_col_ref!$A:$B,2,0)","v":"AZ"},{"$f":"ROW()","v":51},"",0,0]
["E_11","e11_tally_box",{"$f":"VLOOKUP(MATCH($B52,'RAMM Data'!$1:$1,0),drop_col_ref!$A:$B,2,0)","v":"BA"},{"$f":"ROW()","v":52},"",0,0]
["E_12","e12_tally_box",{"$f":"VLOOKUP(MATCH($B53,'RAMM Data'!$1:$1,0),drop_col_ref!$A:$B,2,0)","v":"BB"},{"$f":"ROW()","v":53},{"$f":"IF(INDIRECT(A53)=0,\"\",INDIRECT(A53))","v":""},0,{"$f":"IF(E53 = \"\",0,E53)","v":0}]
["E_13","e13_tally_box",{"$f":"VLOOKUP(MATCH($B54,'RAMM Data'!$1:$1,0),drop_col_ref!$A:$B,2,0)","v":"BC"},{"$f":"ROW()","v":54},"",0,0]
["G_1","g1_other_checks",{"$f":"VLOOKUP(MATCH($B55,'RAMM Data'!$1:$1,0),drop_col_ref!$A:$B,2,0)","v":"BD"},{"$f":"ROW()","v":55},"",0,{"$f":"VLOOKUP(E55,'Reference List'!$H$2:$J$4,2,FALSE)","v":{"$error":"#N/A"}}]
["G_2","g2_other_checks",{"$f":"VLOOKUP(MATCH($B56,'RAMM Data'!$1:$1,0),drop_col_ref!$A:$B,2,0)","v":"BE"},{"$f":"ROW()","v":56},"",0,{"$f":"VLOOKUP(E56,'Reference List'!$H$2:$J$4,2,FALSE)","v":{"$error":"#N/A"}}]
["G_3","g3_other_checks",{"$f":"VLOOKUP(MATCH($B57,'RAMM Data'!$1:$1,0),drop_col_ref!$A:$B,2,0)","v":"BF"},{"$f":"ROW()","v":57},"",0,{"$f":"VLOOKUP(E57,'Reference List'!$H$2:$J$4,2,FALSE)","v":{"$error":"#N/A"}}]
["G_4","g4_other_checks",{"$f":"VLOOKUP(MATCH($B58,'RAMM Data'!$1:$1,0),drop_col_ref!$A:$B,2,0)","v":"BG"},{"$f":"ROW()","v":58},"",0,{"$f":"VLOOKUP(E58,'Reference List'!$H$2:$J$4,2,FALSE)","v":{"$error":"#N/A"}}]
["G_5","g5_other_checks",{"$f":"VLOOKUP(MATCH($B59,'RAMM Data'!$1:$1,0),drop_col_ref!$A:$B,2,0)","v":"BH"},{"$f":"ROW()","v":59},"",0,{"$f":"VLOOKUP(E59,'Reference List'!$H$2:$J$4,2,FALSE)","v":{"$error":"#N/A"}}]
["G_6","g6_other_checks",{"$f":"VLOOKUP(MATCH($B60,'RAMM Data'!$1:$1,0),drop_col_ref!$A:$B,2,0)","v":"BI"},{"$f":"ROW()","v":60},"",0,{"$f":"VLOOKUP(E60,'Reference List'!$H$2:$J$4,2,FALSE)","v":{"$error":"#N/A"}}]
["G_7","g7_other_checks",{"$f":"VLOOKUP(MATCH($B61,'RAMM Data'!$1:$1,0),drop_col_ref!$A:$B,2,0)","v":"BJ"},{"$f":"ROW()","v":61},"",0,{"$f":"VLOOKUP(E61,'Reference List'!$H$2:$J$4,2,FALSE)","v":{"$error":"#N/A"}}]
["G_8","g8_other_checks",{"$f":"VLOOKUP(MATCH($B62,'RAMM Data'!$1:$1,0),drop_col_ref!$A:$B,2,0)","v":"BK"},{"$f":"ROW()","v":62},"",0,{"$f":"VLOOKUP(E62,'Reference List'!$H$2:$J$4,2,FALSE)","v":{"$error":"#N/A"}}]
["G_9","g9_other_checks",{"$f":"VLOOKUP(MATCH($B63,'RAMM Data'!$1:$1,0),drop_col_ref!$A:$B,2,0)","v":"BL"},{"$f":"ROW()","v":63},"",0,{"$f":"VLOOKUP(E63,'Reference List'!$H$2:$J$4,2,FALSE)","v":{"$error":"#N/A"}}]
["G_10","g10_other_checks",{"$f":"VLOOKUP(MATCH($B64,'RAMM Data'!$1:$1,0),drop_col_ref!$A:$B,2,0)","v":"BM"},{"$f":"ROW()","v":64},"",0,{"$f":"VLOOKUP(E64,'Reference List'!$H$2:$J$4,2,FALSE)","v":{"$error":"#N/A"}}]
["actions_stms","actions_stms",{"$f":"VLOOKUP(MATCH($B65,'RAMM Data'!$1:$1,0),drop_col_ref!$A:$B,2,0)","v":"BN"},{"$f":"ROW()","v":65},"",0,{"$f":"VLOOKUP(E65,'Reference List'!$H$2:$J$4,2,FALSE)","v":{"$error":"#N/A"}}]
["tmp_design_issue","tmp_design_issue",{"$f":"VLOOKUP(MATCH($B66,'RAMM Data'!$1:$1,0),drop_col_ref!$A:$B,2,0)","v":"BO"},{"$f":"ROW()","v":66},{"$f":"IF(INDIRECT(A66)=0,\"\",INDIRECT(A66))","v":""},0,{"$f":"VLOOKUP(E66,'Reference List'!$H$1:$J$3,2,FALSE)","v":{"$error":"#N/A"}}]
["site_safe","site_safe",{"$f":"VLOOKUP(MATCH($B67,'RAMM Data'!$1:$1,0),drop_col_ref!$A:$B,2,0)","v":"BP"},{"$f":"ROW()","v":67},"",0,{"$f":"IF(E67=\"y\", TRUE, FALSE)","v":false}]
["site_close_by","site_close_by",{"$f":"VLOOKUP(MATCH($B68,'RAMM Data'!$1:$1,0),drop_col_ref!$A:$B,2,0)","v":"BQ"},{"$f":"ROW()","v":68},"",0,{"$f":"VLOOKUP(E68,'Reference List'!$D:$E,2,FALSE)","v":{"$error":"#N/A"}}]
["stop_works_issue","stop_works_issue",{"$f":"VLOOKUP(MATCH($B69,'RAMM Data'!$1:$1,0),drop_col_ref!$A:$B,2,0)","v":"BR"},{"$f":"ROW()","v":69},"",0,{"$f":"IF(E69=\"Y\", TRUE, FALSE)","v":false}]
["key_points","key_points",{"$f":"VLOOKUP(MATCH($B70,'RAMM Data'!$1:$1,0),drop_col_ref!$A:$B,2,0)","v":"BS"},{"$f":"ROW()","v":70},"",0,{"$f":"SUBSTITUTE(E70,\",\",\"\")","v":""}]
["actions_to_take","actions_to_take",{"$f":"VLOOKUP(MATCH($B71,'RAMM Data'!$1:$1,0),drop_col_ref!$A:$B,2,0)","v":"BT"},{"$f":"ROW()","v":71},"",0,{"$f":"SUBSTITUTE(E71,\",\",\"\")","v":""}]
["auditor_name","auditor_name",{"$f":"VLOOKUP(MATCH($B72,'RAMM Data'!$1:$1,0),drop_col_ref!$A:$B,2,0)","v":"BU"},{"$f":"ROW()","v":72},"Stuart Fraser",9,{"$f":"VLOOKUP(E72,'Auditor & RCA List'!A:B,2,FALSE)","v":"StuartF"}]
["auditor_quali","auditor_quali",{"$f":"VLOOKUP(MATCH($B73,'RAMM Data'!$1:$1,0),drop_col_ref!$A:$B,2,0)","v":"BV"},{"$f":"ROW()","v":73},"L1 STMS",9,{"$f":"E73","v":"L1 STMS"}]
["auditor_contact_no","auditor_contact_no",{"$f":"VLOOKUP(MATCH($B74,'RAMM Data'!$1:$1,0),drop_col_ref!$A:$B,2,0)","v":"BW"},{"$f":"ROW()","v":74},1,9,{"$f":"IFERROR(E74,\"0\")","v":1}]
["aud_nzta_id_no","aud_nzta_id_no",{"$f":"VLOOKUP(MATCH($B75,'RAMM Data'!$1:$1,0),drop_col_ref!$A:$B,2,0)","v":"BX"},{"$f":"ROW()","v":75},1,9,{"$f":"E75","v":1}]
["stms_name","stms_name",{"$f":"VLOOKUP(MATCH($B76,'RAMM Data'!$1:$1,0),drop_col_ref!$A:$B,2,0)","v":"BY"},{"$f":"ROW()","v":76},"",0,{"$f":"E76","v":""}]
["stms_qualification","stms_qualification",{"$f":"VLOOKUP(MATCH($B77,'RAMM Data'!$1:$1,0),drop_col_ref!$A:$B,2,0)","v":"BZ"},{"$f":"ROW()","v":77},"",0,{"$f":"E77","v":""}]
["stms_contact_no","stms_contact_no",{"$f":"VLOOKUP(MATCH($B78,'RAMM Data'!$1:$1,0),drop_col_ref!$A:$B,2,0)","v":"CA"},{"$f":"ROW()","v":78},"",0,{"$f":"IFERROR(E78,\"0\")","v":""}]
["stms_nzta_id_no","stms_nzta_id_no",{"$f":"VLOOKUP(MATCH($B79,'RAMM Data'!$1:$1,0),drop_col_ref!$A:$B,2,0)","v":"CB"},{"$f":"ROW()","v":79},"",0,{"$f":"E79","v":""}]
["audit_id","audit_id","CA",{"$f":"ROW()","v":80},{"$f":"IF(INDIRECT(A80)=0,\"\",INDIRECT(A80))","v":""},0,{"$f":"E80","v":""}]
["planned_unplanned","planned",{"$f":"VLOOKUP(MATCH($B81,'RAMM Data'!$1:$1,0),drop_col_ref!$A:$B,2,0)","v":"CD"},{"$f":"ROW()","v":81},"",0,{"$f":"VLOOKUP(E81,'Reference List'!S2:T3,2,FALSE)","v":{"$error":"#N/A"}}]

{"sheet":"drop_col_ref","index":1,"n_rows":130,"n_cols":2,"rows_kept":130,"cut":false,"hidden":true,"merged":[]}
[1,"A"]
[2,"B"]
[3,"C"]
[4,"D"]
[5,"E"]
[6,"F"]
[7,"G"]
[8,"H"]
[9,"I"]
[10,"J"]
[11,"K"]
[12,"L"]
[13,"M"]
[14,"N"]
[15,"O"]
[16,"P"]
[17,"Q"]
[18,"R"]
[19,"S"]
[20,"T"]
[21,"U"]
[22,"V"]
[23,"W"]
[24,"X"]
[25,"Y"]
[26,"Z"]
[27,{"$f":"$B$1&B1","v":"AA"}]
[28,"AB"]
[29,"AC"]
[30,"AD"]
[31,"AE"]
[32,"AF"]
[33,"AG"]
[34,"AH"]
[35,"AI"]
[36,"AJ"]
[37,"AK"]
[38,"AL"]
[39,"AM"]
[40,"AN"]
[41,"AO"]
[42,"AP"]
[43,"AQ"]
[44,"AR"]
[45,"AS"]
[46,"AT"]
[47,"AU"]
[48,"AV"]
[49,"AW"]
[50,"AX"]
[51,"AY"]
[52,"AZ"]
[53,{"$f":"$B$2&B1","v":"BA"}]
[54,"BB"]
[55,"BC"]
[56,"BD"]
[57,"BE"]
[58,"BF"]
[59,"BG"]
[60,"BH"]
[61,"BI"]
[62,"BJ"]
[63,"BK"]
[64,"BL"]
[65,"BM"]
[66,"BN"]
[67,"BO"]
[68,"BP"]
[69,"BQ"]
[70,"BR"]
[71,"BS"]
[72,"BT"]
[73,"BU"]
[74,"BV"]
[75,"BW"]
[76,"BX"]
[77,"BY"]
[78,"BZ"]
[79,{"$f":"$B$3&B1","v":"CA"}]
[80,{"$f":"$B$3&B2","v":"CB"}]
[81,"CC"]
[82,"CD"]
[83,"CE"]
[84,"CF"]
[85,"CG"]
[86,"CH"]
[87,"CI"]
[88,"CJ"]
[89,"CK"]
[90,"CL"]
[91,"CM"]
[92,"CN"]
[93,"CO"]
[94,"CP"]
[95,"CQ"]
[96,"CR"]
[97,"CS"]
[98,"CT"]
[99,"CU"]
[100,"CV"]
[101,"CW"]
[102,"CX"]
[103,"CY"]
[104,"CZ"]
[105,{"$f":"$B$4&B1","v":"DA"}]
[106,{"$f":"$B$4&B2","v":"DB"}]
[107,"DC"]
[108,"DD"]
[109,"DE"]
[110,"DF"]
[111,"DG"]
[112,"DH"]
[113,"DI"]
[114,"DJ"]
[115,"DK"]
[116,"DL"]
[117,"DM"]
[118,"DN"]
[119,"DO"]
[120,"DP"]
[121,"DQ"]
[122,"DR"]
[123,"DS"]
[124,"DT"]
[125,"DU"]
[126,"DV"]
[127,"DW"]
[128,"DX"]
[129,"DY"]
[130,"DZ"]

{"sheet":"SCR Form","index":2,"n_rows":60,"n_cols":17,"rows_kept":60,"cut":false,"hidden":false,"merged":[[6,9,6,10],[6,11,6,12],[3,7,3,8],[3,9,3,12],[7,0,7,1],[7,7,7,8],[7,9,7,12],[5,11,5,12],[5,9,5,10],[5,0,5,1],[5,7,5,8],[6,0,6,1],[6,2,6,3],[5,2,5,3],[7,2,7,5],[6,7,6,8],[48,0,51,12],[53,0,53,5],[42,0,45,12],[47,0,47,3],[47,6,47,12],[40,0,41,2],[33,7,33,12],[28,8,28,11],[29,8,29,11],[30,8,30,11],[31,8,31,11],[36,7,36,12],[37,7,37,9],[37,10,37,12],[32,7,32,12],[34,7,35,12],[40,6,40,9],[41,6,41,9],[28,0,28,5],[54,0,54,1],[54,2,54,5],[54,7,54,8],[54,9,54,11],[53,7,53,8],[53,9,53,12],[59,0,60,12],[55,0,55,1],[55,2,55,5],[55,7,55,8],[55,9,55,12],[56,0,56,1],[56,2,56,3],[56,7,56,8],[56,9,56,10],[57,0,57,1],[57,2,57,5],[57,7,57,8],[57,9,57,12],[0,0,0,10],[2,0,2,5],[2,7,2,12],[4,0,4,1],[4,2,4,5],[4,7,4,8],[4,9,4,12],[3,0,3,1],[3,2,3,5],[9,0,9,2],[17,15,17,16],[20,15,20,16],[30,15,31,15],[18,0,18,5],[9,7,9,9],[25,0,25,5],[11,16,12,16],[30,16,31,16],[21,15,25,16],[11,15,12,15],[41,13,42,14],[43,15,43,16],[43,13,45,14],[27,9,27,11],[23,7,23,12],[25,8,25,11],[26,8,26,11],[24,8,24,11],[37,15,40,16],[38,7,38,8],[38,10,38,12],[36,15,36,16],[32,15,33,16]]}
["TTM SITE CONDITION RATING FORM",null,null,null,null,null,null,null,null,null,null,"Logo to go here",null,null,null,"V48.3N"]
[]
["SITE DETAILS",null,null,null,null,null,null,"OPERATIONAL DETAILS"]
["RCA",null,"PCC",null,null,null,null,"Activity description"]
["Suburb",null,{"$f":"VLOOKUP(road_id,'Road ID Lookup'!A:C,3,FALSE)","v":{"$error":"#N/A"}},null,null,null,null,"TTM method"]
["Road name",null,{"$f":"VLOOKUP(road_id,'Road ID Lookup'!A:B,2,FALSE)","v":{"$error":"#N/A"}},null,"Road ID",null,null,null,null,"TTM Contractor",null,"Contractor - working space"]
["CAR / WAP number",null,null,null,"TTM level",null,null,"Contractor (TTM/Working space)"]
["Date / Time",null,null,null,null,null,null,"Client / Principal"]
[]
["SIGNS",null,null,"Weighting","Tally Box","Total",null,"MISCELLANEOUS",null,null,"Weighting","Tally Box","Total"]
["A1","Missing ","Sign",5,null,{"$f":"E11*D11","v":0},null,"E1","Working in live lanes","Individual",20,null,{"$f":"L11*K11","v":0}]
["A2","Position","Sign",2,null,{"$f":"E12*D12","v":0},null,"E2","Missing or ineffective controller","Individual",20,null,0,null,null,"Type of Audit/ Review Undertaken","Full Audit/Review"]
["A3","Not visible/fallen over","Sign",5,null,{"$f":"E13*D13","v":0},null,"E3","Safety zone compromised","Individual",10,null,0]
["A4","Wrong sign","Sign",5,null,0,null,"E4","High visibility garment not acceptable","Individual",5,null,0]
["A5","Condition unacceptable","Sign",4,null,0,null,"E5","Marginal surface condition (carriageway only)","Occasion",15,null,0,null,null,"Audit ID",{"$f":"IF(Q12=\"Full Audit/Review\",\"\",IF(Q12=\"Audit/Partial Review or Short Form\",2,IF(Q12=\"TMP Only\",3,IF(Q12=\"CAR Only\",4,IF(Q12=\"On-Site Record Only\",5,IF(Q12=\"STMS Only\",6,IF(Q12=\"Other Checks Only\",1,IF(Q12=\"TTM Only\",7,IF(Q12=\"TSL Audit/Review\",8,\"Please Select the Correct Review Type\")))))))))","v":""}]
["A6","Permanent sign","Sign",5,null,0,null,"E6","Unacceptable surface condition (peds, cyclists or carriageway)","Occasion",30,null,{"$f":"L16*K16","v":0}]
["A7","Unapproved sign used / too small","Sign",4,null,0,null,"E7","Barrier defects (missing or incorrect components)","Component",10,null,0,null,null,"TOTAL SCR",{"$f":"SUM(F11:F18,F20:F24,F27:F28,F30:F39,M11:M23)","v":0}]
["A8","Non-compliant support / sign too low","Support",2,null,0,null,"E8","Unsafe or redundant TTM","Equipment",5,null,0,null,null,"Note that this score does not appear on the final printout"]
["MOBILE & SEMI STATIC",null,null,null,null,null,null,"E9","VMS message incorrect or inappropriate","VMS",15,null,{"$f":"L19*K19","v":0}]
["B1","Tail pilot vehicle / AWVMS omitted or incorrect location","Vehicle",30,null,{"$f":"E20*D20","v":0},null,"E10","Flashing beacons / indicator lights not used or ineffective","Vehicle",3,null,{"$f":"L20*K20","v":0}]
["B2","Lead pilot vehicle omitted or incorrect location","Vehicle",20,null,{"$f":"E21*D21","v":0},null,"E11","Parking / stopping features not relocated","Feature",5,null,{"$f":"L21*K21","v":0},null,null,"SCR OVERRIDE"]
["B3","Shadow vehicle omitted or incorrect location","Vehicle",26,null,{"$f":"E22*D22","v":0},null,"E12","Unsafe and illegal parking of plant/equip.","Feature",20,null,{"$f":"L22*K22","v":0},null,null,"This function can only be used if certain criteria below are not met (and only if required):"]
["B4","TMA missing or non compliant","TMA",26,null,{"$f":"E23*D23","v":0},null,"E13","Marginal items (signs, delineators, Hi vis garments) ","Feature",1,null,{"$f":"L23*K23","v":0}]
["B5","AWVMS/arrowboard non compliant","Vehicle",26,null,{"$f":"E24*D24","v":0},null,"OTHER WORKSITE ASPECTS"]
[null,null,null,null,null,null,null,"G1","QUALIFIED PERSON ON SITE  [REFER TO A5 OF COPTTM]"]
["PEDESTRIANS / CYCLISTS ",null,null,null,null,null,null,"G2","TSL APPROPRIATE [REFER TO C4 OF COPTTM]"]
["C1","Inadequate provision for pedestrians","Feature",10,null,{"$f":"D27*E27","v":0},null,"G3","ROAD USER FLOW ACCEPTABLE",null,null,null,null,null,null,"Any single SCR column with a weighting of 20 or over is blank?",{"$f":"IF(SUM(E20:E24)+E30+E38+L16+L22+L12+L11>0,\"N\",\"Y\")","v":"Y"}]
["C2","Inadequate provision for cyclists","Feature",10,null,{"$f":"D28*E28","v":0},null,"G4","ON-SITE RECORD","[FORM MUST INCLUDE STMS AUTHORITY, 2 HOURLY CHECKS AND TSL DETAILS]",null,null,null,null,null,"The site passes all areas of Key worksite aspects? [NOT G4]",{"$f":"IF(OR(M25=\"N\",M26=\"N\",M27=\"N\",M29=\"N\",M30=\"N\",M31=\"N\",M32=\"N\"),\"N\",\"Y\")","v":"Y"}]
["DELINEATION",null,null,null,null,null,null,"G5","TMP APPROVED?",null,null,null,null,null,null,"The SCR does not exceed 150 points?",{"$f":"IF(Q17>150,\"N\",\"Y\")","v":"Y"}]
["D1","Missing or ineffective taper","Leading taper",26,null,{"$f":"D30*E30","v":0},null,"G6","APPROVED TMP SIGHTED?",null,null,null,null,null,null,"Could the SCR Change?",{"$f":"IF(AND(Q17>50,OR(M42=\"N\",Q27=\"N\", Q28=\"N\",Q29=\"N\")),\"Y\",IF(OR(M42=\"SELECT ONE\",M42=\"\"),\"PLEASE COMPLETE OVERRIDE CHECKS\",\"N\"))","v":"PLEASE COMPLETE OVERRIDE CHECKS"}]
["D2","Tapers too short","Leading taper",15,null,{"$f":"D31*E31","v":0},null,"G7","APPROVED TMP APPLICABLE?",null,null,null,null,null,null,"IS THE OVERRIDE REQUIRED?",{"$f":"IF(AND(M42=\"N\",Q30=\"Y\",Q17>50),\"Y\",IF(OR(M42=\"SELECT ONE\",M42=\"\"),\"PLEASE COMPLETE OVERRIDE CHECKS IF REQUIRED\",\"N\"))","v":"PLEASE COMPLETE OVERRIDE CHECKS IF REQUIRED"}]
["D3","Taper too short or missing","Trailing taper",5,null,{"$f":"D32*E32","v":0},null,"G8","TTM IN ACCORDANCE WITH APPROVED TMP?"]
["D4","Spacing in taper","Taper",5,null,{"$f":"D33*E33","v":0},null,{"$f":"IF(OR(K41=\"N\",K39=\"AT AUDITOR\",H35=\"DANGEROUS\",H35=\"UNACCEPTABLE (MULTIPLE ISSUES)\",H35=\"UNACCEPTABLE (>50)\",H35=\"UNACCEPTABLE (OTHER)\"),\"AS A RESULT OF THE FINDINGS OF THIS REVIEW, ADDITIONAL FEES MAY  BE PAYABLE TO THE RCA. PLEASE DISCUSS WITH ADVISOR IF ANY ISSUES\",\"\")","v":""},null,null,null,null,null,null,null,{"$f":"IF(Q31=\"N\",\"THIS SCR CANNOT BE OVERRIDEN AND THE EXISTING RESULT MUST REMAIN\",\" \")","v":" "}]
["D5","Spacing along lanes","Per 100m delineation",3,null,{"$f":"D34*E34","v":0},null,"FINAL RESULT"]
["D6","Missing or ineffective delineation along lanes","Delineation section",10,null,{"$f":"D35*E35","v":0},null,{"$f":"IF(Q31=\"Y\",\"DANGEROUS\",IF(AND(B40=\"UNACCEPTABLE (>50)\",E40=\"UNACCEPTABLE (OTHER)\"),\"UNACCEPTABLE (MULTIPLE ISSUES)\",IF(E40=\"UNACCEPTABLE (OTHER)\",E40,B40)))","v":"HIGH STANDARD (≤10)"},null,null,null,null,null,null,null,null," "]
["D7","Condition unacceptable","Device",2,null,0]
["D8","Using non-approved device","Device",4,null,0,null,{"$f":"IF((H35=\"DANGEROUS\"),\"THIS SITE HAS SAFETY ISSUES WHICH REQUIRE IMMEDIATE ACTION\",\" \")","v":" "},null,null,null,null,null,null,null,{"$f":"IF(P38=\"\",\"\",\"ADVISOR NOTE\")","v":""}]
["D9","Road marking incorrect at long term level 2 or 3 roads","Site",30,null,0,null,"ACTIONS PLANNED BY STMS",null,null,"SITE ACTIVITY CEASED BY",null,null,null,null,{"$f":"IF(AND(K47=\"\",L47=\"\"),M47,IF(AND(L47=\"\",M47=\"\"),K47,(IF(AND(M47=\"\",K47=\"\"),L47,\"\"))))","v":""}]
["D10","Inadequate/missing site access","Access",10,null,0,null," SITE FIXED?"]
[null,{"$f":"IF(Q17<=10, \"HIGH STANDARD (≤10)\",IF(AND(Q17>10,Q17<26),\"ACCEPTABLE (11-25)\",IF(AND(Q17>25,Q17<51),\"NEEDS IMPROVEMENT (26-50)\",IF(Q17>50,\"UNACCEPTABLE (>50)\",\"\"))))","v":"HIGH STANDARD (≤10)"},null,null,{"$f":"IF(OR(M25=\"N\",M26=\"N\",M27=\"N\",M28=\"N\",M29=\"N\",M30=\"N\",M31=\"N\",M32=\"N\"), \"UNACCEPTABLE (OTHER)\",\" \")","v":" "}]
["KEY POINTS",null,null,"COMPLAINT CALLOUT?","SITE ACTIVITY STATUS",null,"NOTIFICATIONS (RCA) . [DOES NOT AFFECT SCORE]",null,null,null,null,"TMP DESIGN ISSUES?","LOW RISK?"]
[null,null,null,null,"AUDIT/ REVIEW PLANNED / UNPLANNED?",null,"GOOD SITE INDUCTION? . [DOES NOT AFFECT SCORE]",null,null,null,null,null,null,{"$f":"IF(OR(P38=\"ISSUE STOP WORKS NOTICE IMMEDIATELY\",K39=\"AT AUDITOR\",),\"è\",\"\")","v":""},null,{"$f":"IF(N44=\"\",\"\",\"Stop Works Order Required?\")","v":""}]
[null,null,null,null,null,null,null,null,null,null,null,null,null,null,null,{"$f":"IF(N44=\"\",\"\",\"Who gave you advice on this?\")","v":""}]
[null,null,null,null,null,null,null,null,null,null,null,null,null,{"$f":"IF(OR(P38=\"ISSUE STOP WORKS NOTICE IMMEDIATELY\",K39=\"AT AUDITOR\",),\"ENTER INFO FOR STOP WORKS ORDER\",\"\")","v":""},null,{"$f":"IF(N44=\"\",\"\",\"ENTER TIME BELOW IN 24HR FORMAT - MUST USE COLON SEPARATOR\")","v":""}]
[null,null,null,null,null,null,null,null,null,null,null,null,null,null,null,{"$f":"IF(N44=\"\",\"\",\"Time Stop Works Order Issued?\")","v":""}]
[null,null,null,null,null,null,null,null,null,null,null,null,null,null,null,{"$f":"IF(N44=\"\",\"\",\"Time Uplifted? (If Applicable)\")","v":""}]
[null,null,null,null,null,null,null,null,null,null,{"$f":"IF(AND(H35=\"UNACCEPTABLE (OTHER)\",J39=\"NO\",L47=\"\"),\"STOP WORKS ORDER COULD BE CONSIDERED FOR THIS SITE - SEEK ADVICE FIRST\",\"\")","v":""},{"$f":"IF(OR(M25=\"N\",M26=\"N\",M27=\"N\",M29=\"N\",M30=\"N\",M31=\"N\",M32=\"N\"),\"\",IF(M28=\"N\",\"THIS SITE MAY CONTINUE PROVIDED STMS FILLS OUT DAILY SITE RECORD ASAP\",\"\"))","v":""},{"$f":"IF(OR(H35=\"DANGEROUS\",AND(OR(H35=\"UNACCEPTABLE (>50)\",H35=\"UNACCEPTABLE (MULTIPLE ISSUES)\"),J39=\"NO\")),\"ISSUE STOP WORKS ORDER IMMEDIATELY\",\"\")","v":""},{"$f":"IF(AND(Q42=\"YES\",N42=\"è\"),\"STOP WORKS ORDER ISSUED AT \",\"\")","v":""}]
["ACTIONS TO BE TAKEN",null,null,null,null,null,{"$f":"IF(H35=\"UNACCEPTABLE (MULTIPLE ISSUES)\",\"YOUR SITE REQUIRES URGENT RECTIFICATION\",\" \")","v":" "}]
[]
[]
[]
[]
[]
["AUDITED / REVIEWED BY",null,null,null,null,null,null,"STMS DETAILS",null,{"$f":"CONCATENATE(N47,TEXT(Q45,\"h:mm AM/PM\"))","v":"12:00 AM"}]
["Signature",null,null,null,null,null,null,"RECEIVED BY / SIGNED",null,null,null,null,"SCR LEFT ONSITE?"]
["Auditor/Reviewer name",null,"Stuart Fraser",null,null,null,null,"STMS name"]
["Qualifications",null,"L1 STMS",null,"NZTA ID No.",1,null,"Qualifications",null,null,null,"NZTA ID No."]
["Auditor/Reviewer mobile number",null,1,null,null,null,null,"STMS mobile number"]
[]
["In submitting this form, the auditor/reviewer specified above agrees that they have explained the significant issues and proposed remedies to the relevant parties specified above and have handed these parties a physical copy of the audit (does not apply for unattended sites)."]

{"sheet":"Stop Works Order","index":3,"n_rows":65,"n_cols":11,"rows_kept":65,"cut":false,"hidden":false,"merged":[[64,1,64,3],[64,4,64,11],[3,1,5,6],[12,1,13,3],[14,1,15,3],[16,1,17,3],[12,4,13,11],[14,4,15,11],[55,1,59,11],[61,1,61,3],[61,4,61,11],[62,1,62,3],[62,4,62,11],[63,1,63,3],[63,4,63,11],[46,4,46,11],[47,4,47,9],[47,10,47,11],[50,1,53,11],[46,1,46,3],[47,1,47,3],[44,1,44,3],[45,1,45,3],[43,4,43,11],[44,4,44,11],[45,4,45,11],[8,1,11,11],[19,1,20,11],[21,1,33,11],[36,1,42,11],[43,1,43,3],[16,4,17,11]]}
[]
[]
[]
[null,"STOP WORK ORDER"]
[]
[]
[]
[]
[null,"Pursuant to the authority and responsibilities of the RCA  as stated or assumed in any of the Local Government Act, Health and Safety in Employment Act, and various Utility Acts, an order is hereby given to stop work on the following job/s:"]
[]
[]
[]
[null,"CAR NUMBER:",null,null,{"$f":"IF('SCR Form'!Q42=\"YES\",'SCR Form'!C7,\"\")","v":""}]
[]
[null,"ROAD NAME:",null,null,{"$f":"IF('SCR Form'!Q42=\"YES\",'SCR Form'!C6,\"\")","v":""}]
[]
[null,"SPECIFIC LOCATION:",null,null,{"$f":"IF('SCR Form'!Q42=\"YES\",'SCR Form'!C5,\"\")","v":""}]
[]
[]
[null,"The reason for this is that the Work does not comply with the following requirements:"]
[]
[null,{"$f":"IF('SCR Form'!Q42=\"YES\",'SCR Form'!A43,\"\")","v":""}]
[]
[]
[]
[]
[]
[]
[]
[]
[]
[]
[]
[]
[]
[]
[null,"In the meantime, the only work to be carried out is work that is necessary to remedy either the above aspects that do not comply, or work necessary to protect the safety of Road users, and to remedy any inconvenience to pedestrian and vehicular traffic.\n\nThe stopped work is not to recommence until appropriate remedial work is carried out and an ‘Approval to Recommence Work’ authority is signed and issued by the Corridor Manager."]
[]
[]
[]
[]
[]
[]
[null,"Signed By:"]
[null,"Corridor Manager:",null,null,{"$f":"IF('SCR Form'!Q42=\"YES\",'SCR Form'!C56,\"\")","v":""}]
[null,"Time:",null,null,{"$f":"IF('SCR Form'!Q42=\"YES\",'SCR Form'!Q45,\"\")","v":""}]
[null,"Date:",null,null,{"$f":"IF('SCR Form'!Q42=\"YES\",TODAY(),\"\")","v":""}]
[null,"Received By:",null,null,null,null,null,null,null,null,"(Contractor)"]
[]
[]
[null,"Approval to Recommence Work\n\nThis is to confirm that following the ‘Stop Work Order’ issued for the following Work, the remedial work has been satisfactorily completed and the stopped work may now re-commence from _______________________ (date)."]
[]
[]
[]
[]
[]
[]
[]
[]
[]
[]
[null,"Signed By:"]
[null,"Corridor Manager:"]
[null,"Time:"]
[null,"Date:"]

{"sheet":"NNC","index":4,"n_rows":43,"n_cols":12,"rows_kept":43,"cut":false,"hidden":false,"merged":[[1,0,2,5],[3,0,5,5],[1,7,5,9],[12,1,12,9],[10,0,10,1],[10,2,10,9],[28,0,28,9],[29,0,29,9],[14,0,14,9],[15,0,15,9],[16,0,16,9],[17,0,17,9],[22,0,22,9],[23,0,23,9],[24,0,24,9],[18,0,18,9],[19,0,19,9],[20,0,20,9],[21,0,21,9],[40,0,40,1],[40,2,40,4],[30,0,30,9],[35,0,35,9],[36,0,36,9],[38,0,38,9],[40,6,40,9],[37,0,37,9],[39,0,39,9],[31,0,31,9],[33,0,33,9],[34,0,34,9],[32,0,32,9],[41,0,41,1],[41,2,41,4],[42,0,42,4],[41,6,41,9],[42,6,42,9],[7,11,8,14],[9,11,9,14],[7,2,7,9],[27,0,27,9],[25,0,25,9],[26,0,26,9],[8,7,8,9],[9,7,9,9],[7,0,7,1],[8,0,8,1],[9,0,9,1],[8,2,8,5],[9,2,9,5],[11,0,11,9],[13,0,13,9]]}
[]
["Temporary Traffic Management (TTM)",null,null,null,null,null,null,"Logo and address to go here"]
[]
["Notice of Non-Conformance"]
[]
[]
[]
["Date/Time of audit",null,{"$f":"IF(L10=\"YES\",'SCR Form'!C8,\"\")","v":""},null,null,null,null,null,null,null,null,"Do you need to issue an NNC for this audit/review?"]
["Audited by",null,{"$f":"IF(L10=\"YES\",'SCR Form'!C56:F56,\"\")","v":""},null,null,null,"of "]
["Contractor",null,"ENTER DETAILS HERE",null,null,null,"CAR number",{"$f":"IF(L10=\"YES\",'SCR Form'!C7,\"\")","v":""}]
["STMS/Responsible parties:"]
["This notice is to inform you that the temporary traffic management at the following worksite is not in accordance with accepted traffic management practices:"]
["Roads:",{"$f":"IF(L10=\"YES\",CONCATENATE('SCR Form'!C5,\",\",\" \",'SCR Form'!C6),\"\")","v":""}]
["This notice of non-conformance is issued in respect of the following temporary traffic management defects: (delete those that do not apply)"]
["·         STMS nominated in TMP not on worksite"]
["·         TC nominated in TMP and briefed by STMS (level LV and level 1) not on worksite"]
["·         Copy of signed and approved TMP not on worksite"]
["·         Safety audit of temporary traffic management site condition rating ‘Unacceptable’ OR 'Dangerous'"]
["·         Temporary traffic management not in accordance with the CoPTTM"]
["·         Inappropriate or excessive TSL"]
["The details of non-conforming temporary traffic management are:"]
["·    "]
["·    "]
["·    "]
["·    "]
["·    "]
["·    "]
["The actions required to be implemented are to:"]
["Identify and investigate the root causes of the non-conforming temporary traffic management identified in the SCR and this NNC to find a permanent cure to prevent the problem recurring."]
["Implement a Corrective Action Plan to:"]
["·    "]
["·    "]
["·    "]
["·    "]
["·    "]
["·    "]
["A response to this Notice must be returned within 10 working days detailing the Corrective Action Plans for the defects identified above."]
["You will be expected to implement the Corrective Action Plan as soon as possible and no later than 20 working days from the date of this Notice."]
["In order to complete close out of this Notice, we will conduct a further TTM SCR on this STMS with the required result being Acceptable or better.  To facilitate this, we must be advised of at least one attended operation under the management of this STMS (24-hour notice is preferred)."]
["Your response will be considered by the Review Panel to determine the close out of this Notice of Non-conformance.  All findings will be retained on record by ENTER DETAILS HERE for future reference.  A copy of this NNC will be sent to NZTA for their records."]
["Notice sent to:",null,"NAME",null,null,"on",{"$f":"TODAY()","v":"2017-09-21"}]
["Signed:",null,null,null,null,"Received:"]
["AT TTM Review Panel",null,null,null,null,"Contractor:",{"$f":"IF(L10=\"YES\",C10,\"\")","v":""}]

{"sheet":"RAMM Data","index":5,"n_rows":1,"n_cols":82,"rows_kept":1,"cut":false,"hidden":false,"merged":[]}
["sp_address","suburb","ttm_level","car_app_no","date","road_id","time","activ_desc","crm_callout","active_site","ttm_method","ttm_contractor","ttm_contractor_oth","main_contractor","client_principal","added_on","added_by","a1_tally_box","a2_tally_box","a3_tally_box","a4_tally_box","a5_tally_box","a6_tally_box","a7_tally_box","a8_tally_box","b1_tally_box","b2_tally_box","b3_tally_box","b5_tally_box","b4_tally_box","c1_tally_box","c2_tally_box","d1_tally_box","d2_tally_box","d3_tally_box","d4_tally_box","d5_tally_box","d6_tally_box","d7_tally_box","d8_tally_box","d9_tally_box","d10_tally_box","e1_tally_box","e2_tally_box","e3_tally_box","e4_tally_box","e5_tally_box","e6_tally_box","e7_tally_box","e8_tally_box","e9_tally_box","e10_tally_box","e11_tally_box","e12_tally_box","e13_tally_box","g1_other_checks","g2_other_checks","g3_other_checks","g4_other_checks","g5_other_checks","g6_other_checks","g7_other_checks","g8_other_checks","g9_other_checks","g10_other_checks","actions_stms","tmp_design_issue","site_safe","site_close_by","stop_works_issue","key_points","actions_to_take","auditor_name","auditor_quali","auditor_contact_no","aud_nzta_id_no","stms_name","stms_qualification","stms_contact_no","stms_nzta_id_no","audit_id","planned"]

{"sheet":"Reference List","index":6,"n_rows":22,"n_cols":25,"rows_kept":22,"cut":false,"hidden":true,"merged":[]}
["TTM Level",0,null,"Site Activity Ceased by",null,"Low Risk?",null,"Y / N / NA",null,"Notifications",null,"Actions planned by STMS, Fix site?",null,"TTM Method",null,null,"Site Activity Status",null,"Audit status",null,null,"Type of Audit/Review","Audit ID",null,"Qualifications"]
["LV",5,null,"STMS","STMS","Y",null,"Y",null,"Y",null,"Y",null,"Berm Closure",13,null,"Attended",null,"Planned","P",null,"Full Audit/Review",null,null,"TC"]
[1,null,null,"Auditor/Reviewer","Auditor","N",null,"N",null,"N",null,"N",null,"Bus/Transit Lane Closure",12,null,"Unattended",null,"Unplanned","U",null,"Audit/Partial Review or Short Form",2,null,"L1 STMS"]
[2,null,null,"Non STMS","Non STMS",null,null,"N/A",null,"NA",null,"N/A",null,"Contraflow",8,null,null,null,null,null,null,"TMP Only",3,null,"L2/3 NP"]
["2LS",null,null,"RCA Representative","NA",null,null,null,null,null,null,null,null,"Cycle Lane Closure",19,null,null,null,null,null,null,"CAR Only",4,null,"L2/3 P"]
[3,null,null,"Police","Police",null,null,null,null,null,null,null,null,"Footpath Closure",11,null,null,null,null,null,null,"On-Site Record Only",5,null,"L1 T"]
[null,null,null,"Fire Service","Fire",null,null,null,null,null,null,null,null,"Inspection",18,null,null,null,null,null,null,"STMS Only",6,null,"L2/3 NP / L1 T"]
[null,null,null,"Engineer","Engineer",null,null,null,null,null,null,null,null,"Lane Closure",10,null,null,null,null,null,null,"Other Checks Only",1,null,"L2/3 P / L1 T"]
[null,null,null,"WorkSafe","Worksafe",null,null,null,null,null,null,null,null,"Lane Shift",23,null,null,null,null,null,null,"TTM Only",7,null,"TCI"]
[null,null,null,"Civil Defence","Defence",null,null,null,null,null,null,null,null,"Mobile Closure",15,null,null,null,null,null,null,"TSL Audit/Review",8,null,"KCTL"]
[null,null,null,"Not Applicable","NA",null,null,null,null,null,null,null,null,"Nothing",22,null,null,null,null,null,null,null,null,null,"NONE"]
[null,null,null,null,null,null,null,null,null,null,null,null,null,"Partial Road Closure",7,null,null,null,null,null,null,null,null,null,"Assessor"]
[null,null,null,null,null,null,null,null,null,null,null,null,null,"Pilot Vehicle Static",25]
[null,null,null,null,null,null,null,null,null,null,null,null,null,"Priority Control",14]
[null,null,null,null,null,null,null,null,null,null,null,null,null,"Road Closure",5]
[null,null,null,null,null,null,null,null,null,null,null,null,null,"Semi-Static Closure",16]
[null,null,null,null,null,null,null,null,null,null,null,null,null,"Shoulder Closure",6]
[null,null,null,null,null,null,null,null,null,null,null,null,null,"Special Mobile",17]
[null,null,null,null,null,null,null,null,null,null,null,null,null,"Stop/Go",9]
[null,null,null,null,null,null,null,null,null,null,null,null,null,"Temporary Signals",20]
[null,null,null,null,null,null,null,null,null,null,null,null,null,"TSL",21]
[null,null,null,null,null,null,null,null,null,null,null,null,null,"Warning Only",24]

{"sheet":"Auditor & RCA List","index":7,"n_rows":6,"n_cols":6,"rows_kept":6,"cut":false,"hidden":false,"merged":[]}
["Auditor/Reviewer","RAMM ID",null,null,null,"RCA List"]
["Stuart Fraser","StuartF",null,null,null,"LHCC"]
["Tony Stella","TonyS",null,null,null,"UHCC"]
["Neil Greaves","NeilG",null,null,null,"PCC"]
[null,null,null,null,null,"WCC"]
[null,null,null,null,null,"NZTA"]

{"sheet":"Road ID Lookup","index":8,"n_rows":15789,"n_cols":3,"rows_kept":15789,"cut":false,"hidden":false,"merged":[]}
["Road ID","Road Name","Contract Region"]
[70513,"A.RENALL RD","South Rural"]
[53216,"AARONVILLE WAY","South East Urban"]
[50660,"AARTS AVE","South West Urban"]
[35651,"ABATTOIR LANE (PVT)","Central East"]
[30002,"ABBEY ST","Central"]
[22001,"ABBEYGATE ST","North Urban West"]
[41154,"ABBOTLEIGH AVE","West"]
[20747,"ABBOTSFORD TCE","North Urban East"]
[30003,"ABBOTTS WAY","Central East"]
[15266,"ABBOTTS WAY ACWAY/WAIATARUA RES LINK CYWAY","Central East"]
[33119,"ABBOTTS WAY HLA (#2 - #36)","Central East"]
[15265,"ABBOTTS WAY/GRAND DR CYWAY","Central East"]
[35808,"ABBOTTS/CELTIC WWAY (RP1158 RHS)","Central East"]
[70001,"ABBY CLOSE","South Rural"]
[11197,"ABEL RD","North Rural"]
[40186,"ABEL TASMAN AVE","West"]
[48175,"ABEL TASMAN AVE WWAY","West"]
[50661,"ABELIA PL","South West Urban"]
[50662,"ABERCROMBIE ST","South East Urban"]
[53590,"ABERDEEN CRES","South West Urban"]
[15433,"ABERDEEN CRES LINK CYWAY (RP285)","South West Urban"]
[15755,"ABERDEEN CRES LINK CYWAY (RP660)","South West Urban"]
[15430,"ABERDEEN CRES/ALLERTON PL LOOP CYWAY","South West Urban"]
[15428,"ABERDEEN CRES/WATTLE DOWNS ESP RES CYWAY (RP30)","South West Urban"]
[20054,"ABERDEEN RD","North Urban East"]
[50663,"ABERFELDY AVE","South East Urban"]
[54537,"ABERFELDY/HIGHLAND PARK RAB","South East Urban"]
[30004,"ABERFOYLE ST","Central"]
[22963,"ABERLEY RD","North Urban West"]
[53365,"ABILENE PL","South West Urban"]
[30005,"ABINGDON PL","Central East"]
[52874,"ABIRU CRES","South West Urban"]
[30006,"ABRAHAM PL","Central East"]
[22233,"ACACIA RD","North Urban East"]
[52980,"ACCENT DR","South East Urban"]
[10001,"ACCESS RD","North Rural"]
[33210,"ACE PL","Central"]
[22510,"ACHILLES CRES","North Urban East"]
[50664,"ACLAND PL","South East Urban"]
[53137,"ACLARE PL","South East Urban"]
[54528,"ACLARE PL CARPARK (RP16 RHS)","South East Urban"]
[54529,"ACLARE PL CARPARK (RP48 RHS)","South East Urban"]
[50665,"ACMENA LANE","South East Urban"]
[33211,"ACORN ST","Central"]
[30007,"ACTON PL","West"]
[30008,"ADA ST","Central"]
[53202,"ADAIR PL","South West Urban"]
[30009,"ADAM ST","Central"]
[41153,"ADAM SUNDE PL","West"]
[70910,"ADAMS DR","South Rural"]
[50666,"ADAMS RD (MANUREWA)","South West Urban"]
[70812,"ADAMS RD (PUKEKOHE)","South Rural"]
[11189,"ADAMS RD (WAINUI)","North Rural"]
[70002,"ADAMS RD SOUTH","South Rural"]
[50667,"ADAMSON RD","South East Urban"]
[50668,"ADDINGTON AVE","South West Urban"]
[53691,"ADDINGTON AVE/ARBOR CLOSE WWAY","South West Urban"]
[50669,"ADDIS PL","South East Urban"]
[41152,"ADDISON DR","West"]
[30010,"ADDISON ST","West"]
[50670,"ADEL PL","South West Urban"]
[53692,"ADEL PL/BLANES RD WWAY","South West Urban"]
[30011,"ADELAIDE ST","Central"]
[22726,"ADELIE PL","North Urban East"]
[22737,"ADELPHI PL","North Urban West"]
[22738,"ADELPHI PL HAMMERHEAD","North Urban West"]
[50671,"ADEN PL","South West Urban"]
[60287,"ADIOS PL","South West Urban"]
[41186,"ADITI CLOSE","West"]
[33212,"ADMIRAL BEATTY AVE","Central"]
[22904,"ADMIRALS COURT DR","North Urban West"]
[11361,"ADMIRALTY RISE","North Urban East"]
[50672,"ADONIS PL","South East Urban"]
[41151,"ADRIATIC AVE","West"]
[33213,"ADRIENNE PL","Central East"]
[53342,"ADRIGOLE PL","South East Urban"]
[22782,"ADVANCE WAY","North Urban West"]
[50673,"ADVENE RD","South East Urban"]
[50674,"ADVOCATE PL","South West Urban"]
[22002,"AEROVIEW DR","North Urban West"]
[53019,"AEROVISTA PL","South West Urban"]
[54311,"AEROVISTA PL HAMMERHEAD","South West Urban"]
[15596,"AEROVISTA PL LINK CYWAY","South West Urban"]
[41150,"AETNA PL","West"]
[15103,"AETNA PL/SUNNYVALE TRAIN STATION CYWAY","West"]
[41149,"AFTON PL","West"]
[53641,"AGAPANTHUS PL","South East Urban"]
[50675,"AGAR PL","South West Urban"]
[22234,"AGATHIS AVE","North Urban East"]
[10002,"AGENCY LANE","North Urban East"]
[11243,"AGENCY LANE SERVICE LANE","North Urban East"]
[20425,"AGINCOURT ST","North Urban West"]
[60702,"AGRIA AVE","South West Urban"]
[30012,"AHIRIRI AVE","West"]
[10003,"AHUROA RD","North Rural"]
[10004,"AHUROA VALLEY RD","North Rural"]
[70003,"AICKEN RD","South Rural"]
[50676,"AINSDALE PL","South West Urban"]
[53693,"AINSDALE PL/HEYBRIDGE ST WWAY","South West Urban"]
[50677,"AINTREE AVE","South West Urban"]
[53565,"AINWICK RD","South East Urban"]
[41148,"AIO WIRA RD","West"]
[22765,"AIRBORNE RD","North Urban West"]
[41147,"AIRDRIE RD","West"]
[30013,"AIREDALE ST (NORTH)","Central"]
[34974,"AIREDALE ST (SOUTH)","Central"]
[22235,"AIREY PL","North Urban East"]
[60708,"AIRFIELD RD (ARDMORE) (SR)","South Rural"]
[60285,"AIRFIELD RD (PAPAKURA) (SW)","South West Urban"]
[53454,"AIRPARK DR","South West Urban"]
[41146,"AIRPORT RD","North Urban West"]
[35033,"AIRPORT RD (PVT)","Hauraki Islands"]
[41234,"AIRPORT RD SLIP","North Urban West"]
[30014,"AITKEN TCE","Central"]
[11503,"AITKENHEAD CRT","North Rural"]
[22204,"AJAX ST","North Urban East"]
[70004,"AKA AKA RD","South Rural"]
[33214,"AKARANA AVE","Central"]
[30016,"AKAROA ST","Central"]
[41145,"AKATEA RD","West"]
[40099,"AKEHURST AVE","West"]
[30017,"AKEPIRO ST","Central"]
[33216,"AKIRAHO ST","Central"]
[23044,"AKORANGA BUS STATION RING RD","North Urban East"]
[20006,"AKORANGA DR","North Urban West"]
[23054,"AKORANGA DR DEC","North Urban West"]
[23053,"AKORANGA DR INC","North Urban West"]
[50678,"ALABASTER DR","South West Urban"]
[20061,"ALAMEIN AVE","North Urban East"]
[70911,"ALAMEIN PL","South Rural"]
[33217,"ALAMEIN RD","Central East"]
[34759,"ALAMEIN TCE","Central"]
[41144,"ALAN AVE","West"]
[48197,"ALAN AVE WWAY 1","West"]
[48198,"ALAN AVE WWAY 2","West"]
[35263,"ALAN MURRAY LANE (PVT)","Hauraki Islands"]
[33218,"ALANA PL","Central East"]
[30018,"ALANBROOKE CRES","West"]
[33219,"ALAUNIA PL","Central"]
[30019,"ALBA RD","Central"]
[53182,"ALBACORE WAY","South Rural"]
[26081,"ALBANY BUS STATION CARPARK","North Urban West"]
[26085,"ALBANY BUS STATION CARPARK 1","North Urban West"]
[26086,"ALBANY BUS STATION CARPARK 2","North Urban West"]
[26087,"ALBANY BUS STATION CARPARK 3","North Urban West"]
[26084,"ALBANY BUS STATION CARPARK EXTN","North Urban West"]
[23017,"ALBANY BUS STATION RING RD","North Urban West"]
[23016,"ALBANY BUS STN ACCESS RD","North Urban West"]
[23015,"ALBANY BUS STN CARPARK ACCESS","North Urban West"]
[25002,"ALBANY EXPRESSWAY","North Urban West"]
[20663,"ALBANY HEIGHTS RD (ALBANY)","North Urban West"]
[20012,"ALBANY HIGHWAY (ALBANY)","North Urban West"]
[80649,"ALBANY HIGHWAY / CHESTER WWAY (RP1757 LHS)","North Urban West"]
[30020,"ALBANY RD","Central"]
[10006,"ALBATROSS RD","North Urban East"]
[41143,"ALBEMARLE PL","West"]
[30021,"ALBERON PL","Central"]
[30022,"ALBERON ST","Central"]
[34977,"ALBERT CRES","Hauraki Islands"]
[10007,"ALBERT HALL DR","North Urban East"]
[70912,"ALBERT PL","South Rural"]
[40184,"ALBERT PRYOR AVE","West"]
[10008,"ALBERT RD   (WARKWORTH)","North Rural"]
[22109,"ALBERT RD (DEVONPORT)","North Urban East"]
[41142,"ALBERT RD (KELSTON)","West"]
[50679,"ALBERT RD (PAPATOETOE)","South West Urban"]
[36046,"ALBERT ST #14 (OTAHUHU/PVT)","South West Urban"]
[30023,"ALBERT ST (CITY)","Central"]
[10009,"ALBERT ST (LEIGH)","North Rural"]
[34691,"ALBERT ST (OTAHUHU)","South West Urban"]
[60033,"ALBERT ST (PAPAKURA)","South West Urban"]
[70913,"ALBERT ST (PUKEKOHE)","South Rural"]
[10011,"ALBERT ST 2 (RIVERHEAD)","North Rural"]
[36115,"ALBERT ST CARPARK (RP290 LHS)","South West Urban"]
[33120,"ALBERT ST LLA (CITY/RP339 LHS)","Central"]
[36093,"ALBERT ST LLA (CITY/RP517 LHS)","Central"]
[30024,"ALBERTA ST","Central"]
[23067,"ALBERTINE PL","North Urban West"]
[33220,"ALBERTON AVE","Central"]
[15333,"ALBERTON AVE/HAVERSTOCK RD CYWAY","Central"]
[50680,"ALBERTSON PL","South West Urban"]
[60034,"ALBION PL","South West Urban"]
[34688,"ALBION RD","South West Urban"]
[47271,"ALBIONVALE RD","West"]
[47152,"ALBIZIA AVE","West"]
[33221,"ALBRECHT AVE","Central"]
[11493,"ALBRO LANE","North Rural"]
[80691,"ALBRO LANE ACCESS (#18 - #42)","North Rural"]
[80692,"ALBRO LANE CARPARK","North Rural"]
[30025,"ALBURY AVE","Central"]
[33222,"ALCOCK ST","Central East"]
[53237,"ALCOVE PL","South West Urban"]
[47295,"ALDERBURY WAY","West"]
[33223,"ALDERLEY RD","Central"]
[41141,"ALDERMAN DR","West"]
[50681,"ALDERMAN PL","South West Urban"]
[41318,"ALDERMAN/RATANUI RAB","West"]
[41328,"ALDERMAN/SEL PEACOCK RAB","West"]
[41140,"ALDERN RD","West"]
[33224,"ALDERSGATE RD","Central"]
[53222,"ALDERSON LANE","South West Urban"]
[60035,"ALDERTON PL","South West Urban"]
[50682,"ALDO PL","South West Urban"]
[53054,"ALDON LANE","South West Urban"]
[30026,"ALDRED RD (REMUERA)","Central East"]
[70008,"ALDRED RD (WAIUKU)","South Rural"]
[70009,"ALDRIDGE RD","South Rural"]
[10012,"ALEC CRAIG WAY","North Urban East"]
[33227,"ALEX BOYD LINK","Central"]
[30029,"ALEX EVANS ST","Central"]
[50683,"ALEXANDER AVE (MARAETAI)","South Rural"]
[50684,"ALEXANDER AVE (PAPATOETOE)","South West Urban"]
[22237,"ALEXANDER AVE (WAIAKE)","North Urban East"]
[50685,"ALEXANDER CRES","South West Urban"]
[54094,"ALEXANDER CRES SERVICE LANE (RP795)","South West Urban"]
[15508,"ALEXANDER CRES/PARKER CRES CYWAY","South West Urban"]
[10013,"ALEXANDER RD","North Rural"]
[50686,"ALEXANDER ST (COCKLE BAY)","South East Urban"]
[30028,"ALEXANDER ST (KINGSLAND)","Central"]
[33226,"ALEXANDER ST (OTAHUHU)","South West Urban"]
[60036,"ALEXANDER ST (PAPAKURA)","South West Urban"]
[53695,"ALEXANDER ST/LITTEN RD WWAY","South East Urban"]
[10014,"ALEXANDRA ST (RIVERHEAD)","North Rural"]
[54196,"ALEXIA PL","South East Urban"]
[33228,"ALEXIS AVE","Central"]
[70011,"ALEY RD","South Rural"]
[10016,"ALF ACCESS RD","North Rural"]
[50687,"ALF PL","South East Urban"]
[60249,"ALF WALKER PL","South West Urban"]
[31785,"ALFORD ST","Central"]
[30033,"ALFRED ST (CITY)","Central"]
[21002,"ALFRED ST (NORTHCOTE)","North Urban West"]
[33229,"ALFRED ST (ONEHUNGA)","Central East"]
[31676,"ALFRED ST (ONEHUNGA/SOUTH)","Central East"]
[60431,"ALFRISTON RD (ARDMORE) (SR)","South Rural"]
[50689,"ALFRISTON RD (MANUREWA)","South West Urban"]
[80291,"ALFRISTON RD (MANUREWA) (SW)","South West Urban"]
[54075,"ALFRISTON RD CARPARK (RP481 LHS)","South West Urban"]
[54333,"ALFRISTON RD LLA (BROUGH - END)","South West Urban"]
[60525,"ALFRISTON/STRATFORD RAB","South West Urban"]
[60434,"ALFRISTON-ARDMORE RD (ARDMORE)","South Rural"]
[50688,"ALFRISTON-ARDMORE RD (MANUREWA)","South Rural"]
[47151,"ALI PL","West"]
[53067,"ALICANTE AVE","South West Urban"]
[10017,"ALICE AVE","North Urban East"]
[22661,"ALICE PL","North Urban West"]
[10018,"ALICE ST","North Rural"]
[50690,"ALICIA RD","South East Urban"]
[41139,"ALIDADE PL","West"]
[33230,"ALIFORD AVE","Central East"]
[41138,"ALISON AVE (HERALD ISLAND)","North Urban West"]
[20176,"ALISON AVE (TAKAPUNA)","North Urban East"]
[33231,"ALISON RD","Hauraki Islands"]
[31718,"ALISON/DONALD BRUCE RAB","Hauraki Islands"]
[71560,"ALLAN RD","South Rural"]
[50691,"ALLEN AVE","South West Urban"]
[30036,"ALLEN JOHNSTON PL","Central East"]
[35862,"ALLEN JOHNSTON/HOANI WWAY (RP275)","Central East"]
[35805,"ALLEN JOHNSTON/PANAPA WWAY (RP132)","Central East"]
[35580,"ALLEN LANE (PVT)","Central"]
[30034,"ALLEN RD (GREY LYNN)","Central"]
[33232,"ALLEN RD (MT WELLINGTON)","Central East"]
[35781,"ALLEN RD WWAY (RP292)","Central"]
[50692,"ALLEN ST","South West Urban"]
[22118,"ALLENBY AVE","North Urban East"]
[34689,"ALLENBY RD (PANMURE)","Central East"]
[50693,"ALLENBY RD (PAPATOETOE)","South West Urban"]
[54500,"ALLENBY RD CARPARK (RP111 RHS)","South West Urban"]
[54501,"ALLENBY RD CARPARK (RP39 RHS)","South East Urban"]
[34692,"ALLENDALE RD","Central"]
[35581,"ALLENDALE RISE (PVT)","Central"]
[22236,"ALLENDER DR","North Urban East"]
[50694,"ALLENS RD","South East Urban"]
[53601,"ALLERTON PL","South West Urban"]
[15427,"ALLERTON PL LINK CYWAY (RP127)","South West Urban"]
[15431,"ALLERTON PL LINK CYWAY (RP36)","South West Urban"]
[41137,"ALLINGTON RD","West"]
[48292,"ALLINGTON RD WWAY","West"]
[35965,"ALLISON FERGUSON DR (PVT)","Central East"]
[33233,"ALLISON ST","Central"]
[80275,"ALLOWAY ST","West"]
[80277,"ALLOWAY ST (WEST)","West"]
[80276,"ALLOWAY ST HAMMERHEAD","West"]
[33234,"ALLRIGHT PL","Central East"]
[60703,"ALLUM AVE","South West Urban"]
[30037,"ALLUM ST","Central East"]
[60037,"ALMA CRES","South West Urban"]
[20249,"ALMA RD","North Urban East"]
[34690,"ALMA ST (NEWMARKET)","Central"]
[21003,"ALMA ST (NORTHCOTE)","North Urban West"]
[41136,"ALMA ST (WAITAKERE)","West"]
[20547,"ALMADALE PL","North Urban West"]
[50695,"ALMAY PL","South West Urban"]
[22723,"ALMOND GR","North Urban West"]
[33235,"ALMOND PL","Central East"]
[30038,"ALMORAH PL","Central"]
[30039,"ALMORAH RD","Central"]
[22238,"ALNACK PL","North Urban East"]
[11553,"ALNWICK RD","North Rural"]
[10019,"ALNWICK ST","North Rural"]
[30040,"ALPERS AVE","Central"]
[60038,"ALPHA ST","South West Urban"]
[10020,"ALPINE RD","North Rural"]
[71423,"ALPITO PL","South Rural"]
[41135,"ALSTON AVE","West"]
[50696,"ALTA TCE","South East Urban"]
[22546,"ALTAIR PL","North Urban East"]
[30041,"ALTEN RD","Central"]
[33237,"ALTHAM AVE","Central"]
[21004,"ALTON AVE","North Urban West"]
[50697,"ALTON TCE","South East Urban"]
[20303,"ALTONA RD","North Urban East"]
[11536,"ALVERNA HEIGHTS VIEW","North Urban East"]
[30042,"ALVERSTON ST","Central"]
[53485,"ALVRE PL","South East Urban"]
[41134,"ALWYN AVE","West"]
[52863,"AMADEUS PL","South East Urban"]
[10021,"AMANDA LANE","North Rural"]
[33236,"AMANDALE AVE","Central"]
[22239,"AMANTE CRES","North Urban East"]
[53633,"AMAPUR PL","South East Urban"]
[53661,"AMARETTO AVE","South East Urban"]
[53208,"AMARILLO PL","South West Urban"]
[33238,"AMARU RD","Central East"]
[31678,"AMARU/MARIRI RAB","Central East"]
[31677,"AMARU/MOANA RAB","Central East"]
[35277,"AMAZON PDE (PVT)","Central"]
[11186,"AMBASSADOR GLADE","North Urban East"]
[22869,"AMBER GLEN","North Urban West"]
[11369,"AMBER PL","North Rural"]
[41133,"AMBERLEY AVE","West"]
[11439,"AMBERLY RISE","North Rural"]
[52825,"AMBERWOOD DR","South East Urban"]
[53457,"AMBERWOOD/CHERRYWOOD RAB","South East Urban"]
[40158,"AMBLER AVE","West"]
[52901,"AMBLESIDE DR","South East Urban"]
[54479,"AMBLESIDE DR HLA (#12 - #22)","South East Urban"]
[40029,"AMBRICO PL","West"]
[30043,"AMBROSE ST","Central"]
[33239,"AMBURY AVE","Central"]
[35582,"AMBURY CRT (PVT)","Central"]
[50698,"AMBURY RD","South West Urban"]
[15541,"AMBURY REGIONAL PARK BIRD HIDE LINK CYWAY","South West Urban"]
[15543,"AMBURY REGIONAL PARK LAGOON - BEACH CYWAY","South West Urban"]
[15539,"AMBURY REGIONAL PARK LAGOON LINK CYWAY","South West Urban"]
[15535,"AMBURY REGIONAL PARK LAGOON LOOP CYWAY","South West Urban"]
[15542,"AMBURY REGIONAL PARK REVEGETATION LOOP CYWAY","South West Urban"]
[70013,"AMBUSH RD","South Rural"]
[50699,"AMELIA EARHART AVE","South West Urban"]
[22003,"AMELIA PL","North Urban West"]
[53364,"AMERA PL","South East Urban"]
[50700,"AMERCE PL","South East Urban"]
[50701,"AMERSHAM WAY","South West Urban"]
[41282,"AMERY PL","West"]
[47091,"AMESBURY RISE","West"]
[50702,"AMETHYST PL","South West Urban"]
[22735,"AMHERST PL","North Urban West"]
[22736,"AMHERST PL HAMMERHEAD","North Urban West"]
[30044,"AMIRIA ST","Central"]
[41132,"AMOKURA ST","West"]
[53449,"AMON AVE","South East Urban"]
[10022,"AMORINO DR","North Urban East"]
[15047,"AMORINO DR LINK CYWAY","North Urban East"]
[10158,"AMREINS RD (TAUPAKI)","North Rural"]
[41131,"AMREINS RD (WAITAKERE)","West"]
[30045,"AMSTERDAM PL","West"]
[50703,"AMURI PL","South West Urban"]
[33240,"AMY ST","Central East"]
[53230,"AMYLYNN PL","South East Urban"]
[52884,"ANAHEIM BLVD","South East Urban"]
[54426,"ANAHEIM BLVD LOOP","South East Urban"]
[20245,"ANAKIWA PL","North Urban East"]
[50704,"ANALIE PL","South East Urban"]
[50705,"ANARAHI PL","South West Urban"]
[41130,"ANAWHATA RD","West"]
[22004,"ANCHOR PL","North Urban West"]
[70014,"ANCHOR RD","South Rural"]
[60606,"ANCHORAGE DR","South West Urban"]
[60610,"ANCHORAGE/FOUNTAIN RAB","South West Urban"]
[11521,"ANCHORITE WAY","North Urban East"]
[50706,"ANCONA LANE  (PVT)","South West Urban"]
[80358,"ANDALUSIAN WAY","South West Urban"]
[22944,"ANDARA CLOSE","North Urban West"]
[41129,"ANDELKO PL","West"]
[48084,"ANDELKO PL WWAY","West"]
[20164,"ANDER PL","North Urban East"]
[30046,"ANDERSON AVE","Central East"]
[10023,"ANDERSON RD (MATAKANA)","North Rural"]
[10024,"ANDERSON RD 2 (KAUKAPAKAPA)","North Rural"]
[31608,"ANDERSON/HOLLAND RAB","Central East"]
[31610,"ANDERSON/ROPATA RAB","Central East"]
[31609,"ANDERSON/WADDELL RAB","Central East"]
[22240,"ANDERSONS RD (EAST)","North Urban East"]
[20669,"ANDERSONS RD (WEST)","North Urban West"]
[50707,"ANDES AVE","South West Urban"]
[33241,"ANDES PL","Central"]
[53238,"ANDOVER WAY","South West Urban"]
[11559,"ANDRE RISE","North Urban East"]
[50708,"ANDREA PL","South East Urban"]
[50709,"ANDREW BAXTER DR","South West Urban"]
[80728,"ANDREW JACK ROAD","North Urban East"]
[50710,"ANDREW MCKEE AVE (AIRPORT)","South West Urban"]
[70015,"ANDREW PYE RD","South Rural"]
[50711,"ANDREW RD","South East Urban"]
[50712,"ANDROMEDA CRES","South East Urban"]
[20703,"ANDROS PL","North Urban West"]
[53482,"ANDRUSHA PL","South East Urban"]
[54025,"ANDY CRES","South East Urban"]
[11448,"ANGEL WAY","North Urban East"]
[41128,"ANGELINE PL","West"]
[50713,"ANGELO AVE","South East Urban"]
[15758,"ANGELO AVE/DELL WAY CYWAY","South East Urban"]
[15758,"ANGELO AVE/DELL WAY CYWAY","South West Urban"]
[33242,"ANGLE ST","Central East"]
[50714,"ANGLERS WAY","South West Urban"]
[30047,"ANGLESEA ST","Central"]
[15236,"ANGLESEA ST LINK CYWAY","Central"]
[50715,"ANGUS ST","South West Urban"]
[41127,"ANICH RD","West"]
[41161,"ANICH/ZITA MARIA SLIP","West"]
[33243,"ANITA AVE","Central"]
[80131,"ANNA PL","West"]
[50716,"ANNA WATSON RD","South East Urban"]
[52976,"ANNAGARY RISE","South East Urban"]
[80531,"ANNALISE PLACE","North Urban East"]
[52904,"ANNALONG RD","South East Urban"]
[53476,"ANNAMOE PL","South East Urban"]
[30048,"ANNAN ST","Central"]
[10025,"ANNANDALE RD","North Rural"]
[20471,"ANNE MCLEAN DR","North Urban West"]
[20275,"ANNE RD","North Urban West"]
[20233,"ANNE ST","North Urban East"]
[10026,"ANNETT RD","North Rural"]
[41126,"ANNETTE AVE","West"]
[71382,"ANNIESTON PL","South Rural"]
[41125,"ANNISON AVE","West"]
[48049,"ANNISON AVE WWAY","West"]
[53224,"ANRATH CLOSE","South East Urban"]
[71513,"ANSELMI RIDGE RD","South Rural"]
[53684,"ANSETT PL (AIRPORT)","South West Urban"]
[30049,"ANSON PL","Central East"]
[50717,"ANSON ROW","South West Urban"]
[50718,"ANSTY PL","South West Urban"]
[50719,"ANTALYA PL","South West Urban"]
[22909,"ANTARES PL","North Urban West"]
[50720,"ANTHONY PL","South East Urban"]
[50721,"ANTILLA PL","South East Urban"]
[60504,"ANTON PL","South West Urban"]
[50722,"ANTRIM CRES","South West Urban"]
[22585,"ANTRIM GR","North Urban West"]
[53274,"ANTYCH PL","South West Urban"]
[50723,"ANURE PL","South East Urban"]
[10027,"ANVIL RD","North Urban East"]
[20872,"ANZAC / INVERNESS RD SERVICE LANE","North Urban East"]
[30050,"ANZAC AVE","Central"]
[22241,"ANZAC RD (BROWNS BAY)","North Urban East"]
[70914,"ANZAC RD (PUKEKOHE)","South Rural"]
[34994,"ANZAC RD (WAIHEKE)","Hauraki Islands"]
[80626,"ANZAC RD CARPARK","North Urban East"]
[26073,"ANZAC RD CARPARK DP10801","North Urban East"]
[20021,"ANZAC ST","North Urban East"]
[26035,"ANZAC ST SMALL CARPARK","North Urban East"]
[40206,"ANZAC VALLEY RD","West"]
[35761,"ANZAC/BEACH WWAY (RP168 LHS)","Central"]
[22005,"AORANGI PL","North Urban West"]
[54567,"AORERE PARK ACCESS","South West Urban"]
[54568,"AORERE PARK ACCESS CARPARK (RP14)","South West Urban"]
[30051,"AORERE ST","Central"]
[35034,"AOTEA RD (GREAT BARRIER)","Hauraki Islands"]
[41124,"AOTEA RD (WAITAKERE)","West"]
[35050,"AOTEA RD BEACH ACCESS (RP13408 RHS)","Hauraki Islands"]
[30052,"AOTEA SQ","Central"]
[30053,"AOTEA ST","Central East"]
[22242,"AOTEAROA TCE","North Urban East"]
[30054,"APIHAI ST","Central East"]
[30055,"APIRANA AVE","Central East"]
[80642,"APIRANA AVE CARPARK (RP1440 LHS)","Central East"]
[35827,"APIRANA/MERTON RAB","Central East"]
[35828,"APIRANA/TANIWHA RAB","Central East"]
[22007,"APLIN PL","North Urban West"]
[20677,"APOLLO DR","North Urban West"]
[80679,"APORO DRIVE","North Rural"]
[80658,"APPALOOSA ST","South West Urban"]
[22873,"APPIAN WAY","North Urban West"]
[80582,"APPLE ORCHARD WAY","West"]
[80583,"APPLE ORCHARD WAY (NORTH)","West"]
[47266,"APPLEBOX LANE","West"]
[50724,"APPLEBY PL","South West Urban"]
[20635,"APPLEBY RD (ALBANY)","North Urban West"]
[60394,"APPLEBY RD (DRURY)","South Rural"]
[11327,"APPLEMOORS WAY","North Rural"]
[41123,"APPLEWOOD DR","West"]
[30056,"APPLEYARD CRES","Central East"]
[10502,"APPOLLO PL","North Rural"]
[60039,"APRIL PL","South West Urban"]
[47296,"APSLEY RISE","West"]
[40166,"AQUARIUS AVE","West"]
[15102,"AQUARIUS AVE/KAMARA RD CYWAY","West"]
[80538,"ARA KAKARA AVE","North Rural"]
[30057,"ARA ST","Central East"]
[11454,"ARABELLA LANE","North Rural"]
[33244,"ARABI ST","Central"]
[30058,"ARAGON AVE","Central East"]
[21005,"ARAHIA ST","North Urban West"]
[41122,"ARAHOE RD","West"]
[50726,"ARA-KOTINGA","South Rural"]
[80703,"ARA-KOTINGA ACCESSWAY 4 (PVT)","South Rural"]
[80704,"ARA-KOTINGA ACCESSWAY 5 (PVT)","South Rural"]
[20359,"ARALIA RD","North Urban East"]
[41121,"ARAMA AVE","West"]
[53036,"ARAMINTA PL","South Rural"]
[22508,"ARAMOANA AVE","North Urban East"]
[20289,"ARAMOANA AVE LLA","North Urban East"]
[33245,"ARAMUTU RD","Central"]
[71200,"ARANA DR","South Rural"]
[33247,"ARANUI RD","Central East"]
[36047,"ARANUI RD (PVT)","Central East"]
[41120,"ARAPITO RD","West"]
[33248,"ARAPUNI AVE","Central East"]
[70017,"ARARIMU RD","South Rural"]
[10028,"ARARIMU VALLEY RD","North Rural"]
[50727,"ARA-TAI","South East Urban"]
[54678,"ARA-TAI CARPARK (RP239 LHS)","South East Urban"]
[50728,"ARATIATIA ST (PVT)","South West Urban"]
[33249,"ARATONGA AVE","Central"]
[22078,"ARAWA AVE","North Urban East"]
[30059,"ARAWA ST (GRAFTON)","Central"]
[60040,"ARAWA ST (PAPAKURA)","South West Urban"]
[40067,"ARAWA ST (WAITAKERE)","West"]
[50729,"ARBOR CLOSE","South West Urban"]
[54305,"ARBOR CLOSE EXTN #1","South West Urban"]
[54306,"ARBOR CLOSE EXTN #2","South West Urban"]
[80293,"ARBORS TRACK","North Urban East"]
[48236,"ARBOUR CLIGHTS CLS WWAY","North Urban West"]
[20476,"ARCADIA CRES","North Urban West"]
[30060,"ARCADIA RD","Central"]
[50730,"ARCHBOYD AVE","South West Urban"]
[30061,"ARCHDALL ST","Central East"]
[22979,"ARCHER RAYNER PL","North Urban West"]
[20026,"ARCHERS RD","North Urban West"]
[20563,"ARCHERS RD HLA (#57 - #79)","North Urban West"]
[22556,"ARCHERS RD LLA","North Urban West"]
[41118,"ARCHIBALD RD","West"]
[41217,"ARCHIBALD/ST LEONARDS RAB","West"]
[41117,"ARCHLYNN RD","West"]
[50731,"ARCHMILLEN AVE","South East Urban"]
[52977,"ARDAGH PL","South East Urban"]
[41116,"ARDE PL","West"]
[53220,"ARDEE CLOSE","South East Urban"]
[50732,"ARDEN CRT","South West Urban"]
[10029,"ARDERN AVE","North Urban East"]
[53566,"ARDKEEN PL","South East Urban"]
[54012,"ARDKEEN PL/TE IRIRANGI DR WWAY","South East Urban"]
[10030,"ARDLUI AVE","North Urban East"]
[60286,"ARDMORE QUARRY RD","South Rural"]
[30062,"ARDMORE RD","Central"]
[11200,"ARGENT LANE","North Rural"]
[54557,"ARGENTO AVE","South East Urban"]
[50733,"ARGO DR","South East Urban"]
[15804,"ARGO DR LINK CYWAY","South East Urban"]
[10031,"ARGO RISE","North Rural"]
[20277,"ARGUS PL","North Urban West"]
[60041,"ARGYLE AVE","South West Urban"]
[22244,"ARGYLE RD","North Urban East"]
[30063,"ARGYLE ST (HERNE BAY)","Central"]
[34693,"ARGYLE ST (ST LUKES)","Central"]
[20215,"ARGYLE TCE","North Urban East"]
[53481,"ARI LANE","South West Urban"]
[50734,"ARIA PL","South West Urban"]
[80624,"ARIEL PL","North Rural"]
[50735,"ARIES PL","South East Urban"]
[53138,"ARIGNA PL","South East Urban"]
[22102,"ARIHO TCE","North Urban East"]
[10032,"ARIKI DR","North Rural"]
[60042,"ARIKI PL","South West Urban"]
[30064,"ARIKI ST","Central"]
[60043,"ARIMU PL","South West Urban"]
[60489,"ARIMU RD","South West Urban"]
[60630,"ARION RD","South West Urban"]
[80650,"ARION/KAURI HEART RAB","South West Urban"]
[22619,"ARIRANG RISE","North Urban West"]
[60486,"ARISTOY CLOSE","South West Urban"]
[10033,"ARKLES DR","North Urban East"]
[10034,"ARKLES STRAND","North Urban East"]
[50736,"ARKLEY AVE","South East Urban"]
[10035,"ARKLOW LANE","North Urban East"]
[41115,"ARLETTE PL","West"]
[48308,"ARLETTE PL WWAY","West"]
[30065,"ARLINGTON ST","Central"]
[47189,"ARLOSE PL","West"]
[48298,"ARLOSE PL WWAY","West"]
[41114,"ARMADA DR","West"]
[30066,"ARMADALE RD","Central East"]
[30067,"ARMAGH RD","West"]
[33251,"ARMEIN RD","Central East"]
[10036,"ARMITAGE RD","North Rural"]
[41113,"ARMOUR RD","West"]
[53139,"ARMOY DR","South East Urban"]
[53360,"ARMOY/ARDEE RAB","South East Urban"]
[53361,"ARMOY/CHAPELTOWN RAB","South East Urban"]
[53399,"ARMSTRONG FARM DR","South East Urban"]
[40072,"ARMSTRONG PL","West"]
[20721,"ARMSTRONG RD","North Urban West"]
[30068,"ARNEY CRES","Central East"]
[35652,"ARNEY CRES LLA (RP163 LHS)","Central East"]
[30069,"ARNEY RD (REMUERA)","Central East"]
[41112,"ARNEY RD (WAITAKERE)","West"]
[70915,"ARNHEM PL","South Rural"]
[30070,"ARNOLD ST","Central"]
[15246,"ARNOLD ST/GREY LYNN PARK LINK CYWAY (RP200)","Central"]
[15252,"ARNOLD ST/GREY LYNN PARK LINK CYWAY (RP276)","Central"]
[50737,"ARNWOOD ST","South West Urban"]
[53698,"ARNWOOD ST/WENLOCK PL WWAY","South West Urban"]
[80706,"ARO MATO PLACE","North Rural"]
[41111,"ARODELLA CRES","West"]
[33252,"AROHA AVE","Central"]
[10037,"AROHIA PL","North Rural"]
[50738,"ARONIA WAY","South West Urban"]
[41109,"ARONUI TCE","West"]
[20309,"AROSA PL","North Urban East"]
[34686,"AROTAU PL","Central"]
[35654,"ARRAN BAY RD (PVT)","Hauraki Islands"]
[15020,"ARRAN DR/MILLWATER PARKWAY CYWAY","North Urban East"]
[80400,"ARRAN DRIVE","North Urban East"]
[22245,"ARRAN RD","North Urban East"]
[30071,"ARRAN ST","West"]
[54219,"ARRANMORE DR","South East Urban"]
[52941,"ARRATHORNE PL","South East Urban"]
[22795,"ARRENWAY DR","North Urban West"]
[80713,"ARRIERE LANE","North Urban East"]
[33253,"ARRON ST","Central East"]
[20301,"ARROW RD","North Urban East"]
[53140,"ARROWSMITH DR","South East Urban"]
[10245,"ARROWSMITH RD","West"]
[52866,"ARTESIA CLOSE","South East Urban"]
[33255,"ARTHUR BROWN PL","Central East"]
[71460,"ARTHUR CARWEN PL","South Rural"]
[20135,"ARTHUR CRES","North Urban East"]
[60044,"ARTHUR PL","South West Urban"]
[50739,"ARTHUR RD","South West Urban"]
[80670,"ARTHUR ROLFE LANE","West"]
[34687,"ARTHUR ST (ELLERSLIE)","Central East"]
[33254,"ARTHUR ST (FREEMANS BAY)","Central"]
[30072,"ARTHUR ST (ONEHUNGA)","Central East"]
[10039,"ARTHUR ST (RIVERHEAD)","North Rural"]
[35635,"ARTHUR ST SERVICE LANE (RP859 RHS)","Central East"]
[31662,"ARTHUR/VICTORIA RAB","Central East"]
[60045,"ARTILLERY DR","South West Urban"]
[54014,"ARTISAN PL","South East Urban"]
[80570,"ARTIST AVE","South Rural"]
[31709,"ARUHE ST","Central East"]
[10040,"ARUN ST","North Urban East"]
[33256,"ARUNDEL ST","Central"]
[50740,"ARWEN PL","South East Urban"]
[22246,"ASBURY CRES","North Urban East"]
[33257,"ASCANIA PL","Central"]
[80586,"ASCENSION CRES","North Urban East"]
[20678,"ASCENSION PL","North Urban West"]
[24110,"ASCOT AVE - ALBANY (PVT)","North Urban East"]
[22151,"ASCOT AVE (DEVONPORT)","North Urban East"]
[30073,"ASCOT AVE (REMUERA)","Central East"]
[41108,"ASCOT AVE (WAITAKERE)","West"]
[48196,"ASCOT AVE WWAY","West"]
[50741,"ASCOT RD","South West Urban"]
[11170,"ASCOT WAY","North Urban East"]
[31605,"ASCOT/ELLERSLIE RACECOURSE RAB #1","Central East"]
[31604,"ASCOT/ELLERSLIE RACECOURSE RAB #2","Central East"]
[24058,"ASH AVE (PVT)","North Urban West"]
[50742,"ASH RD","South West Urban"]
[30074,"ASH ST","West"]
[30759,"ASH ST (EASTBOUND)","West"]
[30768,"ASH ST EXTN (RP1405 RHS)","West"]
[33067,"ASH ST EXTN HAMMERHEAD","West"]
[35751,"ASH/ASH EXT WWAY (RP1393 LHS)","West"]
[41107,"ASHBOURNE PL","West"]
[11383,"ASHBURN CLOSE","North Urban East"]
[30075,"ASHBY AVE","Central East"]
[20713,"ASHBY PL (GLENFIELD)","North Urban West"]
[70916,"ASHBY PL (PUKEKOHE)","South Rural"]
[22247,"ASHCRAIG CRT","North Urban East"]
[50743,"ASHCROFT AVE","South West Urban"]
[53699,"ASHCROFT AVE/ANARAHI PL WWAY","South West Urban"]
[60046,"ASHDOWN PL","South West Urban"]
[20402,"ASHFIELD RD","North Urban West"]
[50744,"ASHGROVE RD","South West Urban"]
[53700,"ASHGROVE RD/RUSH PL WWAY","South West Urban"]
[53477,"ASHKIRK PL","South West Urban"]
[53128,"ASHLAND PL","South West Urban"]
[20742,"ASHLEY AVE (LONG BAY)","North Urban East"]
[50745,"ASHLEY AVE (MANGERE)","South West Urban"]
[54164,"ASHLEY AVE CARPARK (RP17 RHS)","South West Urban"]
[50746,"ASHLYNNE AVE","South West Urban"]
[53261,"ASHMERE LANE","South West Urban"]
[11435,"ASHMORE CRES","North Rural"]
[50747,"ASHMORE PL","South West Urban"]
[53701,"ASHMORE PL/CURLEW PL WWAY","South West Urban"]
[50748,"ASHTON AVE","South West Urban"]
[33258,"ASHTON RD (MT EDEN)","Central"]
[10041,"ASHTON RD (OMAHA)","North Rural"]
[22975,"ASHURST LANE","North Urban West"]
[30076,"ASHWELL ST","Central East"]
[11442,"ASHWOOD AVE","North Rural"]
[53328,"ASICS DR","South West Urban"]
[54026,"ASKERNE DR","South East Urban"]
[35001,"ASKEW AVE (RAK)","Hauraki Islands"]
[50749,"ASKEW PL","South East Urban"]
[60600,"ASOLA PL","South West Urban"]
[52940,"ASPATRIA PL","South East Urban"]
[30077,"ASPEN ST","West"]
[53320,"ASPENWOOD PL","South West Urban"]
[50750,"ASPIRING AVE","South East Urban"]
[30078,"ASQUITH AVE","Central"]
[50751,"ASTELIA PL","South West Urban"]
[54828,"ASTER PL","South East Urban"]
[41106,"ASTI LANE","West"]
[40101,"ASTLEY AVE","West"]
[41325,"ASTLEY/MARGAN RAB","West"]
[50752,"ASTOR PL (MANUREWA)","South West Urban"]
[11187,"ASTOR PL (OREWA)","North Urban East"]
[52828,"ASTORIA PL","South East Urban"]
[50753,"ASTRAL PL","South West Urban"]
[11578,"ASTRID LANE","North Rural"]
[10042,"ASTROLABE PL","North Urban East"]
[33259,"ATANGA AVE","Central"]
[32967,"ATARANGI RD","Central"]
[35966,"ATARETA ST (PVT)","Central East"]
[41105,"ATARUA GARDENS","West"]
[36045,"ATAWHAI LANE (PVT)","Central"]
[50754,"ATHELSTAN PL","South West Urban"]
[20361,"ATHENA DR","North Urban West"]
[33262,"ATHENIC AVE","Central"]
[52975,"ATHENRY PL","South East Urban"]
[33263,"ATHENS RD","Central East"]
[30079,"ATHERTON RD","Central"]
[30080,"ATHLONE RD","Central East"]
[11352,"ATHOL PL (ALGIES BAY)","North Rural"]
[30081,"ATHOL PL (ST HELIERS)","Central East"]
[53580,"ATHY PL","South West Urban"]
[52870,"ATIU PL","South West Urban"]
[30082,"ATKIN AVE","Central East"]
[10043,"ATKINS RD","North Rural"]
[33264,"ATKINSON AVE (OTAHUHU)","South West Urban"]
[50755,"ATKINSON AVE (PAPATOETOE)","South West Urban"]
[36014,"ATKINSON AVE CARPARK (RP692 RHS)","South West Urban"]
[41104,"ATKINSON RD","West"]
[48033,"ATKINSON RD WWAY","West"]
[48034,"ATKINSON RD/CAPTAIN SCOTT RD WWAY","West"]
[48032,"ATKINSON RD/CHAMARI CLOSE WWAY","West"]
[48036,"ATKINSON RD/KAWAKA ST WWAY","West"]
[48035,"ATKINSON RD/NORMAN RD WWAY","West"]
[53083,"ATLANTIC PL","South West Urban"]
[20370,"ATLANTIS PL","North Urban West"]
[20679,"ATLAS PL","North Urban West"]
[70020,"ATTEWELL RD","South Rural"]
[11416,"ATTITUDE AVE","North Rural"]
[20645,"ATTWOOD RD","North Urban West"]
[53225,"ATTYMON LANE","South East Urban"]
[52990,"ATWORTH WAY","South East Urban"]
[10044,"AUBREY RD","North Urban East"]
[30083,"AUBURN ST (GRAFTON)","Central"]
[20039,"AUBURN ST (TAKAPUNA)","North Urban East"]
[30084,"AUCKLAND RD","Central East"]
[10045,"AUCKLAND RD (SH1 WARKWORTH)","North Rural"]
[33121,"AUCKLAND RD LLA (#6 - #28)","Central East"]
[35792,"AUCKLAND/THE PARADE WWAY (RP380)","Central East"]
[52845,"AUDEN CLOSE","South East Urban"]
[11206,"AUDREY LUCKENS LANE","North Rural"]
[20562,"AUDREY RD","North Urban East"]
[71479,"AUFIDIUS PL","South Rural"]
[80461,"AUGER LANE","North Urban East"]
[33265,"AUGUST PL","Central East"]
[20323,"AUGUSTA PL","North Urban East"]
[30087,"AUGUSTUS TCE","Central"]
[35757,"AUGUSTUS/THE STRAND WWAY (END)","Central"]
[22248,"AULD ST","North Urban East"]
[22249,"AULD ST LLA (#5 - #21)","North Urban East"]
[71246,"AULYN DR","South Rural"]
[30086,"AUMOE AVE","Central East"]
[52994,"AUNCESTON RISE","South West Urban"]
[50757,"AUREA AVE","South East Urban"]
[33266,"AURORA AVE (OWAIRAKA)","Central"]
[10047,"AURORA AVE (SNELLS BEACH)","North Rural"]
[15285,"AURORA AVE/WALMSLEY PARK LINK CYWAY","Central"]
[35705,"AURORA/MT ALBERT WWAY (RP205)","Central"]
[71419,"AUSTEN PL","South Rural"]
[50758,"AUSTER PL","South West Urban"]
[80392,"AUSTIN BRAVE PL","South West Urban"]
[10048,"AUSTIN RD (DAIRY FLAT)","North Rural"]
[20623,"AUSTIN RD (GREENHITHE)","North Urban West"]
[40145,"AUTUMN AVE","West"]
[33268,"AUTUMN PL (PVT)","Central East"]
[41103,"AVA AVE","West"]
[33269,"AVALON CRT (PVT)","South West Urban"]
[20414,"AVALON PL","North Urban West"]
[30088,"AVELINE PL","Central East"]
[41102,"AVENGER PL","West"]
[33270,"AVENHAM WALK","Central"]
[33271,"AVENUE RD","South West Urban"]
[34896,"AVENUE RD EAST","South West Urban"]
[30089,"AVERILL AVE","Central East"]
[60047,"AVERILL ST","South West Urban"]
[60675,"AVERILL ST CARPARK (RP117 LHS)","South West Urban"]
[50759,"AVERTON PL","South East Urban"]
[54784,"AVIANO CLOSE","South East Urban"]
[53196,"AVIARA CRT","South East Urban"]
[30090,"AVICE ST","Central East"]
[50760,"AVIEMORE DR","South East Urban"]
[15637,"AVIEMORE DR LINK CYWAY (RP1717)","South East Urban"]
[15635,"AVIEMORE DR LINK CYWAY(RP655)","South East Urban"]
[15760,"AVIEMORE DR/PALMCREST GR CYWAY","South East Urban"]
[50761,"AVIS AVE","South West Urban"]
[50762,"AVOCA RD","South East Urban"]
[30091,"AVON LANE","Central"]
[33205,"AVON ST","Central"]
[71403,"AVONBROOK LANE","South Rural"]
[30093,"AVONDALE RD","West"]
[53282,"AVONGLEN CRT","South West Urban"]
[71407,"AVONLEA RD","South Rural"]
[41101,"AVONLEIGH RD","West"]
[50763,"AVRO PL","South West Urban"]
[10049,"AWA RD","North Rural"]
[33272,"AWA ST","South West Urban"]
[15505,"AWA ST/FORT RICHARD RD CYWAY","South West Urban"]
[34995,"AWAAWAROA RD","Hauraki Islands"]
[50764,"AWAKINO PL","South West Urban"]
[10050,"AWANOHI RD","North Rural"]
[80625,"AWANUI CRES","North Rural"]
[60283,"AWANUI RISE","South West Urban"]
[22008,"AWANUI ST","North Urban West"]
[10051,"AWAPEKA RD","North Rural"]
[11130,"AWAROA RD (HELENSVILLE)","North Rural"]
[41100,"AWAROA RD (SUNNYVALE)","West"]
[71344,"AWAROA STREAM DR","South Rural"]
[30094,"AWARUA CRES","Central East"]
[22250,"AWARUKU RD","North Urban East"]
[22539,"AWARUKU RD ACCESSWAY (118 - 134)","North Urban East"]
[20615,"AWATAHI PL","North Urban West"]
[30095,"AWATEA RD","Central"]
[10052,"AWATERE PL","North Rural"]
[50765,"AWATERE ST","South West Urban"]
[41099,"AWHIORANGI PROM","West"]
[70025,"AWHITU CENTRAL RD","South Rural"]
[70027,"AWHITU GULLY RD","South Rural"]
[70028,"AWHITU RD","South Rural"]
[70246,"AWHITU RD/KOHEKOHE-KARIOITAHI SLIP","South Rural"]
[70029,"AXTENS RD","South Rural"]
[41098,"AYDON RD","West"]
[50766,"AYLESBURY ST","South East Urban"]
[54749,"AYLESBURY/PEPLER RAB","South East Urban"]
[50767,"AYLMER CRT","South East Urban"]
[50768,"AYR RD","South East Urban"]
[30098,"AYR ST","Central"]
[33122,"AYR ST HLA (#10 - #24)","Central"]
[50769,"AYRSHIRE PL","South East Urban"]
[41097,"AYRTON ST","West"]
[20384,"AYTON DR","North Urban West"]
[50770,"AZALEA PL (MANUREWA)","South West Urban"]
[70908,"AZALEA PL (WAIUKU)","South Rural"]
[50771,"AZARA PL","South West Urban"]
[60284,"AZTEC PL","South West Urban"]
[20704,"AZURE GR","North Urban West"]
[80562,"AZZURRO WAY","South East Urban"]
[70030,"B.WESTHEAD RD","South Rural"]
[35974,"BABER DR","Central East"]
[41096,"BABICH RD","West"]
[41433,"BABICH RD NORTH","West"]
[22251,"BABINGTON PL","North Urban East"]
[60295,"BACARDI PL","South West Urban"]
[41095,"BACKHURST GR","West"]
[30482,"BACONS LANE","Central"]
[50772,"BACOT PL","South East Urban"]
[30100,"BADDELEY AVE","Central East"]
[31555,"BADDELEY/HAWERA RAB","Central East"]
[31554,"BADDELEY/SOUTHERN CROSS RAB","Central East"]
[10053,"BADDELEYS BEACH RD","North Rural"]
[30101,"BADEN POWELL PL","Central East"]
[50773,"BADER DR (EASTBOUND)","South West Urban"]
[54611,"BADER DR (WESTBOUND)","South West Urban"]
[54612,"BADER DR BUS LOOP","South West Urban"]
[54624,"BADER DR/MCKENZIE RD SLIP","South West Urban"]
[54604,"BADER/MASCOT RAB","South West Urban"]
[54610,"BADER/ORLY RAB","South West Urban"]
[54613,"BADER/SHOPPING CENTRE RAB","South West Urban"]
[41436,"BAFFIN ST","North Urban West"]
[33273,"BAGLEY ST","Central"]
[30102,"BAGNALL AVE","Central East"]
[35875,"BAGNALL/TRIPOLI WWAY (RP186 LHS)","Central East"]
[50774,"BAHAMA PL","South West Urban"]
[41094,"BAHARI DR","West"]
[15113,"BAHARI DR/SABOT PL CYWAY","West"]
[30103,"BAILDON RD","Central"]
[33274,"BAILEY RD (MT WELLINGTON)","Central East"]
[10054,"BAILEY RD (TE HANA)","North Rural"]
[50775,"BAIN PL","South East Urban"]
[50776,"BAIRD ST","South East Urban"]
[50777,"BAIRDS RD","South West Urban"]
[54818,"BAIRDS RD CARPARK (RP2082 RHS)","South West Urban"]
[54092,"BAIRDS RD CARPARK (RP2287 RHS)","South West Urban"]
[54096,"BAIRDS RD EXTN (RP3213 LHS)","South West Urban"]
[52926,"BAIRDS RD SERVICE LANE (RP522 RHS)","South West Urban"]
[15520,"BAIRDS RD/EVERITT RD CYWAY","South West Urban"]
[11292,"BAKEHOUSE LANE","North Urban East"]
[41213,"BAKER LANE (PVT)","West"]
[34694,"BAKER PL","Central East"]
[23060,"BAKER ST (ALBANY)","North Urban West"]
[10055,"BAKER ST (HELENSVILLE)","North Rural"]
[50778,"BAKERFIELD PL","South West Urban"]
[53703,"BALANCE AVE/SEDDON AVE WWAY","South West Urban"]
[11470,"BALBOA DR","North Urban East"]
[52978,"BALBRIGGAN RISE","South East Urban"]
[10056,"BALD HILL RD","North Rural"]
[70032,"BALDHILL RD","South Rural"]
[71562,"BALDHILL RD CARPARK (RP4772 LHS)","South Rural"]
[33275,"BALDWIN AVE","Central"]
[33276,"BALDWIN ST","South West Urban"]
[33277,"BALEDEN LANE","Central"]
[15331,"BALEDEN LN/BALMER LN CYWAY","Central"]
[50779,"BALFOUR RD (MANUREWA)","South West Urban"]
[30104,"BALFOUR RD (PARNELL)","Central"]
[20069,"BALFOUR ST","North Urban East"]
[33278,"BALFRON AVE","Central"]
[35700,"BALFRON/FREELAND WWAY (RP140)","Central"]
[60290,"BALGOWAN TCE","South West Urban"]
[60527,"BALGOWAN TCE HAMMERHEAD (NORTH)","South West Urban"]
[60526,"BALGOWAN TCE HAMMERHEAD (SOUTH)","South West Urban"]
[33280,"BALL PL","Central"]
[53167,"BALLA PL","South East Urban"]
[50780,"BALLANCE AVE","South West Urban"]
[30105,"BALLARAT ST","Central East"]
[31681,"BALLARAT ST (NORTH)","Central East"]
[36017,"BALLAST LANE (NEW NORTH RD/RP4855)","Central"]
[50781,"BALLATER PL","South East Urban"]
[54701,"BALLATER PL EXTN","South East Urban"]
[15736,"BALLATER PL/CROMDALE AVE CYWAY","South East Urban"]
[41093,"BALLIAL PL","West"]
[33281,"BALLIN ST","Central East"]
[50725,"BALLINDRAIT DR","South East Urban"]
[41168,"BALLINI RISE","North Urban West"]
[48239,"BALLINI RISE WWAY","North Urban West"]
[22934,"BALLINTRA CLOSE","North Urban West"]
[50782,"BALLOCH ST","South West Urban"]
[53469,"BALLYBAY RD","South East Urban"]
[26095,"BALLYBOE PL","North Urban West"]
[53027,"BALLYCULLANIE PL","South East Urban"]
[53395,"BALLYDONEGAN RISE","South East Urban"]
[50756,"BALLYHOLEY DR","South East Urban"]
[22967,"BALLYMORE DR","North Urban West"]
[53394,"BALLYRONEY PL","South East Urban"]
[53393,"BALLYWARD CLOSE","South East Urban"]
[30106,"BALM ST","Central"]
[22012,"BALMAIN RD","North Urban West"]
[33282,"BALMER LANE","Central"]
[60048,"BALMERINO AVE","South West Urban"]
[24106,"BALMORAL AVE - ALBANY (PVT)","North Urban East"]
[30107,"BALMORAL RD (MT EDEN)","Central"]
[36038,"BALMORAL RD (SANDRINGHAM)","Central"]
[50783,"BALMORE PL","South West Urban"]
[50784,"BALNOON PL","South West Urban"]
[53375,"BALRATH RD","South East Urban"]
[53314,"BALTERSAN DR","South East Urban"]
[54428,"BALTERSAN DR CARPARK (RP20 RHS)","South East Urban"]
[54429,"BALTERSAN DR CARPARK (RP55 RHS)","South East Urban"]
[53081,"BALTIC PL","South West Urban"]
[20322,"BALTIMORE PL","North Urban East"]
[50785,"BALWYN PL","South West Urban"]
[41092,"BAMBOO GR","West"]
[10057,"BAMBRO ST","North Rural"]
[35644,"BAMBURY CLOSE (PVT)","Central"]
[33284,"BAMFIELD PL","Central"]
[30108,"BAMFORD PL","West"]
[52856,"BAMPTON RISE","South East Urban"]
[50786,"BANBURY PL","South West Urban"]
[41091,"BANCROFT CRES","West"]
[53142,"BANDON CLOSE","South East Urban"]
[30109,"BANFF AVE","Central"]
[47371,"BANGLA PL","West"]
[30110,"BANGOR ST","Central"]
[20556,"BANK ST (GLENFIELD)","North Urban West"]
[33285,"BANK ST (MT EDEN)","Central"]
[10058,"BANK ST (WARKWORTH)","North Rural"]
[50787,"BANKS RD","South Rural"]
[33286,"BANKS RD (MT WELLINGTON)","Central East"]
[50788,"BANKSIA PL","South West Urban"]
[80010,"BANKSIDE RD (WEST END)","North Urban East"]
[30111,"BANKSIDE ST","Central"]
[30112,"BANNERMAN RD","Central"]
[41090,"BANNINGS WAY","North Urban West"]
[48227,"BANNINGS WAY WWAY","North Urban West"]
[30113,"BANNISTER PL","West"]
[30114,"BANNOCKBURN PL","Central East"]
[53650,"BANSHIRE CLOSE","South East Urban"]
[52892,"BANTRY CRT","South East Urban"]
[53388,"BANVILLE RD","South East Urban"]
[53704,"BANVILLE RD/WILLIAM WOODS CRT WWAY","South East Urban"]
[50789,"BANYAN DR","South West Urban"]
[20698,"BARBADOS DR","North Urban West"]
[15050,"BARBADOS DR LINK CYWAY","North Urban West"]
[35975,"BARBARICH DR","Central East"]
[41089,"BARBARY AVE","West"]
[70033,"BARBER RD","South Rural"]
[71557,"BARBER RD CARPARK (RP972 RHS)","South Rural"]
[41088,"BARBERRY LANE","West"]
[60049,"BARBERTON TCE","South West Urban"]
[80663,"BARBOUR RD","West"]
[53377,"BARCALDINE RD","South East Urban"]
[54556,"BARCALDINE RD CARPARK (RP24 LHS)","South East Urban"]
[53376,"BARCALDINE/BALTERSAN RAB","South East Urban"]
[33287,"BARCLAY AVE","Central"]
[11630,"BARCLIFF TCE","North Urban East"]
[50790,"BARCROFT PL","South West Urban"]
[52955,"BARD PL","South East Urban"]
[33288,"BARDIA RD","Central East"]
[20090,"BARDIA ST","North Urban East"]
[30115,"BARDSEY ST","Central East"]
[50791,"BARI LANE  (PVT)","South West Urban"]
[50792,"BARINGA PL","South East Urban"]
[10061,"BARKER RD","North Rural"]
[22252,"BARKER RISE","North Urban East"]
[33289,"BARKES PL","Central"]
[22013,"BARLOW PL","North Urban West"]
[52938,"BARMAC PL","South East Urban"]
[53680,"BARMAREE LANE (PVT)","South Rural"]
[11571,"BARNACLE RISE","North Urban East"]
[50794,"BARNARD PL","South West Urban"]
[53705,"BARNARD PL/GREENMEADOWS AVE WWAY","South West Urban"]
[47282,"BARNEA CIRCLE","West"]
[48122,"BARNEA CIRCLE (CLOCKWISE ) WWAY","West"]
[34695,"BARNETT CRES (PVT)","Central"]
[50795,"BARNEYS FARM RD","South West Urban"]
[54007,"BARNEYS FARM RD/HATHERLEY PL WWAY","South West Urban"]
[41087,"BARNFIELD PL","West"]
[48130,"BARNFIELD PL WWAY","West"]
[60050,"BARNHILL CRES","South West Urban"]
[47355,"BARNSLEY PL","West"]
[50796,"BARONIE COURT ROW (PVT)","South East Urban"]
[52910,"BARR PL","South West Urban"]
[10062,"BARR RD (JAMIESON BAY)","North Rural"]
[10063,"BARR RD 2 (KAKANUI)","North Rural"]
[34911,"BARRACK RD","Central East"]
[31585,"BARRACK/BERTRAND RAB","Central East"]
[10064,"BARRETT RD","North Rural"]
[30116,"BARRHEAD PL","West"]
[70035,"BARRIBALL RD","South Rural"]
[50797,"BARRIE AVE","South West Urban"]
[30117,"BARRIE ST","Central"]
[10065,"BARRIER VIEW RD","North Rural"]
[30118,"BARRINGTON RD","Central"]
[33290,"BARRISTER AVE","Central"]
[41086,"BARRON DR","West"]
[40601,"BARRON DR LLA (#36 - #31)","West"]
[48004,"BARRON DR WWAY","West"]
[48005,"BARRON DR WWAY/CLIFF VIEW DR WWAY","West"]
[48006,"BARRON DR/GLENROY PL #15 WWAY","West"]
[50798,"BARROWCLIFFE PL","South West Urban"]
[15502,"BARRY CURTIS PARK LOOP CYWAY","South East Urban"]
[15503,"BARRY CURTIS PARK SCULPTURE LOOP CYWAY","South East Urban"]
[33292,"BARRYMORE RD","Central"]
[20022,"BARRYS POINT RD","North Urban East"]
[41085,"BARRYS RD","West"]
[71476,"BARSANA PL","South Rural"]
[54121,"BARTELLS DR","South East Urban"]
[70036,"BARTHOW RD","South Rural"]
[80011,"BARTLETT DR","North Urban East"]
[21006,"BARTLEY ST","North Urban West"]
[22899,"BARTLEY TCE","North Urban East"]
[11118,"BARTON PL","North Urban East"]
[30119,"BARTON ST","West"]
[30120,"BARTON ST EAST","West"]
[11561,"BARWICK PL","North Urban East"]
[53141,"BASALT PL","South East Urban"]
[10066,"BASIL ORR RD","North Rural"]
[50799,"BASILTON CLOSE","South East Urban"]
[71498,"BASIN PL","South Rural"]
[33293,"BASIN VIEW LANE","Central East"]
[35954,"BASIN VIEW LANE CARPARK (RP84 LHS)","Central East"]
[30121,"BASQUE RD (EAST)","Central"]
[31643,"BASQUE RD (WEST)","Central"]
[47133,"BASRA DR","West"]
[20636,"BASS RD (ALBANY)","North Urban West"]
[33295,"BASS RD (MT WELLINGTON)","Central East"]
[41084,"BASS ST","North Urban West"]
[48247,"BASS ST WWAY","North Urban West"]
[48246,"BASS ST/HENDRIKA CRT WWAY","North Urban West"]
[33296,"BASSANT AVE","Central East"]
[70037,"BASSETT RD (GLENBROOK)","South Rural"]
[30122,"BASSETT RD (REMUERA)","Central East"]
[31567,"BASSETT/MIDDLETON RAB","Central East"]
[60051,"BATES ST","South West Urban"]
[33297,"BATGER RD","Central"]
[20025,"BATH ST","North Urban East"]
[31690,"BATH ST (MIDDLE)","Central"]
[30123,"BATH ST (NORTH)","Central"]
[31689,"BATH ST (SOUTH)","Central"]
[10067,"BATHGATE RD","North Rural"]
[33298,"BATHURST RD","Central"]
[30124,"BATKIN RD (AVONDALE)","West"]
[70038,"BATKIN RD (HUNUA)","South Rural"]
[35750,"BATKIN/WHITTLE WWAY (RP398 LHS)","West"]
[80380,"BATTALION DR","South West Urban"]
[10068,"BATTEN ST","North Rural"]
[22253,"BATTENBURG PL","North Urban East"]
[33299,"BATTERSBY AVE","Central"]
[20442,"BATTLE PL","North Urban West"]
[54831,"BATTLEN PL (PVT)","South West Urban"]
[70039,"BATTY RD","South Rural"]
[70188,"BATTY/LINWOOD BUS LOOP","South Rural"]
[22863,"BAULCOMB PDE","North Urban West"]
[50800,"BAVERSTOCK RD","South East Urban"]
[53708,"BAVERSTOCK RD/ELWYN CLOSE WWAY","South East Urban"]
[15497,"BAVERSTOCK RD/GRACECHURCH DR CYWAY","South East Urban"]
[53709,"BAVERSTOCK RD/OSWALD CLOSE","South East Urban"]
[53710,"BAVERSTOCK RD/PENNYGALE CLOSE WWAY","South East Urban"]
[54430,"BAVERSTOCK/PLANTATION RAB","South East Urban"]
[53606,"BAVERTON CLOSE","South East Urban"]
[80440,"BAWDEN RD (EAST)","North Urban East"]
[10069,"BAWDEN RD (RURAL)","North Rural"]
[33300,"BAXTER ST (MT ROSKILL)","Central"]
[10070,"BAXTER ST (WARKWORTH)","North Rural"]
[22014,"BAY PARK PL","North Urban West"]
[10071,"BAY RD (PORT ALBERT)","North Rural"]
[30125,"BAY RD (ST HELIERS)","Central East"]
[33302,"BAY RD (WAIHEKE)","Hauraki Islands"]
[10078,"BAY ST 2 (RED BEACH)","North Urban East"]
[70903,"BAY VIEW DR","South Rural"]
[10079,"BAY VISTA DR","North Urban East"]
[30126,"BAYARD ST","Central"]
[10080,"BAYER RD","North Rural"]
[15216,"BAYFIELD PARK/HERNE BAY TENNIS CLUB CYWAY","Central"]
[30127,"BAYFIELD RD","Central"]
[70040,"BAYLY RD","South Rural"]
[50801,"BAYS RD","South Rural"]
[41083,"BAYSIDE AVE","West"]
[22254,"BAYSIDE DR","North Urban East"]
[20017,"BAYSWATER AVE","North Urban East"]
[20803,"BAYSWATER AVE SERVICE LANE","North Urban East"]
[15006,"BAYSWATER AVE/FRANCIS ST CYWAY (RP1174)","North Urban East"]
[15007,"BAYSWATER AVE/ROBERTS AVE CYWAY RP(1174)","North Urban East"]
[11540,"BAYVIEW PARK LANE","North Urban East"]
[20048,"BAYVIEW RD - BAYVIEW","North Urban West"]
[22501,"BAYVIEW RD - BROWNSBAY","North Urban East"]
[22505,"BAYVIEW RD - HAURAKI","North Urban East"]
[60701,"BAYVISTA DR","South West Urban"]
[24001,"BEACH GROOVE (PVT)","North Urban East"]
[22015,"BEACH HAVEN RD","North Urban West"]
[33303,"BEACH PDE","Hauraki Islands"]
[22830,"BEACH RD (ACWAY) 49 - 61","North Urban East"]
[30128,"BEACH RD (CITY)","Central"]
[20032,"BEACH RD (EC BAYS)","North Urban East"]
[70042,"BEACH RD (GLENBROOK BEACH)","South Rural"]
[50803,"BEACH RD (HOWICK)","South East Urban"]
[50804,"BEACH RD (MANGERE)","South West Urban"]
[10081,"BEACH RD (MANLY)","North Urban East"]
[50802,"BEACH RD (MANUREWA)","South West Urban"]
[21007,"BEACH RD (ONEWA)","North Urban West"]
[60052,"BEACH RD (PAPAKURA)","South West Urban"]
[20876,"BEACH RD (ROTHESAY) SERVICE LANE","North Urban East"]
[60289,"BEACH RD (TAKANINI)","South West Urban"]
[20875,"BEACH RD (TORBAY) SERVICE LANE","North Urban East"]
[41082,"BEACH RD (WAITAKERE)","West"]
[10082,"BEACH RD 2 (OREWA)","North Urban East"]
[22577,"BEACH RD LLA (#299 - #285)","North Urban East"]
[20744,"BEACH RD LLA (#504 - #530)","North Urban East"]
[20295,"BEACH RD LLA (#572 - #582)","North Urban East"]
[20530,"BEACH RD LLA (#584 - #592)","North Urban East"]
[23083,"BEACH RD LLA (#639 - #659)","North Urban East"]
[48180,"BEACH RD WWAY","West"]
[26071,"BEACH RD-MURRAYS BAY CARPRK-DP54358","North Urban East"]
[10083,"BEACH ST","North Rural"]
[41080,"BEACH VALLEY RD","West"]
[54683,"BEACH/GLENFERN RAB","South East Urban"]
[33304,"BEACHCROFT AVE","Central East"]
[35835,"BEACHCROFT/CHURCH RAB","Central East"]
[26033,"BEACHFRONT CARPARK","North Urban East"]
[22255,"BEACHFRONT LANE","North Urban East"]
[50805,"BEACHLANDS RD","South Rural"]
[15784,"BEACHLANDS RD/CONSTELLATION AVE CYWAY","South Rural"]
[54801,"BEACHLANDS/SHELLY BAY RAB","South Rural"]
[20148,"BEACHOLM RD","North Urban East"]
[80116,"BEACHWOOD DR","North Urban East"]
[22256,"BEACON AVE","North Urban East"]
[10084,"BEACON RD","North Rural"]
[11529,"BEACON RD EXTN","North Rural"]
[22077,"BEACONSFIELD ST (DEVONPORT)","North Urban East"]
[30129,"BEACONSFIELD ST (GREY LYNN)","Central"]
[50806,"BEACONVIEW RISE","South East Urban"]
[33306,"BEAGLE AVE","Central"]
[53143,"BEALE PL","South West Urban"]
[33307,"BEAN PL","Central East"]
[80507,"BEARING PARADE","North Urban East"]
[33308,"BEASLEY AVE","Central East"]
[20423,"BEATRICE AVE","North Urban West"]
[54034,"BEATRICE PL","South East Urban"]
[30130,"BEATRICE RD","Central East"]
[20717,"BEATRICE TINSLEY CRES","North Urban West"]
[30131,"BEATRIX ST","West"]
[50807,"BEATTY AVE","South West Urban"]
[33309,"BEATTY PDE","Hauraki Islands"]
[70043,"BEATTY RD","South Rural"]
[33310,"BEATTY ST","South West Urban"]
[41079,"BEAUBANK RD","West"]
[41078,"BEAUCHAMP DR","West"]
[20522,"BEAUDINE AVE","North Urban West"]
[41077,"BEAUFIELD LANE","West"]
[50808,"BEAUFORT PL","South West Urban"]
[60291,"BEAUMARIS WAY","South West Urban"]
[30132,"BEAUMONT ST","Central"]
[80232,"BEAUMONT ST CARPARK","Central"]
[15224,"BEAUMONT ST/VICTORIA PARK LINK CYWAY (RP16)","Central"]
[15221,"BEAUMONT ST/VICTORIA PARK LINK CYWAY (RP160)","Central"]
[50809,"BEAUMONTS WAY","South West Urban"]
[52738,"BEAUMONTS WAY EXTN","South West Urban"]
[11436,"BEAUVOIR AVE","North Urban East"]
[10085,"BEAVER RD","North Rural"]
[71309,"BEAVER RD (EAST)","South Rural"]
[70044,"BEAVER RD (WEST)","South Rural"]
[71313,"BEAVER RD (WEST) EXTN (RP59 LHS)","South Rural"]
[41076,"BEAZLEY PL","West"]
[33311,"BECKENHAM AVE","Central"]
[50811,"BECKER DR","South West Urban"]
[33312,"BECKETT WAY","Central"]
[30133,"BECKHAM PL","Central"]
[20314,"BECROFT DR (NORTH)","North Urban East"]
[20313,"BECROFT DR (SOUTH)","North Urban East"]
[10086,"BECROFT RD","North Rural"]
[50812,"BEDE PL","South West Urban"]
[30134,"BEDFORD ST (PARNELL)","Central"]
[41074,"BEDFORD ST (WAITAKERE)","West"]
[50813,"BEDLINGTON AVE","South West Urban"]
[50814,"BEDLOW PL","South West Urban"]
[24060,"BEECH WAY (PVT)","North Urban West"]
[50815,"BEECHDALE CRES","South East Urban"]
[20532,"BEECHE PL","North Urban West"]
[22257,"BEECHWOOD RD","North Urban East"]
[30135,"BEERE PL","Central East"]
[50816,"BEESTON CRES","South West Urban"]
[33313,"BEGBIE PL","Central"]
[54250,"BEGGS WAY","South East Urban"]
[50817,"BEGONIA PL","South West Urban"]
[50818,"BEIHLERS RD","South West Urban"]
[53368,"BEIRUT CRT","South West Urban"]
[53397,"BEJOY RISE","South East Urban"]
[33314,"BEL AIR DR","Central"]
[33316,"BELCHER ST","Central"]
[53363,"BELCOO CRES","South East Urban"]
[54139,"BELCOO CRES/FEENY CRES WWAY","South East Urban"]
[50819,"BELDON PL","South East Urban"]
[33317,"BELFAST ST","Central"]
[35970,"BELFAST ST LLA (#15 - #21)","Central"]
[53602,"BELFRY PL","South West Urban"]
[52850,"BELGATE PL","South East Urban"]
[70045,"BELGIUM RD","South Rural"]
[34980,"BELGIUM ST (WAIHEKE)","Hauraki Islands"]
[70860,"BELGIUM ST (WAIUKU)","South Rural"]
[24035,"BELGRAVE LANE (PVT)","North Urban West"]
[60053,"BELGRAVE PL","South West Urban"]
[52763,"BELINDA AVE","South West Urban"]
[33318,"BELL AVE","Central East"]
[50820,"BELL RD (BEACHLANDS)","South Rural"]
[30136,"BELL RD (REMUERA)","Central East"]
[54728,"BELL RD/EALING CRES LINK","South Rural"]
[15790,"BELL RD/POHUTUKAWA RD CYWAY","South Rural"]
[15785,"BELL RD/PONY PARK PL CYWAY","South Rural"]
[71363,"BELLA VILLA DR","South Rural"]
[30138,"BELLA VISTA RD (HERNE BAY)","Central"]
[33319,"BELLA VISTA RD (WAIHEKE)","Hauraki Islands"]
[54223,"BELLAGIO WAY","South East Urban"]
[80487,"BELLAMONT ST","North Rural"]
[30137,"BELLAMY PL","West"]
[50821,"BELLARD PL","South West Urban"]
[22258,"BELLBIRD RISE","North Urban East"]
[20105,"BELLCROFT PL","North Urban East"]
[33320,"BELLE TCE","Hauraki Islands"]
[22893,"BELLE VERDE DR","North Urban East"]
[34981,"BELLE VIEW PL","Hauraki Islands"]
[21008,"BELLE VUE AVE","North Urban West"]
[41303,"BELLEAIRE CRT","North Urban West"]
[48241,"BELLEAIRE CRT WWAY","North Urban West"]
[53127,"BELLEEK CLOSE","South West Urban"]
[11224,"BELLE-MER PL","North Urban East"]
[10088,"BELLEVUE AVE","North Rural"]
[33321,"BELLEVUE RD","Central"]
[31635,"BELLEVUE/HOROEKA RAB","Central"]
[31637,"BELLEVUE/SHERBOURNE RAB","Central"]
[60054,"BELLFIELD RD","South West Urban"]
[30139,"BELLGROVE PL","West"]
[30766,"BELLGROVE PL HAMMERHEAD","West"]
[80603,"BELLINGHAM RD","South East Urban"]
[33322,"BELLONA RD","Central East"]
[41073,"BELLRINGER RD","West"]
[50822,"BELLS RD","South East Urban"]
[54709,"BELLS RD EXTN","South East Urban"]
[15597,"BELLS RD/AVIEMORE DR CYWAY","South East Urban"]
[54710,"BELLS/SIR LLOYD RAB","South East Urban"]
[53592,"BELLSHILL CLOSE","South West Urban"]
[50823,"BELLVILLE DR","South West Urban"]
[54379,"BELLVILLE DR EXTN","South West Urban"]
[15719,"BELLVILLE DR LINK CYWAY","South West Urban"]
[33323,"BELLWOOD AVE","Central"]
[50824,"BELMERE RISE","South East Urban"]
[11527,"BELMONT PL","North Rural"]
[70047,"BELMONT RD","South Rural"]
[22503,"BELMONT SHOPPING CNT SERVICE LANE","North Urban East"]
[30140,"BELMONT TCE (REMUERA)","Central"]
[20258,"BELMONT TCE (TAKAPUNA)","North Urban East"]
[53195,"BELSERA CRT","South East Urban"]
[53010,"BELSOMET PL","South East Urban"]
[50895,"BELTANY DR","South East Urban"]
[41290,"BELVEDERE CRT","North Urban West"]
[80393,"BELVEDERE PLACE","North Rural"]
[33324,"BELVEDERE ST","Central"]
[50825,"BEMROSE PL","South East Urban"]
[33327,"BEN JAMES DR","Central"]
[50826,"BEN LOMOND CRES","South East Urban"]
[50827,"BEN LORA PL","South West Urban"]
[50828,"BEN NEVIS PL","South East Urban"]
[30141,"BENBOW ST","Central East"]
[41072,"BENCHMARK DR","West"]
[50829,"BENDALE PL","South West Urban"]
[47313,"BENDALLS LANE","West"]
[54116,"BENDEMEER PL","South East Urban"]
[20276,"BENDERS AVE","North Urban West"]
[33325,"BENFIELD AVE","Central"]
[35733,"BENFIELD/WOODWARD WWAY (RP233)","Central"]
[33328,"BENGHAZI RD","Central East"]
[41071,"BENITA PL","West"]
[54832,"BENJACK PL (PVT)","South West Urban"]
[50830,"BENMORE PL","South West Urban"]
[50831,"BENNETT RD","South East Urban"]
[33329,"BENNETT ST (MT ALBERT)","Central"]
[10089,"BENNETT ST (PORT ALBERT)","North Rural"]
[10090,"BENNETT ST 2 (WARKWORTH)","North Rural"]
[30142,"BENSON RD","Central East"]
[40113,"BENTINCK ST","West"]
[30143,"BENTLEIGH AVE","West"]
[20432,"BENTLEY AVE","North Urban West"]
[20856,"BENTLEY AVE SERVICE LANE","North Urban West"]
[24112,"BENTLEY CRT (PVT)","North Urban West"]
[50832,"BENTLEY RD","South West Urban"]
[50833,"BENTON PL","South West Urban"]
[53711,"BENTON PL/CARTER PL WWAY","South West Urban"]
[35051,"BENVILLE PL (PVT)","Central"]
[50834,"BENYGLOE PL","South East Urban"]
[15744,"BENYGLOE PL/HOWICK REC CENTRE CYWAY","South East Urban"]
[53144,"BERAGH PL","South East Urban"]
[10091,"BERDINNER RD","North Urban East"]
[11348,"BERENICE LANE","North Rural"]
[33330,"BERESFORD AVE","Hauraki Islands"]
[30144,"BERESFORD SQ","Central"]
[20063,"BERESFORD ST (DEVONPORT)","North Urban East"]
[70917,"BERESFORD ST (PUKEKOHE)","South Rural"]
[33068,"BERESFORD ST CENTRAL (PVT)","Central"]
[33069,"BERESFORD ST WEST","Central"]
[50835,"BERKELEY RD","South West Urban"]
[47092,"BERKSHIRE TCE","West"]
[60508,"BERLANE PL","South West Urban"]
[30145,"BERMUDA RD","Central East"]
[20629,"BERNARD MAGNUS LANE","North Urban West"]
[33333,"BERNARD ST (MT WELLINGTON)","Central East"]
[50836,"BERNARD ST (PAPATOETOE)","South West Urban"]
[22016,"BERNE PL","North Urban West"]
[50837,"BERNIE EDWARDS PL","South East Urban"]
[15692,"BERNIE EDWARDS PL LINK CYWAY","South East Urban"]
[50838,"BERNINA PL","South West Urban"]
[53389,"BERNISH PL","South East Urban"]
[41070,"BERNLEIGH TCE","North Urban West"]
[80474,"BERNORA CRES","South Rural"]
[54122,"BEROS PL","South East Urban"]
[30146,"BEROWALD PL","Central East"]
[50839,"BERRETT PL","South West Urban"]
[30147,"BERRIDGE AVE","Central"]
[10092,"BERRIDGE RD","North Rural"]
[50840,"BERT WILSON PL","South East Urban"]
[50841,"BERTRAM RD","South Rural"]
[10093,"BERTRAM ST","North Rural"]
[35716,"BERTRAND EXT/JARMAN WWAY (RP44)","Central East"]
[33335,"BERTRAND RD","Central East"]
[31614,"BERTRAND RD EXTN","Central East"]
[30148,"BERWICK ST","Central East"]
[60292,"BERWYN AVE","South West Urban"]
[50842,"BERYL PL","South West Urban"]
[22017,"BESWICK PL","North Urban West"]
[22259,"BETHEL RD","North Urban East"]
[11114,"BETHELLS RD (PVT)","West"]
[41069,"BETHELLS RD (WCC)","West"]
[41159,"BETHELLS RD BEACH ACCESS","West"]
[20550,"BETSLAND CRES","North Urban West"]
[50843,"BETTINA PL","South West Urban"]
[33336,"BETTS AVE","Central"]
[50844,"BETULA PL","South West Urban"]
[22260,"BEULAH AVE","North Urban East"]
[60510,"BEVERAGE PL","South West Urban"]
[10095,"BEVERLEY RD","North Urban East"]
[40081,"BEVERLY PL","West"]
[20227,"BEVYN ST","North Urban East"]
[60055,"BEXLEY PL","South West Urban"]
[53521,"BEZAR PL","South East Urban"]
[80324,"BIANCA CRT","South East Urban"]
[47288,"BIBURY AVE","West"]
[53621,"BICKERTON WAY","South East Urban"]
[47039,"BICKLEIGH GR","West"]
[52873,"BICKNELL RD","South West Urban"]
[70048,"BIDDICK RD","South Rural"]
[10096,"BIDDLE RD","North Rural"]
[70049,"BIG BAY RD","South Rural"]
[10097,"BIG OMAHA WHARF RD","North Rural"]
[54119,"BILANCIA PL","South East Urban"]
[70918,"BILKEY AVE","South Rural"]
[50845,"BILL PHILLIP PL","South West Urban"]
[15654,"BILL PHILLIP PL LINK CYWAY","South West Urban"]
[50846,"BILLABONG PL","South East Urban"]
[15710,"BILLABONG PL EAST LINK CYWAY","South East Urban"]
[15709,"BILLABONG PL LINK CYWAY","South East Urban"]
[10098,"BILLING RD","North Rural"]
[11528,"BILLING RD EXTN","North Rural"]
[50847,"BILLINGTON AVE","South West Urban"]
[50848,"BINDA PL","South East Urban"]
[50849,"BINGARA PL","South West Urban"]
[33337,"BINGLEY AVE","Central"]
[10099,"BINNACLE RISE","North Urban East"]
[70050,"BINNS RD","South Rural"]
[41190,"BINSTED RD","West"]
[23038,"BINTULU PL","North Urban West"]
[53288,"BIRCH PARK LANE (PVT)","South Rural"]
[50850,"BIRCH PL","South West Urban"]
[70051,"BIRCH RD (KARAKA)","South Rural"]
[70919,"BIRCH RD (PUKEKOHE)","South Rural"]
[20099,"BIRCHFIELD RD","North Urban East"]
[53622,"BIRCHLANDS RD","South East Urban"]
[53626,"BIRCHLANDS/MANCHESTER RAB","South East Urban"]
[53338,"BIRCHLEA RISE (PVT)","South West Urban"]
[20613,"BIRCHWOOD GR","North Urban West"]
[10100,"BIRDIE PL","North Urban East"]
[10156,"BIRDS BEACH RD","North Rural"]
[10101,"BIRDSALL RD","North Rural"]
[35005,"BIRDSONG LANE (PVT)","Central"]
[50851,"BIRDWOOD AVE","South West Urban"]
[30149,"BIRDWOOD CRES","Central"]
[70921,"BIRDWOOD RD (PUKEKOHE)","South Rural"]
[41068,"BIRDWOOD RD (WAITAKERE)","West"]
[70920,"BIRDWOOD RD EAST","South Rural"]
[22018,"BIRKDALE RD","North Urban West"]
[20846,"BIRKDALE RD SERVICE LANE","North Urban West"]
[22019,"BIRKENHEAD AVE","North Urban West"]
[26090,"BIRKENHEAD WHARF CARPARK","North Urban West"]
[26045,"BIRKHEAD AVE CARPRK DP38599+DP79651","North Urban West"]
[20072,"BIRKLEY RD","North Urban East"]
[15822,"BIRMAN CL/CURACAO PL CYWAY","South East Urban"]
[15821,"BIRMAN CL/PALMYRA CRES LINK CYWAY","South East Urban"]
[50852,"BIRMAN CLOSE","South East Urban"]
[54681,"BIRMAN CLOSE HAMMERHEAD","South East Urban"]
[50853,"BIRMINGHAM RD","South West Urban"]
[54099,"BIRMINGHAM RD SERVICE LANE (RP109)","South West Urban"]
[54101,"BIRMINGHAM RD SERVICE LANE (RP455)","South West Urban"]
[60294,"BISCAY PL","South West Urban"]
[53461,"BISHOP BROWNE PL","South West Urban"]
[53462,"BISHOP CROKE PL","South West Urban"]
[53463,"BISHOP DUNN PL","South West Urban"]
[53279,"BISHOP LENIHAN PL","South West Urban"]
[33338,"BISHOP ST (EPSOM)","Central"]
[41067,"BISHOP ST (WAITAKERE)","West"]
[22020,"BISHOPGATE ST","North Urban West"]
[50854,"BISLEY ST","South West Urban"]
[54174,"BISLEY ST CARPARK (RP55 LHS)","South West Urban"]
[41066,"BITTERN PL","West"]
[48215,"BITTERN PL WWAY","West"]
[48216,"BITTERN PL WWAY FORK","West"]
[10102,"BJORKLUND RD","North Rural"]
[10103,"BLACK SWAMP RD","North Rural"]
[10104,"BLACKBRIDGE RD (DAIRY FLAT)","North Rural"]
[70053,"BLACKBRIDGE RD (KARAKA)","South Rural"]
[50855,"BLACKBURN RD","South East Urban"]
[30150,"BLACKETT CRES","Central East"]
[50856,"BLACKGATE PL","South West Urban"]
[41065,"BLACKLOCK AVE","West"]
[48165,"BLACKLOCK AVE WWAY","West"]
[20601,"BLACKS RD","North Urban West"]
[22875,"BLACKTEAL CLOSE","North Urban West"]
[34756,"BLACKWELL DR","Hauraki Islands"]
[53269,"BLACKWOOD DR","South West Urban"]
[80018,"BLACKWOOD RD","North Urban East"]
[53492,"BLACKWOOD/CROFTVIEW RAB","South West Urban"]
[70922,"BLAIR AVE","South Rural"]
[50857,"BLAIR PL","South West Urban"]
[80243,"BLAKE GREENS (NORTHBOUND)","North Urban East"]
[80242,"BLAKE GREENS (SOUTHBOUND)","North Urban East"]
[11234,"BLAKE LANE","North Rural"]
[50858,"BLAKE RD (MANGERE)","South West Urban"]
[70054,"BLAKE RD (PUKEKOHE)","South Rural"]
[54585,"BLAKE RD EXTN","South West Urban"]
[30151,"BLAKE ST (PONSONBY)","Central"]
[33340,"BLAKE ST (WAIHEKE)","Hauraki Islands"]
[20297,"BLAKEBOROUGH DR","North Urban East"]
[53327,"BLAKEWELL PL","South Rural"]
[33341,"BLAKEY ST","Central East"]
[50859,"BLAMPIED RD","South West Urban"]
[10105,"BLANC RD","North Urban East"]
[50860,"BLANCHE WAY","South East Urban"]
[50861,"BLAND PL","South West Urban"]
[50862,"BLANES RD","South West Urban"]
[53603,"BLANTYRE CRT","South West Urban"]
[11475,"BLARK RD","North Rural"]
[50863,"BLEAKHOUSE RD","South East Urban"]
[15828,"BLEAKHOUSE RD/MACLEANS PARK CYWAY","South East Urban"]
[53712,"BLEAKHOUSE RD/PICKWICK PDE WWAY","South East Urban"]
[54539,"BLEAKHOUSE/GILLS RAB","South East Urban"]
[54666,"BLEAKHOUSE/MACLEANS RAB","South East Urban"]
[40088,"BLEASE ST","West"]
[70923,"BLEDISLOE CRT","South Rural"]
[50865,"BLEDISLOE ST (HOWICK)","South East Urban"]
[50864,"BLEDISLOE ST (PAPATOETOE)","South West Urban"]
[53713,"BLEDISLOE ST/YORK ST WWAY","South West Urban"]
[41215,"BLENHEIM PL (PVT)","North Urban West"]
[20424,"BLENHEIM ST","North Urban West"]
[47040,"BLETHYN PL","West"]
[15124,"BLETHYN PL LINK CYWAY","West"]
[80398,"BLEWITT CRT","West"]
[33342,"BLIND BAY RD","Hauraki Islands"]
[30153,"BLOCKHOUSE BAY RD","West"]
[35930,"BLOCKHOUSE BAY RD CARPARK (RP4302)","West"]
[33124,"BLOCKHOUSE BAY RD HLA (#243 - #251)","West"]
[30035,"BLOCKHOUSE BAY RD HLA (#577 - #593)","West"]
[30085,"BLOCKHOUSE BAY/KINROSS RAB","West"]
[30167,"BLOCKHOUSE BAY/TAYLOR SLIP","West"]
[35743,"BLOCKHOUSE/ENDEAVOUR W/WAY (RP4820)","West"]
[26019,"BLOMFEILD SPA CARPARK DP65400","North Urban East"]
[71239,"BLOMFIELD LANE","South Rural"]
[20141,"BLOMFIELD SPA","North Urban East"]
[30154,"BLOOMFIELD AVE","Central"]
[11562,"BLOOMFIELD RISE","North Urban East"]
[50866,"BLOSSOM LANE","South West Urban"]
[53145,"BLOWERS PL","South East Urban"]
[10106,"BLUE BELL PDE","North Rural"]
[10107,"BLUE GUM AVE","North Urban East"]
[11219,"BLUE GUM DR","North Rural"]
[50867,"BLUE GUM RISE","South East Urban"]
[15816,"BLUE GUM RISE/MANOR PARK CYWAY","South East Urban"]
[15817,"BLUE GUM RISE/WILLOW WAY CYWAY","South East Urban"]
[11381,"BLUE HERON RISE","North Urban East"]
[41064,"BLUE SPUR WAY","West"]
[10108,"BLUE VISTA RD","North Urban East"]
[22672,"BLUEBIRD CRES","North Urban West"]
[41174,"BLUEFIN WAY","North Urban West"]
[48230,"BLUEFIN WAY WWAY","North Urban West"]
[36026,"BLUEGREY AVE (NORTHBOUND)","Central East"]
[35976,"BLUEGREY AVE (SOUTHBOUND)","Central East"]
[36022,"BLUEGREY/STONEMASON RAB","Central East"]
[36043,"BLUEGREY/TIHI RAB","Central East"]
[47153,"BLUERIDGE CLOSE","West"]
[48170,"BLUERIDGE CLOSE WWAY","West"]
[22761,"BLUESTONE RISE","North Urban West"]
[50868,"BLUEWATER PL","South West Urban"]
[15754,"BLUEWATER PL/ABERDEEN CRES CYWAY","South West Urban"]
[33343,"BLUFF TCE","Central"]
[35556,"BLUMHARDT PL (PVT)","West"]
[22021,"BLUNDELL PL","North Urban West"]
[41063,"BLYTHE PL","West"]
[50869,"BLYTON LANE","South East Urban"]
[10372,"BM GUBBS RD","North Rural"]
[33344,"BOAKES RD","Central East"]
[35720,"BOAKES/MCCRACKEN WWAY (RP400)","Central East"]
[30155,"BOARDMAN LANE","Central"]
[80329,"BOARDWALK RISE","North Urban East"]
[11608,"BOAT YARD LANE","North Rural"]
[10109,"BOATHOUSE HILL RD","North Rural"]
[50870,"BOB CHARLES DR","South East Urban"]
[71472,"BOB CRAIG PL","South Rural"]
[80437,"BOBS WAY","North Rural"]
[41331,"BOCAGE LANE","North Urban West"]
[53232,"BODERG WAY","South East Urban"]
[10110,"BODHISATTVA RD","North Rural"]
[41062,"BODI PL","West"]
[50871,"BODMIN PL","South West Urban"]
[53071,"BOEING PL","South West Urban"]
[53126,"BOHOLA RISE","South West Urban"]
[70056,"BOILER GULLY RD","South Rural"]
[53094,"BOKEEN LANE","South East Urban"]
[50872,"BOLDERWOOD PL","South West Urban"]
[40083,"BOLER PL","West"]
[10111,"BOLER RD","North Rural"]
[50873,"BOLINA CRES","South East Urban"]
[30156,"BOLLARD AVE","West"]
[50874,"BOLTON PL","South West Urban"]
[30158,"BOLTON ST (BLOCKHOUSE BAY)","West"]
[80342,"BOLTON ST (BLOCKHOUSE BAY) WWAY","West"]
[40028,"BOLTON ST (WAITAKERE)","West"]
[80641,"BOMB POINT DR","North Urban West"]
[70058,"BOMBAY RD","South Rural"]
[70146,"BOMBAY RD LLA (RP1689 RHS)","South Rural"]
[80014,"BONAIR CRECENT","North Urban East"]
[71379,"BONAPARTE DR","South Rural"]
[24093,"BOND AVE (PVT)","North Urban East"]
[20292,"BOND CRES","North Urban East"]
[33347,"BOND PL","Central East"]
[30159,"BOND ST (GREY LYNN)","Central"]
[50875,"BOND ST (OTARA)","South West Urban"]
[30160,"BONGARD RD","Central East"]
[10113,"BONITA AVE","North Urban East"]
[20496,"BONITO PL","North Urban West"]
[41332,"BONNARD PL","North Urban West"]
[30161,"BONNIE BRAE RD","Central East"]
[47368,"BONNY CRES","West"]
[50876,"BOOKER PL","South West Urban"]
[50877,"BOON ST","South West Urban"]
[53714,"BOON ST/TAWA CRES WWAY","South West Urban"]
[50878,"BOORALEE AVE","South East Urban"]
[10114,"BOORD CRES","North Rural"]
[10115,"BOOTH RD","North Rural"]
[80590,"BORDEAUX PDE (DECREASING)","West"]
[47350,"BORDEAUX PDE (INCREASING)","West"]
[41061,"BORDER RD","West"]
[41059,"BORICH RD","West"]
[53227,"BORLASE LANE","South West Urban"]
[23035,"BORNEO DR","North Urban West"]
[53213,"BORRIS CLOSE","South East Urban"]
[10116,"BORROW RD","North Rural"]
[50879,"BORROWDACE AVE","South East Urban"]
[53715,"BORROWDACE AVE/BARINGA PL WWAY","South East Urban"]
[53378,"BORTHWICK CLOSE","South East Urban"]
[30162,"BOSCAWEN ST","Central"]
[10117,"BOSHER RD","North Rural"]
[41216,"BOSNYAK DR (PVT)","West"]
[50880,"BOSTOCK PL","South East Urban"]
[30163,"BOSTON RD","Central"]
[31646,"BOSTON/NORMANBY SLIP","Central"]
[31645,"BOSTON/NUGENT RAB","Central"]
[41058,"BOSUN PL","West"]
[53014,"BOTANIC VIEW (PVT)","South West Urban"]
[80020,"BOTANICAL DR","North Urban East"]
[50881,"BOTANY RD","South East Urban"]
[54691,"BOTANY RD CARPARK (RP3435 RHS)","South East Urban"]
[15765,"BOTANY RD NORTH UPASS CYWAY (RP1819)","South East Urban"]
[15766,"BOTANY RD NORTH UPASS WEST LINK CYWAY","South East Urban"]
[15768,"BOTANY RD SOUTH UPASS CYWAY (RP1775)","South East Urban"]
[15695,"BOTANY RD UPASS NORTH EAST LINK CYWAY (RP1807)","South East Urban"]
[54708,"BOTANY RD/CASCADES RD SLIP","South East Urban"]
[15767,"BOTANY RD/LEXINGTON DR CYWAY","South East Urban"]
[15773,"BOTANY RD/MILLHOUSE DR CYWAY","South East Urban"]
[53716,"BOTANY RD/VOLTAIRE CRT WWAY","South East Urban"]
[15714,"BOTANY RD/WHITFORD RD CYWAY","South East Urban"]
[54421,"BOTANY WAY","South East Urban"]
[54690,"BOTANY/UNION RAB","South East Urban"]
[33349,"BOTHA RD","Central East"]
[60056,"BOTHWELL PL","South West Urban"]
[53049,"BOUGAINVILLAEA TCE","South West Urban"]
[24026,"BOUNDARY DR (PVT)","North Urban West"]
[34762,"BOUNDARY RD (BLOCKHOUSE BAY)","West"]
[53206,"BOUNDARY RD (EAST)","South West Urban"]
[54407,"BOUNDARY RD (EAST) EXTN","South East Urban"]
[60057,"BOUNDARY RD (PAPAKURA)","South West Urban"]
[70061,"BOUNDARY RD (WAIPIPI)","South Rural"]
[50882,"BOUNDARY RD (WEST)","South West Urban"]
[70060,"BOUNDARY RD (WEST/WAIPIPI)","South Rural"]
[15463,"BOUNDARY RD/ORETI PLACE CYWAY","South West Urban"]
[80606,"BOUNTY RD","North Urban East"]
[33382,"BOURKE ST","Central"]
[33351,"BOURNE ST","Central"]
[34897,"BOURNE ST LLA (#3 - #2B)","Central"]
[33352,"BOURNEMOUTH AVE","Central"]
[22261,"BOURNEMOUTH TCE","North Urban East"]
[33353,"BOW PL","Central East"]
[50883,"BOWATER PL","South West Urban"]
[53717,"BOWATER PL/TUI CRES WWAY","South West Urban"]
[35583,"BOWDEN LANE (PVT)","Central East"]
[33355,"BOWDEN RD","Central East"]
[30165,"BOWEN AVE","Central"]
[35072,"BOWEN LANE (PVT)","Central"]
[50884,"BOWEN ST (MANUREWA)","South West Urban"]
[70844,"BOWEN ST (WAIUKU)","South Rural"]
[71564,"BOWEN/MARTYN RAB","South Rural"]
[40055,"BOWERS RD","West"]
[41201,"BOWERS RD LLA (#2 - #11)","West"]
[70062,"BOWKER RD","South Rural"]
[30166,"BOWLING AVE","Central"]
[20302,"BOWMAN RD","North Urban East"]
[53499,"BOWMORE CLOSE","South East Urban"]
[52943,"BOWSCALE PL","South East Urban"]
[33356,"BOYCE AVE","Central"]
[10118,"BOYD ACCESS RD","North Rural"]
[50885,"BOYD AVE","South West Urban"]
[33357,"BOYD AVE (ONEHUNGA)","Central East"]
[70063,"BOYD RD","South Rural"]
[41056,"BOYLAN RD","West"]
[33358,"BOYLE CRES","Central"]
[50886,"BOYS PL","South East Urban"]
[41055,"BRABANT RD","West"]
[30168,"BRABHAM PL","West"]
[20150,"BRACKEN AVE","North Urban East"]
[30169,"BRACKEN AVE (EPSOM)","Central"]
[50887,"BRADBURY RD","South East Urban"]
[10119,"BRADDICK RD","North Rural"]
[31691,"BRADFORD ST (MIDDLE)","Central"]
[30170,"BRADFORD ST (NORTH)","Central"]
[31692,"BRADFORD ST (SOUTH)","Central"]
[30171,"BRADLEY LANE","Central East"]
[10120,"BRADLY RD","North Rural"]
[30172,"BRADNOR LANE","Central"]
[47328,"BRADNOR MEADOWS DR","West"]
[33359,"BRADY RD","South West Urban"]
[41054,"BRAEBANK LANE","West"]
[60288,"BRAEBURN PL","South West Urban"]
[20232,"BRAEMAR RD - CASTOR BAY","North Urban East"]
[22263,"BRAEMAR RD - ROTHSAY BAY","North Urban East"]
[33361,"BRAEMAR TCE","Central"]
[47041,"BRAESTAR CRT","West"]
[48105,"BRAESTAR CRT WWAY 1","West"]
[48106,"BRAESTAR CRT WWAY 2","West"]
[22022,"BRAGATO PL","North Urban West"]
[52961,"BRAILSFORD CRT","South East Urban"]
[41053,"BRAINS RD","West"]
[48057,"BRAINS RD WWAY","West"]
[50888,"BRAMLEY DR","South East Urban"]
[15586,"BRAMLEY DR LINK CYWAY","South East Urban"]
[24111,"BRAMPTON CRES (PVT)","North Urban East"]
[53651,"BRAMPTON CRT","South East Urban"]
[10559,"BRAMPTON RD","North Rural"]
[30173,"BRAMWELL PL","Central"]
[54118,"BRANCOTT PL","South East Urban"]
[40043,"BRANDON RD (GLEN EDEN)","West"]
[10121,"BRANDON RD (WHANGAPARAOA)","North Urban East"]
[22264,"BRANSTON AVE","North Urban East"]
[47267,"BRASHIER CIRCLE","West"]
[15134,"BRASHIER CIRCLE LINK CYWAY","West"]
[22023,"BRASSEY RD","North Urban West"]
[20441,"BRAUND PL","North Urban West"]
[50890,"BRAVA PL","South West Urban"]
[15716,"BRAVA PL LINK CYWAY","South West Urban"]
[35681,"BRAYS RISE","Central East"]
[52896,"BRAYSTONES PL","South East Urban"]
[71508,"BREAKER GR","South Rural"]
[53594,"BRECHIN PL","South West Urban"]
[41333,"BREENAGH PL","West"]
[33362,"BREMNER AVE","Central"]
[60299,"BREMNER RD (DRURY) (SW)","South West Urban"]
[60710,"BREMNER RD (RUNCIMAN) (SR)","South Rural"]
[41052,"BRENNAN AVE","West"]
[50891,"BRENT PL","South West Urban"]
[50892,"BRENTFORD PL","South West Urban"]
[53718,"BRENTFORD PL/DAGENHAM ST WWAY","South West Urban"]
[30174,"BRENTON PL","Central East"]
[30175,"BRENTWOOD AVE","Central"]
[53569,"BREON PL","South East Urban"]
[53719,"BREON PL/CHAPEL RD WWAY","South East Urban"]
[80360,"BRETON RD","South West Urban"]
[50893,"BRETT AVE (PAPATOETOE)","South West Urban"]
[20178,"BRETT AVE (TAKAPUNA)","North Urban East"]
[50894,"BRETTON LANE  (PVT )","South East Urban"]
[33364,"BREWSTER AVE","Central"]
[20240,"BRIAN AVE","North Urban East"]
[40017,"BRIAN BERG PL (PVT)","West"]
[10123,"BRIAN CRES","North Urban East"]
[35977,"BRIAN SLATER WAY","Central East"]
[11631,"BRIAN SMITH DR","North Urban East"]
[71194,"BRIAN WOOD LANE","South Rural"]
[52822,"BRIAR LANE","South Rural"]
[54039,"BRIAR VALE PL","South East Urban"]
[10124,"BRICK BAY DR","North Rural"]
[47154,"BRICK ST","West"]
[35676,"BRICKFIELD WAY (PVT)","Central"]
[80552,"BRICKWORKS BAY RD","North Urban West"]
[80281,"BRIDAL PL","North Urban East"]
[41051,"BRIDGE AVE","West"]
[33367,"BRIDGE ST (PANMURE)","Central East"]
[50896,"BRIDGE ST (PAPATOETOE)","South West Urban"]
[10125,"BRIDGE ST (SH16 HVILLE)","North Rural"]
[22024,"BRIDGE VIEW RD","North Urban West"]
[53448,"BRIDGEFIELD CRES","South East Urban"]
[41281,"BRIDGEHEAD COVE","North Urban West"]
[41050,"BRIDGENS AVE","West"]
[48145,"BRIDGENS AVE WWAY","West"]
[80453,"BRIDGET COURT","North Urban East"]
[60695,"BRIDGEVIEW RD","South West Urban"]
[60697,"BRIDGEVIEW/ANCHORAGE RAB","South West Urban"]
[31783,"BRIDGEWATER RD","Central"]
[33369,"BRIDGMAN AVE","Central"]
[50897,"BRIGADE RD","South West Urban"]
[22025,"BRIGANTINE DR","North Urban West"]
[80071,"BRIGHAM CREEK RAB (RP4317)","North Urban West"]
[80072,"BRIGHAM CREEK RAB (RP4510)","North Urban West"]
[41049,"BRIGHAM CREEK RD","North Urban West"]
[80070,"BRIGHAM CREEK/SINTON RD RAB","North Urban West"]
[30176,"BRIGHAM ST","Central"]
[15298,"BRIGHAM ST/QUAY ST CYWAY","Central"]
[22814,"BRIGHAM YOUNG DR","North Urban West"]
[30177,"BRIGHT ST","Central"]
[34969,"BRIGHT ST EXTN","Central"]
[36048,"BRIGHTON CLOSE (PVT)","Central"]
[30178,"BRIGHTON RD","Central"]
[22265,"BRIGHTON TCE","North Urban East"]
[70888,"BRIGHTS RD","South Rural"]
[30179,"BRIGHTSIDE RD (EPSOM)","Central"]
[10126,"BRIGHTSIDE RD (STANMORE BAY)","North Urban East"]
[15024,"BRIGHTSIDE RD/RIMU RD CYWAY","North Urban East"]
[60058,"BRIGHTWELL ST","South West Urban"]
[10127,"BRIGITTE VIEW","North Rural"]
[30180,"BRILLIANT ST","Central East"]
[53233,"BRINLACK DR","South East Urban"]
[15477,"BRINLACK DR/KELVIN HART DR CYWAY","South East Urban"]
[35978,"BRIODY TCE","Central East"]
[30181,"BRISBANE ST (NORTH)","Central"]
[31537,"BRISBANE ST (SOUTH)","Central"]
[33370,"BRISTOL RD (MT ROSKILL)","Central"]
[41048,"BRISTOL RD (WAITAKERE)","North Urban West"]
[50898,"BRITANNIA PL","South East Urban"]
[53720,"BRITANNIA PL/GLENNANDREW DR WWAY","South East Urban"]
[30182,"BRITOMART PL","Central"]
[31525,"BRITOMART STATION DROPOFF LOOP","Central"]
[47181,"BRITTANY DR","West"]
[53211,"BRITTAS PL","South East Urban"]
[54527,"BRITTAS PL/AARONVILLE WAY LINK","South East Urban"]
[33371,"BRITTON AVE","Central"]
[33372,"BRIXTON RD (BALMORAL)","Central"]
[10128,"BRIXTON RD (MANLY)","North Urban East"]
[35938,"BRIXTON RD CARPARK #1","Central"]
[30031,"BRIXTON RD CARPARK #2","Central"]
[41334,"BROADFIELD ST","West"]
[41389,"BROADFIELD/SHERPA RAB","West"]
[53147,"BROADHURST RD","South East Urban"]
[54443,"BROADHURST/MCKITTRICK RAB","South East Urban"]
[10129,"BROADLANDS DR","North Rural"]
[50899,"BROADVIEW PL","South East Urban"]
[30183,"BROADWAY (NEWMARKET)","Central"]
[60059,"BROADWAY (PAPAKURA)","South West Urban"]
[11421,"BROADWOOD RISE","North Rural"]
[10130,"BROADY RD","North Rural"]
[53624,"BROBERG LANE","South East Urban"]
[60476,"BROCKTON AVE","South West Urban"]
[15418,"BROCKTON AVE/EVANDA CRES CYWAY","South West Urban"]
[70068,"BROKEN BRIDGE RD","South Rural"]
[50901,"BROMAN PL","South East Urban"]
[30184,"BROMLEY PL","Central East"]
[24033,"BROMPTON DR (PVT)","North Urban West"]
[52989,"BROMPTON PL","South East Urban"]
[52846,"BRONTE PL","South East Urban"]
[53408,"BRONWYLIAN DR","South East Urban"]
[53721,"BRONWYLIAN DR/KARSON PL WWAY","South East Urban"]
[22266,"BRONWYN PL","North Urban East"]
[70069,"BRONZE RD","South Rural"]
[20700,"BRONZEWING TCE","North Urban West"]
[53322,"BROOK HAVEN RISE","South West Urban"]
[70070,"BROOK RD","South Rural"]
[20251,"BROOK ST","North Urban East"]
[50902,"BROOKBY RD","South Rural"]
[54675,"BROOKBY RD CARPARK (RP4024 RHS)","South Rural"]
[54586,"BROOKBY/WEST RAB","South Rural"]
[20652,"BROOKDALE RD (PARE)","North Urban West"]
[60060,"BROOKE RD","South West Urban"]
[53254,"BROOKE RIDGE RISE","South East Urban"]
[71238,"BROOKESMITH DR","South Rural"]
[33373,"BROOKFIELD AVE","Central East"]
[60395,"BROOKFIELD RD (DRURY)","South Rural"]
[41047,"BROOKFIELD RD (WAITAKERE)","West"]
[30185,"BROOKFIELD ST (ST HELIERS)","Central East"]
[30186,"BROOKLAND PL","Central East"]
[50903,"BROOKLYN AVE","South West Urban"]
[53722,"BROOKLYN AVE/PEMBROKE ST WWAY","South West Urban"]
[53723,"BROOKS WAY/RITO PL WWAY","South West Urban"]
[71287,"BROOKSIDE RD","South Rural"]
[70201,"BROOKSIDE RD/BROOKSIDE RD SLIP","South Rural"]
[70199,"BROOKSIDE RD/GLENBROOK RD SLIP","South Rural"]
[50904,"BROOKSWAY ST","South West Urban"]
[11213,"BROOKVALE PARK","North Urban East"]
[54187,"BROOKVIEW DR","South East Urban"]
[47252,"BROOKWOOD DR","West"]
[80347,"BROOKWOOD DR WWAY)","West"]
[50905,"BROOMFIELDS RD","South Rural"]
[53466,"BROSNA PL","South East Urban"]
[30187,"BROTHERS ST","West"]
[10133,"BROTT RD","North Rural"]
[50906,"BROUDER PL","South West Urban"]
[50907,"BROUGH RD","South West Urban"]
[41046,"BROUGHAM PL","West"]
[10134,"BROWN RD (SH1 WARKWORTH)","North Rural"]
[33375,"BROWN RD (WAIHEKE)","Hauraki Islands"]
[10135,"BROWN ST (MANLY)","North Urban East"]
[30188,"BROWN ST (PONSONBY)","Central"]
[20145,"BROWN ST (TAKAPUNA)","North Urban East"]
[50908,"BROWNHILL RD","South Rural"]
[54448,"BROWNHILL RD EXTN (RP1735 LHS)","South Rural"]
[41045,"BROWNIE RD","West"]
[30189,"BROWNING ST (GREY LYNN)","Central"]
[50909,"BROWNING ST (MANUREWA)","South West Urban"]
[70924,"BROWNLEE PL","South Rural"]
[52775,"BROWNS AVE","South East Urban"]
[54743,"BROWNS AVE HAMMERHEAD","South East Urban"]
[26080,"BROWNS BAY BOAT CLUB CARPARK","North Urban East"]
[26075,"BROWNS BAY CARPARK LOT 7 DP10801","North Urban East"]
[20291,"BROWNS BAY RD (EAST)","North Urban East"]
[22076,"BROWNS BAY RD (WEST)","North Urban East"]
[50911,"BROWNS LANE","South East Urban"]
[50912,"BROWNS RD","South West Urban"]
[53724,"BROWNS RD/ADAMS RD WWAY","South West Urban"]
[11487,"BRUCE MACGREGOR LANE","North Rural"]
[41044,"BRUCE MCLAREN RD","West"]
[50913,"BRUCE PL","South West Urban"]
[60579,"BRUCE PULMAN DR","South West Urban"]
[20415,"BRUCE RD","North Urban West"]
[53264,"BRUCE RODERICK DR","South East Urban"]
[21009,"BRUCE ST","North Urban West"]
[80320,"BRUCKLESS DR","South East Urban"]
[80656,"BRUMBIE WAY","South West Urban"]
[41043,"BRUNNER RD","West"]
[48070,"BRUNNER RD WWAY","West"]
[53191,"BRUNSWICK RISE","South West Urban"]
[20519,"BRUNTON PL","North Urban West"]
[22026,"BRUSSELLS PL","North Urban West"]
[33365,"BRYAN RD","Hauraki Islands"]
[30190,"BRYANT PL","Central East"]
[70073,"BRYANT RD","South Rural"]
[30191,"BRYDON PL","West"]
[20470,"BRYERS PL","North Urban West"]
[60293,"BRYLEE DR","South West Urban"]
[15592,"BRYLEE DR LINK CYWAY","South West Urban"]
[15594,"BRYLEE DR RES/WALTER STREVENS RES LINK CYWAY","South West Urban"]
[22798,"BRYN MAWR PL","North Urban West"]
[60061,"BRYNBELA CRT","South West Urban"]
[11534,"BUCCANEER CRT","North Urban East"]
[33376,"BUCCANEER ST","Central"]
[70074,"BUCHANAN RD","South Rural"]
[20598,"BUCHANAN ST (DEVONPORT)","North Urban East"]
[33377,"BUCHANAN ST (KINGSLAND)","Central"]
[15308,"BUCHANAN ST/MOTORWAY LINK CYWAY","Central"]
[50914,"BUCKINGHAM CRES","South West Urban"]
[50915,"BUCKLAND RD (MANGERE)","South West Urban"]
[71374,"BUCKLAND RD (PUKEKOHE)","South Rural"]
[54581,"BUCKLAND RD CARPARK (RP317 RHS)","South West Urban"]
[53725,"BUCKLAND RD/HOKIANGA ST WWAY","South West Urban"]
[53726,"BUCKLAND RD/MOFFITT PL WWAY","South West Urban"]
[50916,"BUCKLANDS BEACH RD","South East Urban"]
[54677,"BUCKLANDS BEACH RD CARPARK (RP2003)","South East Urban"]
[52933,"BUCKLANDS BEACH RD HLA (#335 - 341)","South East Urban"]
[15643,"BUCKLANDS BEACH RD/CASCADES RD CYWAY","South East Urban"]
[15735,"BUCKLANDS BEACH RD/CRANBERRY PL CYWAY","South East Urban"]
[53727,"BUCKLANDS BEACH RD/WALLER AVE WWAY","South East Urban"]
[54543,"BUCKLANDS BEACH/GILLS RAB","South East Urban"]
[54676,"BUCKLANDS BEACH/MACLEANS RAB","South East Urban"]
[10136,"BUCKLETON RD","North Rural"]
[41042,"BUCKLEY AVE","North Urban West"]
[33378,"BUCKLEY RD","Central"]
[20648,"BUCKLEYS TRACK (KITEROA RD)","North Urban West"]
[70077,"BUCKVILLE RD","South Rural"]
[33379,"BUDGEN ST","Central"]
[33380,"BUDOCK RD","Central"]
[41041,"BUISSON GL","West"]
[48266,"BUISSON GLD WWAY","West"]
[48265,"BUISSON GLD/CROSBY #9 WWAY","West"]
[53326,"BUKEM PL","South West Urban"]
[60297,"BULLENS RD","South Rural"]
[50917,"BULLER CRES","South West Urban"]
[30192,"BULLER ST","Central"]
[30193,"BULLOCK TRACK","Central"]
[20588,"BULWER ST","North Urban East"]
[22754,"BUNCRANA PL (ALBANY)","North Urban West"]
[60593,"BUNCRANA PL (PAPAKURA)","South West Urban"]
[50918,"BUNDENA PL","South West Urban"]
[22750,"BUNDORAN WAY","North Urban West"]
[50919,"BUNGALORE PL","South East Urban"]
[30194,"BUNGALOW AVE","Central"]
[70078,"BUNGARD RD","South Rural"]
[53483,"BUNKER RISE","South East Urban"]
[60062,"BUNNYTHORPE RD","South West Urban"]
[23051,"BUR OAK RD","North Urban West"]
[50920,"BURBANK AVE","South West Urban"]
[60492,"BURBERRY RD","South Rural"]
[50921,"BURBRIDGE RD","South West Urban"]
[33381,"BURCH ST","Central"]
[35979,"BURDEN LANE","Central East"]
[50922,"BURFORD PL","South East Urban"]
[22029,"BURGESS RD","North Urban East"]
[30195,"BURGOYNE ST","Central"]
[41335,"BURGUNDY PARK AVE","West"]
[48101,"BURGUNDY PARK AVE WWAY","West"]
[10138,"BURKE RD","North Rural"]
[30196,"BURLEIGH ST","Central"]
[50923,"BURLINGTON PL","South West Urban"]
[53729,"BURLINGTON PL/HEYBRIDGE ST WWAY","South West Urban"]
[10139,"BURMA RD","North Rural"]
[52964,"BURNASTON CRT","South East Urban"]
[50924,"BURNDALE TCE","South West Urban"]
[10140,"BURNE RD","North Rural"]
[33383,"BURNETT AVE","Central"]
[41040,"BURNHAM RD","West"]
[33384,"BURNLEY TCE","Central"]
[20020,"BURNS AVE","North Urban East"]
[30197,"BURNS ST","Central"]
[30198,"BURNSALL PL","West"]
[33386,"BURNSIDE AVE","Central"]
[22760,"BURNSIDE CRT","North Urban West"]
[60484,"BURNSIDE RD (ARDMORE)","South Rural"]
[10141,"BURNSIDE RD (MAKARAU)","North Rural"]
[50925,"BURRELL AVE","South West Urban"]
[35910,"BURRELL EXT/OCEAN VIEW WWAY (RP285)","Hauraki Islands"]
[33388,"BURRELL RD","Hauraki Islands"]
[34982,"BURRELL RD EXTN (PVT)","Hauraki Islands"]
[35906,"BURRELL/ESPLANADE WWAY (RP696)","Hauraki Islands"]
[33387,"BURRETT AVE","Central East"]
[30199,"BURROWS AVE","Central"]
[52753,"BURSWOOD DR","South East Urban"]
[33389,"BURT RD","Central East"]
[30200,"BURTON ST","Central"]
[47346,"BURTONS DR","West"]
[70079,"BURTT RD","South Rural"]
[50927,"BURUNDI AVE","South West Urban"]
[15720,"BURUNDI AVE LINK CYWAY","South West Urban"]
[30201,"BURWOOD CRES","Central East"]
[11367,"BURWOOD TCE","North Urban East"]
[20585,"BUSBRIDGE PL","North Urban West"]
[10142,"BUSBRIDGE RD","North Rural"]
[30202,"BUSBY ST","West"]
[40185,"BUSCOMB AVE","West"]
[41232,"BUSCOMB AVE EXTN","West"]
[24030,"BUSH LANE (PVT)","North Urban West"]
[20057,"BUSH RD (ALBANY)","North Urban West"]
[70080,"BUSH RD (RAMARAMA)","South Rural"]
[41039,"BUSH RD (WAITAKERE)","West"]
[22890,"BUSHGLEN CRT","North Urban East"]
[22609,"BUSHLANDS PARK DR","North Urban West"]
[60063,"BUSHLANDS PL","South West Urban"]
[71391,"BUSHMERE DR","South Rural"]
[53643,"BUSHPARK PL","South East Urban"]
[54753,"BUSINESS NORTH/WAIOURU RAB","South East Urban"]
[54031,"BUSINESS PDE NORTH","South East Urban"]
[54030,"BUSINESS PDE SOUTH","South East Urban"]
[54489,"BUSINESS PDE SOUTH (WEST)","South East Urban"]
[80682,"BUSINESS PDE SOUTH SERVICE LANE (RP 129)","South East Urban"]
[54488,"BUSINESS SOUTH RAB #3","South East Urban"]
[54483,"BUSINESS SOUTH/EL KOBAR RAB","South East Urban"]
[60064,"BUSING AVE","South West Urban"]
[70083,"BUTCHER RD","South Rural"]
[22267,"BUTE RD","North Urban East"]
[20874,"BUTE RD SERVICE LANE","North Urban East"]
[47155,"BUTIA AVE","West"]
[50928,"BUTLER AVE","South West Urban"]
[54175,"BUTLER AVE CARPARK (RP63 LHS)","South West Urban"]
[80029,"BUTLER STONEY CRES","North Urban East"]
[50929,"BUTLEY DR","South East Urban"]
[54718,"BUTLEY/GLENMORE RAB","South East Urban"]
[11287,"BUTTERCUP PL","North Rural"]
[60065,"BUTTERWORTH AVE","South West Urban"]
[41038,"BUTTERWORTH DR","West"]
[30203,"BUTTLE ST","Central East"]
[31080,"BUTTLE/RIDINGS WWAY (RP99 RHS)","Central East"]
[30204,"BUXTON ST","Central"]
[53190,"BYBLOS PL","South West Urban"]
[70084,"BYCROFT RD","South Rural"]
[24016,"BYRNE PL (PVT)","North Urban West"]
[20151,"BYRON AVE","North Urban East"]
[35917,"CABBAGE TREE SWAMP DR (PVT)","Central"]
[11390,"CABELEIGH DR","North Rural"]
[20692,"CABELLO PL","North Urban West"]
[22564,"CABELLO PL HAMMERHEAD","North Urban West"]
[41037,"CABERNET CRES","West"]
[36098,"CABLE BAY LANE","Hauraki Islands"]
[10143,"CABLE RD","North Rural"]
[24036,"CADDEAN LANE (PVT)","North Urban West"]
[50931,"CADE PL","South West Urban"]
[60456,"CADENZA PL","South West Urban"]
[15416,"CADENZA PL/BROCKTON AVE CYWAY","South West Urban"]
[60066,"CADIZ PL","South West Urban"]
[33390,"CADMAN AVE (GREENLANE)","Central East"]
[30205,"CADMAN AVE (WATERVIEW)","Central"]
[35901,"CADMAN/KAWAU WWAY (RP315 LHS)","Central East"]
[21010,"CADNESS ST","North Urban West"]
[22506,"CADNESS ST (AC.WAY)","North Urban West"]
[33391,"CAEN RD","Central East"]
[47333,"CAFFREYS AVE","West"]
[24015,"CAHILL PL (PVT)","North Urban West"]
[50926,"CAHIR PL","South East Urban"]
[34696,"CAIN RD","Central East"]
[22268,"CAIRNBRAE CRT","North Urban East"]
[50932,"CAIRNGORM PL","South East Urban"]
[15761,"CAIRNGORM PL/HOWICK REC CENTRE CYWAY","South East Urban"]
[53283,"CAIRNSVALE RISE","South West Urban"]
[70086,"CAITCHEON RD","South Rural"]
[50933,"CAITHNESS PL","South East Urban"]
[15810,"CAITHNESS PL/BEACONVIEW RISE CYWAY","South East Urban"]
[15814,"CAITHNESS PL/HILL RISE CYWAY","South East Urban"]
[15811,"CAITHNESS PL/MEANDA GARDENS CYWAY (RP345)","South East Urban"]
[41036,"CAJERO PL","West"]
[33392,"CALAIS TCE","Hauraki Islands"]
[80513,"CALCITE AVE","South East Urban"]
[70087,"CALCUTTA RD","South Rural"]
[52902,"CALDBECK RISE","South East Urban"]
[53347,"CALDECOTE PL","South East Urban"]
[30206,"CALDER PL","Central East"]
[80328,"CALDERA DR","North Urban East"]
[71480,"CALDERWOOD CLOSE","South Rural"]
[50934,"CALDWELLS RD","South East Urban"]
[52741,"CALDWELLS RD (EAST)","South Rural"]
[30207,"CALEDONIAN PL","West"]
[50935,"CALEY CRT","South West Urban"]
[33393,"CALGARY ST","Central"]
[30208,"CALIBAN PL","Central East"]
[30209,"CALIFORNIA PL","Central East"]
[50936,"CALLENDER PL","South East Urban"]
[20659,"CALLIOPE RD","North Urban East"]
[60067,"CALLIS AVE","South West Urban"]
[50937,"CALLUNA CRES","South West Urban"]
[15560,"CALLUNA CRES LINK CYWAY","South West Urban"]
[22030,"CALMAN PL","North Urban West"]
[50938,"CALTHORP CLOSE","South West Urban"]
[53301,"CALTRA PL","South East Urban"]
[54458,"CALTRA PL EXTN","South East Urban"]
[60577,"CALUMET WAY","South West Urban"]
[50939,"CALVERT AVE","South West Urban"]
[60068,"CALVERT ST","South West Urban"]
[30210,"CALVIN PL","West"]
[22269,"CALYPSO PL","North Urban East"]
[22747,"CALYPSO WAY","North Urban West"]
[53678,"CAMBERLEY CRT (PVT)","South West Urban"]
[33395,"CAMBOURNE RD","Central"]
[50940,"CAMBOURNE RD (PAPATOETOE)","South West Urban"]
[33995,"CAMBOURNE RD (SANDRINGHAM)","Central"]
[33397,"CAMBRAI AVE","Central"]
[22140,"CAMBRIA RD","North Urban East"]
[53486,"CAMBRIAN CRES","South East Urban"]
[15492,"CAMBRIAN CRES LINK CYWAY","South East Urban"]
[50942,"CAMBRIC PL","South East Urban"]
[80133,"CAMBRIDGE LANE","West"]
[50943,"CAMBRIDGE RD (MANUREWA)","South West Urban"]
[11227,"CAMBRIDGE RD (NORTH)","North Rural"]
[10144,"CAMBRIDGE RD (RIVERHEAD)","North Rural"]
[22050,"CAMBRIDGE TCE (DEVONPORT)","North Urban East"]
[50944,"CAMBRIDGE TCE (PAPATOETOE)","South West Urban"]
[50945,"CAMDEN PL","South West Urban"]
[33398,"CAMDEN RD","Central"]
[33399,"CAMELLIA PL","Central"]
[20431,"CAMELOT PL","North Urban West"]
[50946,"CAMEO COURT RD","South West Urban"]
[60310,"CAMERON PL (DRURY)","South West Urban"]
[41035,"CAMERON PL (WAITAKERE)","West"]
[20137,"CAMERON RD (TAKAPUNA)","North Urban East"]
[70090,"CAMERON RD (WAIUKU)","South Rural"]
[33400,"CAMERON ST (ONEHUNGA)","Central East"]
[60069,"CAMERON ST (PAPAKURA)","South West Urban"]
[30211,"CAMERON ST (PONSONBY)","Central"]
[80693,"CAMERON WAY","North Rural"]
[52857,"CAMERTON CLOSE","South East Urban"]
[35044,"CAMERTON RD","Hauraki Islands"]
[11326,"CAMES RD","North Rural"]
[10145,"CAMES RD (TE ARAI)","North Rural"]
[20372,"CAMILLA GR","North Urban West"]
[50947,"CAMIRA PL","South East Urban"]
[53652,"CAMITH CLOSE","South East Urban"]
[11581,"CAMMISH LANE","North Urban East"]
[33401,"CAMP RD","Central East"]
[50948,"CAMPANA RD","South West Urban"]
[33402,"CAMPBELL CRES","Central"]
[10146,"CAMPBELL DR","North Rural"]
[60070,"CAMPBELL PL","South West Urban"]
[33403,"CAMPBELL RD (GREENLANE)","Central East"]
[50949,"CAMPBELL RD (MARAETAI)","South Rural"]
[20159,"CAMPBELL RD (TAKAPUNA)","North Urban East"]
[80581,"CAMPBELL RD/ONEHUNGA MALL RAB","Central East"]
[70855,"CAMPBELL ST","South Rural"]
[10147,"CAMPBELLS RD","North Rural"]
[41034,"CAMPHORA PL","West"]
[52809,"CAMPIAN PL","South East Urban"]
[53226,"CAMPILE CLOSE","South East Urban"]
[20459,"CAMROSE PL","North Urban West"]
[50950,"CAMWELL CLOSE","South East Urban"]
[30212,"CANADA ST","Central"]
[30213,"CANAL RD","West"]
[22820,"CANARY PL","North Urban West"]
[22972,"CANAVERAL DR","North Urban West"]
[33405,"CANBERRA AVE","Central"]
[41033,"CANDIA RD","West"]
[23001,"CANDLESTICK PL","North Urban West"]
[10148,"CANE RD","North Rural"]
[60679,"CANINI GR","South West Urban"]
[50952,"CANNING CRES","South West Urban"]
[80251,"CANNON ST","North Urban East"]
[50953,"CANON PL","South East Urban"]
[53480,"CANONBIE PL","South East Urban"]
[22031,"CANONGATE ST","North Urban West"]
[35254,"CANTERBURY PARK LANE (PVT)","Central East"]
[30214,"CANTERBURY PL","Central"]
[20492,"CANTINA AVE","North Urban West"]
[52906,"CANTORA AVE","South East Urban"]
[54478,"CANTORA AVE HAMMERHEAD","South East Urban"]
[15769,"CANTORA AVE LINK CYWAY","South East Urban"]
[50954,"CANTUA CLOSE","South West Urban"]
[53730,"CANTUA CLOSE/EVERGLADE DR WWAY","South West Urban"]
[23039,"CANYON DR","North Urban West"]
[33406,"CAPE BARRIER RD","Hauraki Islands"]
[11629,"CAPE COD DR","North Urban East"]
[70093,"CAPE HILL RD","South Rural"]
[33407,"CAPE HORN RD","Central"]
[35052,"CAPE HORNE RD LLA (#39 - #27)","Central"]
[50955,"CAPE RD","South West Urban"]
[53731,"CAPE RD/WADDON PL WWAY","South West Urban"]
[10149,"CAPE RODNEY RD","North Rural"]
[71500,"CAPE VISTA CRES","South Rural"]
[50956,"CAPELLA PL","South West Urban"]
[70094,"CAPES RD","South Rural"]
[20454,"CAPILANO PL","North Urban West"]
[52847,"CAPISTRANO MEWS","South West Urban"]
[54231,"CAPITAL PL","South West Urban"]
[10150,"CAPITOL RD","North Urban East"]
[22791,"CAPRI PL","North Urban West"]
[60599,"CAPRIANA DR","South West Urban"]
[15663,"CAPRIANA DR//LAKE CYWAY","South West Urban"]
[60617,"CAPRIANA/LOMBARDIA RAB","South West Urban"]
[22270,"CAPRICORN PL (BROWNS BAY)","North Urban East"]
[40016,"CAPRICORN PL (GLEN EDEN)","West"]
[71551,"CAPRIOLE CRES","South Rural"]
[41032,"CAPSTAN CRT","West"]
[50957,"CAPSTICK RD","South West Urban"]
[80616,"CAPTAIN MITCHELL DR","South West Urban"]
[40052,"CAPTAIN SCOTT RD","West"]
[41199,"CAPTAIN SCOTT RD LLA (#75 - #87)","West"]
[41317,"CAPTAIN SCOTT/WILSON RAB","West"]
[33408,"CAPTAIN SPRINGS RD","Central East"]
[10151,"CAPTAIN ST","North Rural"]
[22792,"CAPTAINS CLOSE","North Urban East"]
[34954,"CAPTAINS RETREAT (PVT)","Central"]
[53302,"CARAGH PL","South East Urban"]
[22032,"CARAM PL","North Urban West"]
[50958,"CARAVELLE CLOSE","South West Urban"]
[53733,"CARAVELLE CLOSE/BADER DR WWAY","South West Urban"]
[53734,"CARAVELLE CLOSE/VALIANT ST WWAY","South West Urban"]
[50959,"CARBERY PL","South West Urban"]
[70890,"CARBINE LANE (WAIUKU)","South Rural"]
[33409,"CARBINE RD","Central East"]
[53446,"CARBISDALE RD","South East Urban"]
[50960,"CARDIFF RD","South East Urban"]
[54715,"CARDIFF RD CARPARK (RP138 RHS)","South East Urban"]
[54157,"CARDIFF RD SERVICE LANE (RP164 RHS)","South East Urban"]
[70926,"CARDIFF ST","South Rural"]
[30215,"CARDIGAN ST","Central"]
[30216,"CARDINAL PL","Central East"]
[35787,"CARDINAL/RIDDELL WWAY (RP95 LHS)","Central East"]
[50961,"CARDRONA PL","South West Urban"]
[33411,"CARDWELL ST","Central East"]
[11478,"CARENTO WAY","North Urban East"]
[80370,"CAREX WAY","North Urban East"]
[50962,"CAREY PL","South West Urban"]
[15600,"CAREY PL LINK CYWAY","South West Urban"]
[30217,"CARGILL ST (NEWTON)","Central"]
[60071,"CARGILL ST (PAPAKURA)","South West Urban"]
[22565,"CARIBBEAN DR","North Urban West"]
[47042,"CARILLON PL","West"]
[22271,"CARINA CRES","North Urban East"]
[50963,"CARINGBAH DR","South West Urban"]
[60500,"CARISBROOK CRES","South West Urban"]
[60663,"CARISBROOK CRES HLA (#49 - #59)","South West Urban"]
[22617,"CARL PL","North Urban West"]
[47265,"CARLAS WAY","West"]
[30218,"CARLAW PARK AVE","Central"]
[50964,"CARLIE ST","South West Urban"]
[47156,"CARLING AVE","West"]
[41167,"CARLING AVE EXTN","West"]
[53236,"CARLINGFORD DR","South East Urban"]
[60452,"CARLINKA PL","South West Urban"]
[22272,"CARLISLE RD","North Urban East"]
[22273,"CARLISLE RD LLA (#32 - #50)","North Urban East"]
[30219,"CARLISLE ST","Central East"]
[53584,"CARLOS DR","South East Urban"]
[50965,"CARLTON CRES","South Rural"]
[30220,"CARLTON GORE RD","Central"]
[70925,"CARLTON RD","South Rural"]
[33412,"CARLTON ST","Central"]
[50966,"CARMEL AVE","South East Urban"]
[33413,"CARMEN AVE","Central"]
[10152,"CARMEN TCE","North Rural"]
[33414,"CARMONT PL","Central East"]
[30221,"CARMONT ST","Central East"]
[53329,"CARN PL","South West Urban"]
[50967,"CARNAC PL","South West Urban"]
[30222,"CARNARVON AVE","Central East"]
[47309,"CARNELIAN CRT","West"]
[41194,"CARNELIAN CRT EXTN","West"]
[53029,"CARNIEW PL","South East Urban"]
[41220,"CARNIGIE CRES (PVT)","North Urban West"]
[22662,"CARNMORE PL","North Urban East"]
[50968,"CARNOUSTIE DR","South West Urban"]
[54346,"CARNOUSTIE DR CARPARK (RP272 LHS)","South West Urban"]
[15658,"CARNOUSTIE DR LINK CYWAY (RP308)","South West Urban"]
[15657,"CARNOUSTIE DR LINK CYWAY (RP697)","South West Urban"]
[15656,"CARNOUSTIE DR LINK CYWAY (RP886)","South West Urban"]
[53735,"CARNOUSTIE DR/PINEHURST PL WWAY","South West Urban"]
[22982,"CAROL LEE PL","North Urban West"]
[11424,"CAROL LEON LANE","North Rural"]
[50969,"CAROLE CRES","South East Urban"]
[54716,"CAROLE CRES CARPARK (RP17 LHS)","South East Urban"]
[22911,"CAROLINA PL","North Urban West"]
[10153,"CAROLINE HEIGHTS","North Rural"]
[11155,"CAROLINE HEIGHTS (NORTH TO SOUTH)","North Rural"]
[30223,"CAROLINE ST","Central"]
[50970,"CAROLYN ST","South West Urban"]
[33415,"CARONIA CRES","Central"]
[53472,"CAROUSEL CRES","South East Urban"]
[80403,"CARPENTER LANE","North Urban East"]
[50971,"CARPENTER RD","South East Urban"]
[33416,"CARR RD","Central"]
[35840,"CARR/HAYR RAB","Central"]
[10154,"CARRAN RD","North Rural"]
[10155,"CARREEN GR","North Urban East"]
[50972,"CARRIAGE CLOSE","South East Urban"]
[54475,"CARRIAGE CLOSE HAMMERHEAD","South East Urban"]
[53435,"CARRICK GLEN AVE","South East Urban"]
[33417,"CARRICK PL","Central"]
[31638,"CARRICK PL EXT (CARRICK - END)","Central"]
[31639,"CARRICK PL EXT (DOMINION - END)","Central"]
[50930,"CARRICKDAWSON DR","South East Urban"]
[33418,"CARRIE ST","Central"]
[22753,"CARRIGANS CLOSE","North Urban West"]
[30224,"CARRINGTON RD","Central"]
[36015,"CARRINGTON RD CARPARK (RP1217 RHS)","Central"]
[30471,"CARRINGTON RD LLA (PROSPERO - END)","Central"]
[30757,"CARRINGTON RD SERVICE LANE (RP58)","Central"]
[15166,"CARRINGTON RD/TE ATATU RD CYWAY","West"]
[36012,"CARRINGTON/GT NTH CYWAY (RP127)","Central"]
[36013,"CARRINGTON/SH16 CYWAY (RP53 RHS)","Central"]
[22751,"CARROWMORE","North Urban West"]
[34697,"CARRS PL","Central East"]
[50973,"CARRUTH RD","South West Urban"]
[53736,"CARRUTH RD/AVIS AVE WWAY","South West Urban"]
[35297,"CARSONS RD","Hauraki Islands"]
[50974,"CARTER PL","South West Urban"]
[54326,"CARTER PL EXTN","South West Urban"]
[70095,"CARTER RD (PATUMAHOE)","South Rural"]
[41031,"CARTER RD (WAITAKERE)","West"]
[52836,"CARTERS LANE","South West Urban"]
[47339,"CARTMEL AVE","West"]
[48309,"CARTMEL AVE WWAY","West"]
[41119,"CARTWRIGHT RD","West"]
[15531,"CARUS AVE/KIRKELLA CRES NORTH CYWAY","South West Urban"]
[15532,"CARUS AVE/KIRKELLA CRES SOUTH CYWAY","South West Urban"]
[50975,"CARVER PL","South West Urban"]
[52907,"CASABELLA CRT","South East Urban"]
[41030,"CASCADE AVE","West"]
[70096,"CASCADE RD","South Rural"]
[30225,"CASCADE ST","Central"]
[11324,"CASCADEN RD","North Urban East"]
[50976,"CASCADES RD","South East Urban"]
[54125,"CASCADES RD CARPARK (RP1055 RHS)","South East Urban"]
[54158,"CASCADES RD SERVICE LANE (RP1055)","South East Urban"]
[15694,"CASCADES RD/BOTANY RD CYWAY","South East Urban"]
[54685,"CASCADES/AVIEMORE RAB","South East Urban"]
[50977,"CASERTA PL","South West Urban"]
[22695,"CASHEL PL","North Urban East"]
[20445,"CASHMERE PL","North Urban West"]
[53088,"CASHMORE PL","South East Urban"]
[50978,"CASPAR RD","South West Urban"]
[54503,"CASPAR RD CARPARK (RP23 RHS)","South East Urban"]
[52834,"CASPAR RD SERVICE LANE (RP56 RHS)","South West Urban"]
[41424,"CASPIAN CLOSE","West"]
[20367,"CASSANDRA GR","North Urban West"]
[20346,"CASSIA PL","North Urban East"]
[20076,"CASSINO ST","North Urban East"]
[33419,"CASSINO TCE","Central"]
[41029,"CASTAING CRES","West"]
[10157,"CASTAWAY PL","North Urban East"]
[60614,"CASTELLINA DR","South West Urban"]
[30226,"CASTLE DR","Central"]
[30227,"CASTLE ST","Central"]
[50951,"CASTLEBAIN DR","South East Urban"]
[54435,"CASTLEDERG DR","South East Urban"]
[30228,"CASTLEDINE CRES","Central East"]
[53498,"CASTLEFINN DR","South West Urban"]
[54325,"CASTLEFINN DR EXTN","South West Urban"]
[40190,"CASTLEFORD ST","West"]
[53041,"CASTLEHILL CRT","South West Urban"]
[54362,"CASTLEHILL CRT EXTN (EAST)","South West Urban"]
[54364,"CASTLEHILL CRT EXTN (WEST)","South West Urban"]
[54363,"CASTLEHILL RAB","South West Urban"]
[53028,"CASTLEMAINE CLOSE","South East Urban"]
[50979,"CASTLETON DR","South East Urban"]
[22033,"CASTLETON ST","North Urban West"]
[22566,"CASTLETON ST ACCESSWAY","North Urban West"]
[47157,"CASTLEVIEW LANE","West"]
[30229,"CASTLEWOOD GR","West"]
[20223,"CASTOR BAY RD","North Urban East"]
[50980,"CASUARINA RD","South East Urban"]
[20324,"CATALINA CRES","North Urban East"]
[60305,"CATANIA PL","South West Urban"]
[71504,"CATHCART CLOSE","South Rural"]
[30230,"CATHEDRAL PL","Central"]
[33421,"CATHERINE ST (ONEHUNGA)","Central East"]
[41028,"CATHERINE ST (WAITAKERE)","West"]
[50981,"CATKIN CRES","South West Urban"]
[54508,"CATKIN CRES LOOP","South West Urban"]
[23024,"CATLINS PL","North Urban West"]
[71303,"CATO PEART RD","South Rural"]
[11110,"CATON RD","West"]
[22034,"CATRINA AVE","North Urban West"]
[33422,"CATTON CRES","Central"]
[33423,"CAUGHEY PL","Central"]
[30231,"CAULTON ST","Central East"]
[33420,"CAUSEWAY RD","Hauraki Islands"]
[20657,"CAUTLEY ST","North Urban East"]
[80422,"CAVALLI ROAD","North Urban East"]
[54399,"CAVENDISH DR (EASTBOUND)","South West Urban"]
[50982,"CAVENDISH DR (WESTBOUND)","South West Urban"]
[53871,"CAVENDISH DR/ATKINSON AVE WWAY","South West Urban"]
[22668,"CAVERSHAM DR","North Urban East"]
[33424,"CAWLEY ST","Central East"]
[22748,"CAYMAN PL","North Urban West"]
[54227,"CEASAR PL","South West Urban"]
[33425,"CEBALO PL","Central East"]
[20724,"CEBEL PL","North Urban West"]
[41026,"CECIL BEATT PL","West"]
[30232,"CECIL RD (EPSOM)","Central"]
[20199,"CECIL RD (MILFORD)","North Urban East"]
[24103,"CECINA WAY (PVT)","North Urban West"]
[41025,"CEDAR HEIGHTS AVE","West"]
[48286,"CEDAR HEIGHTS AVE WWAY","West"]
[30233,"CEDAR RD","Central"]
[10159,"CEDAR TCE","North Urban East"]
[50983,"CELADON PL","South West Urban"]
[15462,"CELADON PL/ZIRCON PL CYWAY","South West Urban"]
[20390,"CELESTE PL","North Urban West"]
[50984,"CELIA PL","South West Urban"]
[22274,"CELINA PL","North Urban East"]
[41024,"CELLAR CRT","West"]
[47043,"CELLARMANS ST","West"]
[48187,"CELLARMANS ST WWAY","West"]
[53231,"CELLBRIDGE PL","South East Urban"]
[50985,"CELMISIA PL","South West Urban"]
[41023,"CELSMERE LANE","West"]
[30234,"CELTIC CRES","Central East"]
[34846,"CELTIC CRES EXTN (RP1208 LHS)","Central East"]
[34847,"CELTIC CRES LOOP (RP1037 RHS)","Central East"]
[70098,"CEMETERY RD (AWHITU)","South Rural"]
[70099,"CEMETERY RD (WAIUKU)","South Rural"]
[10160,"CEMETERY RD 1 (TE ARAI) (NORTH)","North Rural"]
[11158,"CEMETERY RD 1 (TE ARAI) (SOUTH)","North Rural"]
[10162,"CEMETERY RD 2 (WAINUI)","North Rural"]
[34907,"CENOTAPH RD","Central"]
[22783,"CENTAUR CLOSE","North Urban West"]
[10163,"CENTENNIAL PARK RD","North Rural"]
[22891,"CENTENNIAL PL","North Urban East"]
[20676,"CENTORIAN DR","North Urban West"]
[50986,"CENTRAL AVE","South West Urban"]
[80016,"CENTRAL BOULEVARD","North Urban East"]
[41022,"CENTRAL PARK DR","West"]
[15123,"CENTRAL PARK DR/MOTORWAY (RP245) CYWAY","West"]
[15150,"CENTRAL PARK DR/MOTORWAY CWAY (RP2184)","West"]
[33426,"CENTRAL RD","Central"]
[52839,"CENTRAL TCE","South East Urban"]
[30235,"CENTRE ST","Central"]
[24025,"CENTRE WAY (PVT)","North Urban West"]
[10164,"CENTREWAY RD","North Urban East"]
[15154,"CERAMCO PARK LINK CYWAY","West"]
[22275,"CERAMCO PL","North Urban East"]
[22910,"CERES CRT","North Urban West"]
[41292,"CESARI PL","North Urban West"]
[50988,"CESSNA PL","South West Urban"]
[53653,"CETONA CRT","South East Urban"]
[40071,"CEZANNE PL","West"]
[40341,"CEZANNE PL EXTN","West"]
[41021,"CHABLIS PL","West"]
[47128,"CHADLINGTON AVE","West"]
[48112,"CHADLINGTON AVE WWAY","West"]
[47199,"CHADLINGTON/BRITTANY RAB","West"]
[47200,"CHADLINGTON/FLEETWOOD RAB","West"]
[47201,"CHADLINGTON/HIGHFIELDS RAB","West"]
[47202,"CHADLINGTON/ROY MALONEY RAB","West"]
[50989,"CHADWICK CRES","South West Urban"]
[54598,"CHADWICK CRES EXTN","South West Urban"]
[52826,"CHALE PL","South East Urban"]
[50990,"CHALFONT ST","South West Urban"]
[60302,"CHALLEN CLOSE","South West Urban"]
[60685,"CHALLEN CLOSE CARPARK (RP23 LHS)","South West Urban"]
[60529,"CHALLEN CLOSE LOOP","South West Urban"]
[30236,"CHALLENGER ST","Central East"]
[33427,"CHALLINOR CRES","Central"]
[50991,"CHALLINOR ST","South East Urban"]
[53738,"CHALLINOR ST-PANDORA PL","South East Urban"]
[53737,"CHALLINOR ST-PELORUS PL","South East Urban"]
[11119,"CHALMERS CLOSE","North Urban East"]
[30237,"CHALMERS ST","West"]
[50992,"CHAMADE PL","South West Urban"]
[53739,"CHAMADE PL-GREENSTOON PL","South West Urban"]
[47044,"CHAMARI CLOSE","West"]
[70100,"CHAMBERLAIN RD (BOMBAY)","South Rural"]
[41020,"CHAMBERLAIN RD (WAITAKERE)","West"]
[31784,"CHAMBERLAIN ST","Central"]
[53636,"CHANCELLOR PL","South East Urban"]
[30239,"CHANCERY ST","Central"]
[35760,"CHANCERY/SHORTLAND WWAY (RP30)","Central"]
[33429,"CHANDLER AVE","Central East"]
[22277,"CHANNEL VIEW RD - CAMPBELLS BAY","North Urban East"]
[20140,"CHANNEL VIEW RD - TAKAPUNA","North Urban East"]
[70101,"CHANNEL VIEW RD (CLARKS BEACH)","South Rural"]
[26024,"CHANNEL VIEW RD CARPARK (AMP) NTH","North Urban East"]
[26023,"CHANNEL VIEW RD CARPARK (AMP) STH","North Urban East"]
[50993,"CHANNING CRES","South East Urban"]
[15762,"CHANNING CRES/SHEFFIELD PL CYWAY","South East Urban"]
[41275,"CHANSON LANE (PVT)","West"]
[60072,"CHANTAL PL","South West Urban"]
[60530,"CHANTAL PL EXTN","South West Urban"]
[60531,"CHANTAL PL EXTN HAMMERHEAD","South West Urban"]
[50994,"CHANTELLE PL","South West Urban"]
[50995,"CHAPEL RD","South East Urban"]
[15683,"CHAPEL RD LINK CYWAY (RP5443)","South East Urban"]
[15684,"CHAPEL RD LINK CYWAY (RP5533)","South East Urban"]
[53420,"CHAPEL RD SLIP (#321 - #341)","South East Urban"]
[54452,"CHAPEL RD SLIP (#350 - SAVONA DR)","South East Urban"]
[53307,"CHAPEL RD SLIP (#357 - #373)","South East Urban"]
[53309,"CHAPEL RD SLIP (#381 - #393)","South East Urban"]
[53487,"CHAPEL RD SLIP (#386 - #410)","South East Urban"]
[53426,"CHAPEL RD SLIP (#414 - #438)","South East Urban"]
[53308,"CHAPEL RD SLIP (#448 - #476)","South East Urban"]
[53310,"CHAPEL RD SLIP (#515 - #531)","South East Urban"]
[53311,"CHAPEL RD SLIP (#538 - #550)","South East Urban"]
[15491,"CHAPEL RD SLIP/ZARA CRT CYWAY","South East Urban"]
[53741,"CHAPEL RD SLIP-GLANMIRE PL","South East Urban"]
[53740,"CHAPEL RD SLIP-MORDANE PL","South East Urban"]
[15490,"CHAPEL RD/CAMPILE CL CYWAY","South East Urban"]
[15488,"CHAPEL RD/CARAGH PL CYWAY","South East Urban"]
[15489,"CHAPEL RD/ERNE CRES CYWAY","South East Urban"]
[15487,"CHAPEL RD/NIER PL CYWAY","South East Urban"]
[15495,"CHAPEL RD/WAYNE FRANCIS DR CYWAY","South East Urban"]
[53743,"CHAPEL RD-CELLBRIDGE PL","South East Urban"]
[60073,"CHAPEL ST","South West Urban"]
[53235,"CHAPLETOWN DR","South East Urban"]
[50996,"CHAPLIN ST","South West Urban"]
[41019,"CHAPMAN RD (WAITAKERE)","West"]
[30240,"CHAPMAN ST","Central"]
[30244,"CHARANN PL","West"]
[53629,"CHARD PL","South East Urban"]
[41018,"CHARDON PL","West"]
[48092,"CHARDON PL WWAY 1","West"]
[48093,"CHARDON PL WWAY 2","West"]
[47158,"CHARDONNAY RISE","West"]
[40027,"CHARDONNAY RISE EXTN","West"]
[50997,"CHARISMA PL","South West Urban"]
[71199,"CHARISMA RD","South Rural"]
[15111,"CHARLENNE CL LINK CYWAY (RP215)","West"]
[47086,"CHARLENNE CLOSE","West"]
[50998,"CHARLES DICKENS DR","South East Urban"]
[15831,"CHARLES DICKENS DR/OLIVER TWIST AVE CYWAY","South East Urban"]
[30242,"CHARLES FOX PL","Central East"]
[70411,"CHARLES MILLER CRT","South Rural"]
[50999,"CHARLES PREVOST DR","South West Urban"]
[53362,"CHARLES PREVOST/WAIRERE RAB","South West Urban"]
[70102,"CHARLES RD","South Rural"]
[10166,"CHARLES ST (MAHURANGI EAST)","North Rural"]
[30241,"CHARLES ST (MT EDEN)","Central"]
[51000,"CHARLES ST (PAPATOETOE)","South West Urban"]
[20131,"CHARLES ST (TAKAPUNA)","North Urban East"]
[54107,"CHARLES ST SERVICE LANE (RP146 LHS)","South West Urban"]
[54644,"CHARLES ST SERVICE LANE (RP64 LHS)","South West Urban"]
[80322,"CHARLESTOWN DR","South East Urban"]
[30243,"CHARLOTTE ST (EDEN TERRACE)","Central"]
[11221,"CHARLOTTE ST (STANMORE BAY)","North Urban East"]
[33432,"CHARLTON AVE","Central"]
[22278,"CHARMAINE PL","North Urban East"]
[20513,"CHARNLEY GR","North Urban West"]
[51001,"CHARNTAY AVE","South West Urban"]
[54409,"CHARNTAY AVE CARPARK (RP837 RHS)","South East Urban"]
[47279,"CHARTA PL","West"]
[20413,"CHARTWELL AVE","North Urban West"]
[22561,"CHARTWELL AVE SHOP ACCESS WAY","North Urban West"]
[53630,"CHATEAU RISE","South East Urban"]
[53649,"CHATEAU/HAWKDUN RAB","South East Urban"]
[53648,"CHATEAU/VIN ALTO RAB","South East Urban"]
[33434,"CHATFIELD AVE","South West Urban"]
[30245,"CHATFIELD PL","Central East"]
[30246,"CHATHAM AVE","Central"]
[20646,"CHATHAM RD","North Urban West"]
[10167,"CHATHAM RD (EAST)","North Rural"]
[11332,"CHATHAM RD (WEST)","North Rural"]
[22035,"CHATSWOOD GR HAMMERHEAD","North Urban West"]
[22044,"CHATSWOOD GR LINK","North Urban West"]
[51002,"CHATSWORTH CRES","South East Urban"]
[30247,"CHAUCER PL","West"]
[53418,"CHAYWARD PL","South West Urban"]
[53744,"CHAYWARD PL-SHAH LANE","South West Urban"]
[51003,"CHEAM PL","South East Urban"]
[47093,"CHECKERBERRY CRT","West"]
[48103,"CHECKERBERRY CRT WWAY","West"]
[20568,"CHEDWORTH DR","North Urban West"]
[30248,"CHEESEMAN PL","Central East"]
[51004,"CHELBURN CRES","South West Urban"]
[54571,"CHELBURN CRES EXTN","South West Urban"]
[30249,"CHELMSFORD AVE","Central East"]
[47294,"CHELMSLEY AVE","West"]
[33436,"CHELSEA AVE","South West Urban"]
[24078,"CHELSEA LANE (PVT)","North Urban East"]
[22036,"CHELSEA VIEW DR","North Urban West"]
[24079,"CHELTENHAM DR (PVT)","North Urban East"]
[22097,"CHELTENHAM RD","North Urban East"]
[10168,"CHELVERTON TCE","North Urban East"]
[10169,"CHENERY RD","North Urban East"]
[20437,"CHEQUERS AVE","North Urban West"]
[71249,"CHERITON LANE","South Rural"]
[51005,"CHERITON RD","South East Urban"]
[51006,"CHERRIE RD","South Rural"]
[60469,"CHERRINGTON RD","South Rural"]
[11198,"CHERRY BLOSSOM LANE","North Rural"]
[70927,"CHERRY CRES","South Rural"]
[24057,"CHERRY HILL (PVT)","North Urban West"]
[24012,"CHERRY LANE (PVT)","North Urban West"]
[70896,"CHERRY PL","South Rural"]
[51007,"CHERRY RD","South East Urban"]
[41017,"CHERRY TREE PL","West"]
[53456,"CHERRYWOOD CRES","South East Urban"]
[41016,"CHERUB PL","North Urban West"]
[20287,"CHERYL PL","North Urban West"]
[51008,"CHESHAM LANE (CLEVEDON)","South Rural"]
[24039,"CHESHAM LANE (PVT)","North Urban West"]
[30250,"CHESHIRE ST (NORTH)","Central"]
[31684,"CHESHIRE ST (SOUTH)","Central"]
[51009,"CHESLEY PL","South East Urban"]
[53745,"CHESLEY PL-LIAM PL","South East Urban"]
[80647,"CHESTER AVE (EAST) (ALBANY)","North Urban West"]
[80648,"CHESTER AVE (WEST) (ALBANY)","North Urban West"]
[30251,"CHESTER AVE (WESTMERE)","Central"]
[24034,"CHESTER LANE (PVT)","North Urban West"]
[30252,"CHESTERFIELD AVE","Central East"]
[11385,"CHESTERFIELD WAY","North Urban East"]
[47297,"CHESTERTON TCE","West"]
[51010,"CHESTNUT RD","South West Urban"]
[47094,"CHETTLE CRT","West"]
[20377,"CHEVAL DR","North Urban West"]
[30253,"CHEVERTON PL","Central East"]
[51011,"CHEVIOT ST","South West Urban"]
[51012,"CHEVIS PL","South East Urban"]
[20234,"CHEVRON PL","North Urban East"]
[51013,"CHIANIA PL","South East Urban"]
[53746,"CHIANIA PL-CLYDESDALE AVE","South East Urban"]
[54213,"CHIANTI CLOSE","South East Urban"]
[60300,"CHIBNALL PL","South West Urban"]
[11502,"CHIC GARDENS","North Rural"]
[60306,"CHICA PL","South West Urban"]
[60074,"CHICHESTER DR","South West Urban"]
[53069,"CHIEFTAIN RISE","South West Urban"]
[41015,"CHILCOTT RD","West"]
[41014,"CHILDERS RD","West"]
[48208,"CHILDERS RD WWAY 1","West"]
[48209,"CHILDERS RD WWAY 2","West"]
[70928,"CHILDS AVE","South Rural"]
[30254,"CHILTERN CRES","Central East"]
[35858,"CHILTERN/ELSTREE WWAY (RP255)","Central East"]
[51014,"CHILTON PL","South East Urban"]
[51015,"CHINE PL","South West Urban"]
[51016,"CHINGFORD CLOSE","South West Urban"]
[54607,"CHINGFORD CLOSE EXTN","South West Urban"]
[53747,"CHINGFORD CLOSE-ILFORD CRES","South West Urban"]
[51017,"CHIP GR","South East Urban"]
[53748,"CHIP GR-GLENMORE RD","South East Urban"]
[22037,"CHIPPENDALE CRES","North Urban West"]
[60439,"CHIPPEWA PL","South West Urban"]
[51018,"CHIPPING DALE","South West Urban"]
[54621,"CHIPPING DALE EXTN","South West Urban"]
[51019,"CHISBURY TCE","South East Urban"]
[51020,"CHISHOLM PL","South West Urban"]
[54565,"CHISHOLM PL HAMMERHEAD","South West Urban"]
[41013,"CHISLEHURST ST","West"]
[41012,"CHISLEHURST ST (SOUTH)","West"]
[20027,"CHIVALRY RD","North Urban West"]
[21033,"CHIVALRY RD LLA (NEAR COLIN WILD)","North Urban West"]
[47366,"CHLOE PL","West"]
[41011,"CHOICE AVE","West"]
[53589,"CHONNY CRES","South West Urban"]
[41010,"CHORLEY AVE","West"]
[60075,"CHRISARDA PL","South West Urban"]
[60652,"CHRISARDA PL HAMMERHEAD (NORTH)","South West Urban"]
[60532,"CHRISARDA PL HAMMERHEAD (SOUTH)","South West Urban"]
[80333,"CHRISTA PL","South Rural"]
[20236,"CHRISTENSEN PL","North Urban East"]
[40205,"CHRISTIAN RD","West"]
[33437,"CHRISTIE ST","Central"]
[41009,"CHRISTINA AVE","West"]
[11336,"CHRISTINE PL","North Rural"]
[33438,"CHRISTINI ST","Central"]
[51021,"CHRISTMAS RD","South West Urban"]
[15426,"CHRISTMAS RD/BEAUMONTS WAY CYWAY","South West Urban"]
[80533,"CHRISTOPHER LANE","North Rural"]
[41008,"CHROME PL","West"]
[34983,"CHURCH BAY RD","Hauraki Islands"]
[33439,"CHURCH CRES","Central East"]
[10170,"CHURCH HILL","North Rural"]
[10171,"CHURCH HILL RD","North Rural"]
[60307,"CHURCH RD (ARDMORE)","South Rural"]
[51022,"CHURCH RD (MANGERE BRIDGE)","South West Urban"]
[22028,"CHURCH ST - DEVONPORT","North Urban East"]
[21011,"CHURCH ST - NORTHCOTE","North Urban West"]
[22865,"CHURCH ST (ACCESSWAY #45)","North Urban East"]
[34698,"CHURCH ST (ONEHUNGA)","Central East"]
[33441,"CHURCH ST (OTAHUHU)","South West Urban"]
[41007,"CHURCH ST (WAITAKERE)","West"]
[35282,"CHURCH ST EAST (SOUTHDOWN)","Central East"]
[15507,"CHURCH ST/MEADOW ST CYWAY","South West Urban"]
[71477,"CHURCH VIEW RD","South Rural"]
[31670,"CHURCH/AVENUE RAB","South West Urban"]
[31669,"CHURCH/HIGH RAB","South West Urban"]
[33443,"CHURCHES AVE","Central"]
[51023,"CHURCHILL AVE","South West Urban"]
[54350,"CHURCHILL AVE CARPARK (RP582 RHS)","South West Urban"]
[51024,"CHURCHILL RD (COCKLE BAY)","South East Urban"]
[22279,"CHURCHILL RD (ROTHESAY BAY)","North Urban East"]
[30255,"CHURCHILL ST (CITY/NORTH)","Central"]
[36090,"CHURCHILL ST (CITY/SOUTH)","Central"]
[70929,"CHURCHILL ST (PUKEKOHE)","South Rural"]
[70907,"CHURCHILL TCE","South Rural"]
[20603,"CHURCHOUSE RD","North Urban West"]
[30256,"CHURTON ST","Central"]
[80711,"CILLIERS DRIVE","North Urban East"]
[51025,"CINDY PL","South East Urban"]
[47003,"CINNABAR PL","West"]
[53265,"CINNAMON RD","South West Urban"]
[35249,"CINTRA PL (CITY) (PVT)","Central"]
[30257,"CINTRA PL (GLEN INNES)","Central East"]
[35884,"CINTRA/MELLING WWAY (RP93 LHS)","Central East"]
[41006,"CIPRIAN PL","West"]
[48164,"CIPRIAN PL WWAY","West"]
[40813,"CIRRUS WAY","West"]
[51026,"CITATION WAY","South East Urban"]
[53750,"CITATION WAY-BRADBURY RD","South East Urban"]
[60076,"CITRIL PL","South West Urban"]
[53522,"CITRON CRT","South East Urban"]
[54446,"CITRON CRT HAMMERHEAD","South East Urban"]
[30258,"CITY RD","Central"]
[22038,"CITY VIEW TCE","North Urban West"]
[47365,"CITYVIEW PL","West"]
[23008,"CIVIC CRES","North Urban West"]
[70884,"CIVIC PL","South Rural"]
[22801,"CIVIL PL (ALBANY INDUSTRIAL)","North Urban West"]
[51027,"CIVIL PL (OTARA)","South West Urban"]
[10172,"CIVIL RD","North Rural"]
[53503,"CIVITA CRT","South West Urban"]
[54215,"CLADY DR","South East Urban"]
[10174,"CLAGUE RD","North Rural"]
[30259,"CLAIRVILLE CRES","Central East"]
[10173,"CLANSMAN TCE","North Urban East"]
[47354,"CLAPTON PL","West"]
[33444,"CLARE PL","Central East"]
[54229,"CLARE PL (FAVONA)","South West Urban"]
[24002,"CLARE PL (GLENFIELD) (PVT)","North Urban West"]
[33445,"CLAREMONT ST","Central"]
[53112,"CLAREMONT WAY","South East Urban"]
[21012,"CLARENCE RD","North Urban West"]
[20751,"CLARENCE ST (EAST)","North Urban East"]
[30260,"CLARENCE ST (PONSONBY)","Central"]
[22524,"CLARENCE ST (WEST)","North Urban East"]
[26002,"CLARENCE ST CARPARK DP126292","North Urban East"]
[30261,"CLARENDON RD","Central East"]
[51028,"CLARESHOLM PL","South West Urban"]
[53752,"CLARESHOLM PL-ANDES AVE","South West Urban"]
[41005,"CLARET PL","West"]
[60475,"CLARICE PL","South West Urban"]
[40162,"CLARIDGE ST","West"]
[41222,"CLARION PL","West"]
[36099,"CLARIS AERODROME CARPARK","Hauraki Islands"]
[36100,"CLARIS AERODROME RD","Hauraki Islands"]
[70105,"CLARK RD (KARAKA)","South Rural"]
[60077,"CLARK RD (PAPAKURA)","South West Urban"]
[41004,"CLARK RD (WAITAKERE)","North Urban West"]
[48228,"CLARK RD WWAY","North Urban West"]
[51029,"CLARK ST (MANUREWA)","South West Urban"]
[40106,"CLARK ST (NEW LYNN)","West"]
[33446,"CLARKE RD","Central East"]
[70107,"CLARKS BEACH RD","South Rural"]
[41238,"CLARKS LANE (NORTH)","North Urban West"]
[51030,"CLARKSON CRES","South West Urban"]
[54643,"CLARRIE WILLS WAY","South West Urban"]
[20495,"CLASSIC GR","North Urban West"]
[51031,"CLAUDE AVE","South West Urban"]
[15145,"CLAUDE BROOKES DR JETTY/WEST WAVE CYWAY","West"]
[15109,"CLAUDE BROOKES DR/CENTRAL PARK DR CYWAY","West"]
[41002,"CLAUDE BROOKS DR","West"]
[34699,"CLAUDE RD","Central"]
[51032,"CLAUDE RD (MANUREWA)","South West Urban"]
[10177,"CLAUDE RD (STANMORE BAY)","North Urban East"]
[54076,"CLAUDE RD CARPARK (RP529 RHS)","South West Urban"]
[41001,"CLAVERDON DR","West"]
[48289,"CLAVERDON DR - QUEEN NATALIE WWAY","West"]
[48290,"CLAVERDON DRV WWAY","West"]
[53374,"CLAVOY PL","South East Urban"]
[54455,"CLAVOY PL LOOP","South East Urban"]
[53753,"CLAVOY PL-WAYNE FRANCIS DR","South East Urban"]
[30262,"CLAYBROOK RD","Central"]
[40037,"CLAYBURN RD","West"]
[10178,"CLAYDEN DR","North Urban East"]
[10179,"CLAYDEN RD","North Rural"]
[51033,"CLAYMORE ST","South West Urban"]
[40026,"CLAYPIT LANE (PVT)","West"]
[51034,"CLAYTON AVE","South West Urban"]
[54467,"CLAYTON AVE LOOP","South West Urban"]
[51035,"CLAYTON RD","South West Urban"]
[33447,"CLAYTON ST","Central"]
[47311,"CLAYWEST PL","West"]
[11560,"CLEA VIEW","North Urban East"]
[41000,"CLEARVIEW HGTS","West"]
[40999,"CLEARWATER COVE","North Urban West"]
[41197,"CLEARWATER COVE MARINA ACCESS","North Urban West"]
[15116,"CLEARWATER COVE/BOAT RAMP CYWAY","North Urban West"]
[33448,"CLEARY RD","Central East"]
[51036,"CLEARY TCE","South East Urban"]
[51037,"CLEEK RD","South West Urban"]
[10180,"CLEGG PL","North Rural"]
[33449,"CLEGHORN AVE","Central"]
[15258,"CLEGHORN AVE LINK CYWAY","Central"]
[30263,"CLELAND CRES","West"]
[22280,"CLEMATIS AVE","North Urban East"]
[10351,"CLEMENTS HILL LANE","North Rural"]
[33450,"CLEMENTS ST","South West Urban"]
[33451,"CLEMOW DR","Central East"]
[22807,"CLEMOW'S LANE","North Urban West"]
[40998,"CLEMWAY PL","West"]
[51038,"CLENDON AVE","South West Urban"]
[51039,"CLENDON PL","South West Urban"]
[22281,"CLENSMORE PL","North Urban East"]
[40997,"CLEVE RD","West"]
[60078,"CLEVEDON RD","South West Urban"]
[60687,"CLEVEDON RD CARPARK (RP2069 RHS)","South West Urban"]
[60688,"CLEVEDON RD CARPARK (RP938 LHS)","South West Urban"]
[60280,"CLEVEDON RD SERVICE LANE (RP2071 RHS)","South West Urban"]
[60533,"CLEVEDON/MARNE RAB","South West Urban"]
[51041,"CLEVEDON-KAWAKAWA RD","South Rural"]
[54589,"CLEVEDON-KAWAKAWA/NORTH RAB","South Rural"]
[51042,"CLEVEDON-TAKANINI RD","South Rural"]
[30264,"CLEVELAND RD","Central"]
[30266,"CLIFF AVE","Central East"]
[71441,"CLIFF LANE","South Rural"]
[70108,"CLIFF RD (GLENBROOK BEACH)","South Rural"]
[60079,"CLIFF RD (PAPAKURA)","South West Urban"]
[30267,"CLIFF RD (ST HELIERS)","Central East"]
[22282,"CLIFF RD (TORBAY)","North Urban East"]
[40996,"CLIFF VIEW DR","West"]
[10181,"CLIFFORD RD (AHUROA)","North Rural"]
[30265,"CLIFFORD RD (GREY LYNN)","Central"]
[11622,"CLIFFTON LANE","North Rural"]
[33453,"CLIFTON CRT","Central East"]
[22284,"CLIFTON RD - BROWNS BAY","North Urban East"]
[20096,"CLIFTON RD - TAKAPUNA","North Urban East"]
[30268,"CLIFTON RD (HERNE BAY)","Central"]
[33454,"CLIFTON RD (HILLSBOROUGH)","Central"]
[51043,"CLIFTON RD (WHITFORD)","South Rural"]
[40005,"CLINKER PL","West"]
[33455,"CLINKER ST","Central"]
[35696,"CLINKER/HAYR WWAY (RP186 RHS)","Central"]
[40995,"CLINTON AVE","West"]
[10182,"CLINTON RD","North Rural"]
[51044,"CLIPPER PL","South East Urban"]
[51045,"CLIST CRES","South West Urban"]
[71234,"CLIVE HOWE RD","South Rural"]
[70114,"CLIVE HOWE RD BUS LOOP","South Rural"]
[30269,"CLIVE RD","Central"]
[47045,"CLOGHAN CLOSE","West"]
[53555,"CLOMELL DR","South East Urban"]
[30270,"CLONBERN RD","Central East"]
[35952,"CLONBERN RD CARPARK (RP46 LHS)","Central East"]
[35951,"CLONBERN RD CARPARK (RP87 LHS)","Central East"]
[36042,"CLONBERN RD SERVICE LANE (RP40 LHS)","Central East"]
[30271,"CLOUSTON ST","Central East"]
[51046,"CLOVELLY RD","South East Urban"]
[47159,"CLOVER DR","West"]
[11286,"CLOVERFIELDS DR","North Rural"]
[71330,"CLOVERLEA PL","South Rural"]
[22285,"CLOVERLY CRES","North Urban East"]
[30272,"CLOVERNOOK RD","Central"]
[22855,"CLUB LANE SERVICE LANE","North Urban East"]
[51047,"CLUNIE PL","South East Urban"]
[51048,"CLUTHA CRES","South West Urban"]
[22286,"CLYDE RD (BROWNS BAY)","North Urban East"]
[51049,"CLYDE RD (OTARA)","South West Urban"]
[54199,"CLYDE RD CARPARK (RP266 LHS)","South West Urban"]
[34700,"CLYDE ST","Central"]
[51050,"CLYDESDALE AVE","South East Urban"]
[40994,"CLYMA PL","West"]
[48315,"CLYMA PL WWAY","West"]
[51051,"CLYRO PL","South West Urban"]
[51052,"CLYSIDE AVE","South East Urban"]
[15807,"CLYSIDE AVE LINK CYWAY (RP361)","South East Urban"]
[15806,"CLYSIDE AVE LINK CYWAY(RP346)","South East Urban"]
[70552,"COACH RD","South Rural"]
[53451,"COACHMAN DR","South East Urban"]
[15496,"COACHMAN DR/DUNOON CL CYWAY","South East Urban"]
[10183,"COAL HILL RD","North Rural"]
[60397,"COAL MINE RD","South Rural"]
[11396,"COASTAL HEIGHTS","North Urban East"]
[30274,"COATES AVE","Central East"]
[33456,"COATES CRES","Central East"]
[51054,"COATES RD (HOWICK)","South East Urban"]
[51053,"COATES RD (PAPATOETOE)","South West Urban"]
[35721,"COATES/COURT WWAY (RP419 RHS)","Central East"]
[35819,"COATES/TAUTARI WWAY (RP570 RHS)","Central East"]
[35820,"COATES/TAUTARI WWAY (RP740 RHS)","Central East"]
[11162,"COATESVILLE HEIGHTS","North Rural"]
[11177,"COATESVILLE RIVERHEAD HIGHWAY","North Rural"]
[80675,"COATESVILLE RIVERHEAD/RIVERHEAD RAB","North Rural"]
[51055,"COBANA PL","South East Urban"]
[10184,"COBBLERS LANE","North Rural"]
[21013,"COBBLESTONE LANE","North Urban West"]
[30275,"COBDEN ST","Central"]
[40992,"COBHAM CRES (KELSTON)","West"]
[51056,"COBHAM CRES (OTARA)","South West Urban"]
[54465,"COBHAM CRES CARPARK (RP152 RHS)","South West Urban"]
[54464,"COBHAM CRES CARPARK (RP317 RHS)","South West Urban"]
[54097,"COBHAM CRES SERVICE LANE (RP854)","South West Urban"]
[54463,"COBHAM CRES SERVICE LANE HAMMERHEAD","South West Urban"]
[15514,"COBHAM CRES SOUTH LINK CYWAY","South West Urban"]
[15512,"COBHAM CRES/FERGUSON RD CYWAY","South West Urban"]
[40993,"COBURG ST","West"]
[15106,"COBURG ST/MURILLO PL CYWAY","West"]
[40991,"COCHRAN RD","West"]
[10185,"COCHRANE AVE","North Urban East"]
[70110,"COCHRANE RD","South Rural"]
[20355,"COCKAYNE CRES","North Urban East"]
[30276,"COCKBURN ST","Central"]
[51057,"COCKLE BAY RD","South East Urban"]
[52932,"COCKLE BAY RD LLA (#83 - #103)","South East Urban"]
[10186,"COCKLE PL","North Urban East"]
[30277,"CODRINGTON CRES","Central East"]
[40990,"COEY PL","West"]
[48050,"COEY PL WWAY","West"]
[47138,"COGNAC PL","West"]
[70113,"COLBECK RD","South Rural"]
[30278,"COLCHESTER AVE","Central East"]
[30279,"COLDHAM CRES","Central East"]
[35804,"COLDHAM/GOLF COURSE WWAY (RP264)","Central East"]
[40989,"COLE PL","West"]
[48159,"COLE PL WWAY","West"]
[30280,"COLEGRAVE PL","Central East"]
[33457,"COLEMAN AVE (MT ROSKILL)","Central"]
[40988,"COLEMAN AVE (WAITAKERE)","North Urban West"]
[30281,"COLENSO PL","Central East"]
[53234,"COLERAINE PL","South East Urban"]
[30282,"COLERIDGE ST","Central"]
[33458,"COLES AVE (PVT)","Central"]
[60080,"COLES CRES","South West Urban"]
[60274,"COLES CRES SERVICE LANE (RP421 LHS)","South West Urban"]
[60681,"COLES CRES SERVICE LANE CARPARK","South West Urban"]
[51058,"COLES PL","South West Urban"]
[40987,"COLETTA LANE","West"]
[48161,"COLETTA LANE WWAY","West"]
[11481,"COLGAN LANE","North Rural"]
[35678,"COLIN SHAW LANE","Central"]
[51059,"COLIN ST","South West Urban"]
[20411,"COLIN WILD PL","North Urban West"]
[22832,"COLISEUM DR","North Urban West"]
[41336,"COLLARD PL","West"]
[51060,"COLLEEN CRT","South East Urban"]
[51061,"COLLEEN NORMA PL","South East Urban"]
[30283,"COLLEGE HILL","Central"]
[21014,"COLLEGE RD (NORTHCOTE)","North Urban West"]
[30284,"COLLEGE RD (ST JOHNS)","Central East"]
[36025,"COLLEGE RD (ST JOHNS/NORTHBOUND)","Central East"]
[26050,"COLLEGE RD CARPARK (3 GUYS)","North Urban West"]
[36021,"COLLEGE/BLUEGREY RAB","Central East"]
[36024,"COLLEGE/MERTON RAB","Central East"]
[51062,"COLLETT RD","South West Urban"]
[53757,"COLLETT RD-PRESTON RD","South West Urban"]
[70115,"COLLIE RD (GLENBROOK)","South Rural"]
[70930,"COLLIE RD (PUKEKOHE)","South Rural"]
[70091,"COLLIE RD EXTN(PVT)","South Rural"]
[51063,"COLLIE ST","South West Urban"]
[80512,"COLLIER DR","South East Urban"]
[22817,"COLLINGS DR","North Urban West"]
[70116,"COLLINGWOOD RD","South Rural"]
[30285,"COLLINGWOOD ST","Central"]
[33459,"COLLINS ST (KINGSLAND)","Central"]
[20157,"COLLINS ST (TAKAPUNA)","North Urban East"]
[15235,"COLLINWOOD ST/PRATT ST CYWAY","Central"]
[80715,"COLLISTON RISE","North Urban West"]
[51064,"COLMAR RD","South East Urban"]
[70840,"COLOMBO RD","South Rural"]
[30286,"COLONEL BARTON GL","Central East"]
[35799,"COLONEL BARTON/ST JOHNS WWAY (RP98)","Central East"]
[33460,"COLONEL NIXON ST","Central East"]
[80710,"COLONIAL DRIVE","North Urban East"]
[22039,"COLONIAL RD","North Urban West"]
[30287,"COLORADO PL","West"]
[51065,"COLSON LANE","South Rural"]
[54521,"COLSON LANE EXTN","South Rural"]
[52811,"COLT PL","South West Urban"]
[51066,"COLUM PL","South East Urban"]
[53576,"COLUMBIA CRES","South Rural"]
[53577,"COLUMBIA CRES LOOP","South Rural"]
[22770,"COLUMBIA PL","North Urban West"]
[22816,"COLUMBIA PL HAMMERHEAD","North Urban West"]
[33461,"COLUMBIA RD","Central"]
[20403,"COLWAY PL","North Urban West"]
[40986,"COLWILL RD","West"]
[30288,"COMBES RD","Central East"]
[51067,"COMET CRES","South West Urban"]
[30289,"COMINS CRES","Central East"]
[30290,"COMMERCE ST","Central"]
[30291,"COMMERCIAL RD (GREY LYNN)","Central"]
[11131,"COMMERCIAL RD (SH16 HVILLE)","North Rural"]
[33462,"COMMISSARIAT RD","Central East"]
[11368,"COMMODORE CRT","North Urban East"]
[33463,"COMMODORE DR","Central"]
[20204,"COMMODORE PARRY RD","North Urban East"]
[35969,"COMMUNITY LANE","West"]
[20154,"COMO ST","North Urban East"]
[40985,"COMPASS PL","West"]
[53400,"COMPASS POINT WAY","South East Urban"]
[21015,"COMPTON ST","North Urban West"]
[70931,"COMRIE PL","South Rural"]
[53262,"CONACHER CLOSE","South East Urban"]
[53620,"CONCEPTS WAY","South East Urban"]
[30293,"CONCORD PL","Central East"]
[30292,"CONDLIFFE PL","West"]
[22819,"CONDOR PL","North Urban West"]
[51068,"CONEY LANE (EAST)","South Rural"]
[52749,"CONEY LANE (WEST)","South Rural"]
[30294,"CONGREVE PL","West"]
[10188,"CONICAL PEAK RD","North Rural"]
[15593,"CONIFER GR MANGROVES CYWAY","South West Urban"]
[51069,"CONIFER LANE (PVT)","South West Urban"]
[40984,"CONISTON AVE","West"]
[48141,"CONISTON AVE WWAY","West"]
[30295,"CONNAUGHT ST","West"]
[30296,"CONNELL ST","West"]
[41313,"CONNEMARA CRT","North Urban West"]
[41401,"CONNEMARA CRT (WEST)","North Urban West"]
[48232,"CONNEMARA CRT (WEST) WWAY","North Urban West"]
[41407,"CONNEMARA/CONNEMARA (WEST) RAB","North Urban West"]
[33464,"CONNOLLY AVE","Central"]
[30297,"CONRAD DR","Central East"]
[70118,"CONROY RD","South Rural"]
[40983,"CONSTABLE LANE","North Urban West"]
[48252,"CONSTABLE LANE WWAY","North Urban West"]
[10189,"CONSTABLE RD (MURIWAI)","North Rural"]
[70119,"CONSTABLE RD (WAIUKU)","South Rural"]
[71522,"CONSTABLE RD CARPARK (RP62 LHS)","South Rural"]
[51070,"CONSTANCE PL","South West Urban"]
[53614,"CONSTELLATION AVE","South Rural"]
[15787,"CONSTELLATION AVE/COURAGEOUS PL CYWAY","South Rural"]
[26082,"CONSTELLATION BUS STN CARPARK #1","North Urban West"]
[26083,"CONSTELLATION BUS STN CARPARK #2","North Urban West"]
[23022,"CONSTELLATION BUS STN RING RD","North Urban West"]
[20014,"CONSTELLATION DR","North Urban West"]
[23021,"CONSTELLATION DR BUS RAMP","North Urban West"]
[15017,"CONSTELLATION DR/NORTHERN BUSWAY CYWAY","North Urban West"]
[26098,"CONSTELLATION RESERVE ACCESS RD","North Urban West"]
[53575,"CONSTELLATION/COLUMBIA RAB","South Rural"]
[53611,"CONSTELLATION/INTREPID RAB","South Rural"]
[31522,"CONSTITUTION HILL (EAST)","Central"]
[30298,"CONSTITUTION HILL (WEST)","Central"]
[20512,"CONTESSA DR","North Urban West"]
[54754,"CONTI DR","South East Urban"]
[51071,"CONVAIR CRES","South West Urban"]
[35055,"CONVAMORE LANE (PVT)","Central East"]
[33465,"CONVOY LANE","South West Urban"]
[33466,"CONWAY RD","Central"]
[30299,"COOK ST (AUCKLAND)","Central"]
[51072,"COOK ST (HOWICK)","South East Urban"]
[54695,"COOK/DRAKE RAB","South East Urban"]
[54694,"COOK/FENCIBLE RAB","South East Urban"]
[54594,"COOK/RODNEY RAB","South East Urban"]
[31719,"COOK/SAM WRIGLEY SLIP","Central"]
[54693,"COOK/SELWYN RAB","South East Urban"]
[54696,"COOK/UNION RAB","South East Urban"]
[60694,"COOLADERRY PL","South West Urban"]
[54220,"COOLAGHY DR","South East Urban"]
[51073,"COOMBE AVE","South West Urban"]
[54415,"COOMBE AVE EXTN","South West Urban"]
[15469,"COOMBE AVE/DUNSTAN PL CYWAY","South West Urban"]
[51074,"COOPER CRES","South West Urban"]
[60081,"COOPER PL","South West Urban"]
[70121,"COOPER RD (AWHITU)","South Rural"]
[70120,"COOPER RD (RAMARAMA)","South Rural"]
[10190,"COOPER RD (STANMORE BAY)","North Urban East"]
[30301,"COOPER ST (GREY LYNN)","Central"]
[70932,"COOPER ST (PUKEKOHE)","South Rural"]
[70933,"COOPER ST (SOUTH)","South Rural"]
[80490,"COOTE WAY","North Rural"]
[80339,"COPAL LANE","North Urban East"]
[30302,"COPELAND ST","Central"]
[40143,"COPLEY ST","West"]
[80419,"COPPER LANE","North Urban East"]
[51075,"COPPERFIELD TCE","South East Urban"]
[33467,"COPPINS RD","Central East"]
[47161,"COPPLESTONE CRT (PVT)","West"]
[47160,"COPPLESTONE PL","West"]
[30304,"COPSEY PL","West"]
[51076,"COPTIC PL","South West Urban"]
[10191,"COQUETTE ST","North Rural"]
[51077,"COQUILLE PL","South East Urban"]
[33468,"CORAL CRES","Central East"]
[11340,"CORAL CRT","North Urban East"]
[11411,"CORAL SEA WAY","North Urban East"]
[23010,"CORBAN AVE (ALBANY)","North Urban West"]
[40982,"CORBAN AVE (HENDERSON)","West"]
[70122,"CORBETT RD","South Rural"]
[30305,"CORBETT-SCOTT AVE","Central"]
[30306,"CORDELIA PL","West"]
[51078,"CORDOBA CRT  (PVT)","South West Urban"]
[52972,"CORFIELD WAY","South East Urban"]
[51079,"CORIN AVE","South West Urban"]
[30307,"CORINTH ST","Central East"]
[22864,"CORINTHIAN DR (WEST)","North Urban West"]
[15018,"CORINTHIAN DR/MERCARI WAY CYWAY (RP1020)","North Urban West"]
[60498,"CORKILL PL","South West Urban"]
[10192,"CORLETT RD","North Rural"]
[33471,"CORMACK ST","Central"]
[35704,"CORMACK/DOMINION WWAY (RP605)","Central"]
[10193,"CORNEL CIRCLE","North Rural"]
[51080,"CORNELIAN CRES","South East Urban"]
[53758,"CORNELIAN CRES-JILLTERESA CRES","South East Urban"]
[22675,"CORNELL CRT","North Urban West"]
[23013,"CORNERSTONE DR","North Urban West"]
[32969,"CORNWALL PARK AVE","Central"]
[31656,"CORNWALL PARK AVE EXTN","Central"]
[60618,"CORNWALL PL","South West Urban"]
[51082,"CORNWALL RD (MANGERE)","South West Urban"]
[51081,"CORNWALL RD (PAPATOETOE)","South West Urban"]
[70123,"CORNWALL RD (WAIUKU)","South Rural"]
[70237,"CORNWALL RD/KITCHENER RD SLIP","South Rural"]
[40981,"CORNWALL ST","West"]
[40980,"CORNWALLIS RD","West"]
[33473,"CORNWALLIS ST","Central"]
[22040,"COROGLEN AVE","North Urban West"]
[51083,"COROKIA PL","South West Urban"]
[60301,"COROLU PL","South West Urban"]
[22287,"COROMANDEL CRES","North Urban East"]
[33474,"COROMANDEL RD","Hauraki Islands"]
[70934,"CORONATION AVE","South Rural"]
[15274,"CORONATION BR/HUGO JOHNSTON DR CYWAY","Central East"]
[15276,"CORONATION BRIDGE CYWAY","Central East"]
[30308,"CORONATION RD (EPSOM)","Central"]
[20042,"CORONATION RD (GLENFIELD)","North Urban West"]
[51085,"CORONATION RD (MANGERE)","South West Urban"]
[51084,"CORONATION RD (PAPATOETOE)","South West Urban"]
[70124,"CORONATION RD (WAIPIPI)","South Rural"]
[20107,"CORONATION ST (DEVONPORT)","North Urban East"]
[10194,"CORONATION ST (TE HANA)","North Rural"]
[54634,"CORONATION/CHURCH RAB","South West Urban"]
[54633,"CORONATION/MCINTYRE RAB","South West Urban"]
[53637,"CORONET LANE","South East Urban"]
[30309,"CORONET PL","West"]
[47047,"CORRAN PL","West"]
[51086,"CORREA CRT","South West Urban"]
[35561,"CORREGIDOR PL (PVT)","West"]
[20089,"CORRELLA RD","North Urban East"]
[22288,"CORRIC HILL","North Urban East"]
[23002,"CORRICVALE WAY","North Urban West"]
[51087,"CORRIEDALE PL","South East Urban"]
[53759,"CORRIEDALE PL-CLYDESDALE AVE","South East Urban"]
[53760,"CORRIEDALE PL-SIMMENTAL CRES","South East Urban"]
[53341,"CORROFIN DR","South East Urban"]
[51088,"CORSAIR CRES","South West Urban"]
[41437,"CORSAIR ST","North Urban West"]
[60597,"CORSICA WAY","South West Urban"]
[53037,"CORTA BELLA PL","South East Urban"]
[51089,"CORTINA PL","South East Urban"]
[30310,"CORUNNA AVE","Central"]
[20260,"CORUNNA RD","North Urban East"]
[22664,"CORWEN PL","North Urban East"]
[10195,"CORY RD (KANOHI)","North Rural"]
[33475,"CORY RD (WAIHEKE)","Hauraki Islands"]
[60082,"COSGRAVE RD","South West Urban"]
[60654,"COSGRAVE RD CARPARK (RP320 RHS)","South West Urban"]
[51090,"COSMO PL","South West Urban"]
[15613,"COSMO PL LINK CYWAY (RP143)","South West Urban"]
[15612,"COSMO PL LINK CYWAY (RP52)","South West Urban"]
[60396,"COSSEY RD (NORTH)","South Rural"]
[60534,"COSSEY RD (SOUTH)","South Rural"]
[80503,"COSTA VIVA CRES","South West Urban"]
[51091,"COSTAR PL","South West Urban"]
[70126,"COSTELLO RD","South Rural"]
[10196,"COSTER RD","North Rural"]
[30311,"COSTLEY ST","Central"]
[51092,"COSY PL","South East Urban"]
[35628,"COTESMORE WAY (PVT)","Central"]
[33476,"COTSWALD LANE","Central East"]
[80244,"COTTAGE CRT","North Urban East"]
[22289,"COTTAM GR","North Urban East"]
[30312,"COTTER AVE","Central East"]
[10197,"COTTERELL ST","North Rural"]
[52969,"COTTESMORE PL","South East Urban"]
[54531,"COTTESMORE PL HAMMERHEAD","South East Urban"]
[80348,"COTTESMORE/HUNTINGTON RAB","South East Urban"]
[51093,"COTTINGHAM CRES","South West Urban"]
[10198,"COTTLE RD","North Rural"]
[60083,"COTTON PL","South West Urban"]
[30313,"COTTON ST","Central East"]
[51094,"COTTONWOOD PL","South Rural"]
[51095,"COTTRELL PL","South West Urban"]
[53761,"COTTRELL PL-MONCRIEFF AVE","South West Urban"]
[51096,"COTY PL","South West Urban"]
[51097,"COUBRAY PL","South East Urban"]
[15725,"COUBRAY PL LINK CYWAY","South East Urban"]
[30314,"COULDRY ST","Central"]
[70127,"COULSTON RD","South Rural"]
[40979,"COULTER RD","West"]
[60084,"COULTHARD TCE","South West Urban"]
[21016,"COUNCIL TCE","North Urban West"]
[33477,"COUNSEL TCE","Central"]
[51098,"COUNTESS LANE (PVT)","South East Urban"]
[71241,"COUNTRY CLUB LANE","South Rural"]
[22290,"COUNTY RD","North Urban East"]
[41224,"COUPLAND CRT","West"]
[80385,"COURAGE RD","South West Urban"]
[53613,"COURAGEOUS PL","South Rural"]
[54833,"COURAGEOUS PL-CONSTELLATION AVE","South Rural"]
[51099,"COURANT PL","South West Urban"]
[33478,"COURT CRES","Central East"]
[70859,"COURT ST","South Rural"]
[51100,"COURT TOWN CLOSE","South West Urban"]
[54615,"COURT TOWN CLOSE LOOP","South West Urban"]
[35711,"COURT/COATES WWAY (RP228 LHS)","Central East"]
[35712,"COURT/MCCULLOCH WWAY (RP276 RHS)","Central East"]
[51101,"COURTENAY CRES","South West Urban"]
[30315,"COURTHOUSE LANE (CITY)","Central"]
[10199,"COURTHOUSE LANE (OREWA)","North Urban East"]
[30316,"COURTLAND AVE","Central East"]
[11574,"COURTNEY LANE","North Rural"]
[41337,"COURTNEYS","North Urban West"]
[41402,"COURTNEYS EXTN","North Urban West"]
[53045,"COURTVALE PL","South East Urban"]
[54442,"COURTVALE PL HAMMERHEAD","South East Urban"]
[34941,"COVE LANE","Central East"]
[30317,"COVENTRY LANE (PVT)","Central"]
[22929,"COVENTRY WAY","North Urban East"]
[30318,"COVIC AVE","West"]
[40978,"COVIL AVE","West"]
[51102,"COVINA PL","South East Urban"]
[54697,"COVINA PL HAMMERHEAD","South East Urban"]
[10200,"COWAN BAY RD","North Rural"]
[70128,"COWAN RD","South Rural"]
[30319,"COWAN ST","Central"]
[33479,"COWELL PL","Central East"]
[34996,"COWES BAY RD","Hauraki Islands"]
[30320,"COWIE ST","Central"]
[22612,"COWLEY PL","North Urban West"]
[30321,"COWLEY ST","Central"]
[20591,"COWPER ST","North Urban East"]
[11202,"COX RD","North Rural"]
[30322,"COX ST","Central"]
[10201,"COXHEAD CREEK RD","North Rural"]
[51103,"COXHEAD RD","South West Urban"]
[53762,"COXHEAD RD-PERCIVAL ST","South West Urban"]
[33480,"COYLE ST","Central"]
[80119,"CRABB FIELDS LANE","North Rural"]
[22046,"CRACROFT ST (DEVONPORT)","North Urban East"]
[33481,"CRACROFT ST (OTAHUHU)","South West Urban"]
[30323,"CRACROFT ST (PARNELL)","Central"]
[30324,"CRADOCK ST","West"]
[47048,"CRAIBURN ST","West"]
[48211,"CRAIBURN ST WWAY","West"]
[51104,"CRAIG PL","South West Urban"]
[70129,"CRAIG RD","South Rural"]
[51105,"CRAIG RD (MARAETAI)","South Rural"]
[20198,"CRAIG RD (MILFORD)","North Urban East"]
[53392,"CRAIGAVON DR","South East Urban"]
[53391,"CRAIGAVON/CORROFIN RAB","South East Urban"]
[40092,"CRAIGBANK AVE","West"]
[48020,"CRAIGBANK AVE WWAY","West"]
[51106,"CRAIL CRT","South West Urban"]
[51107,"CRAMOND DR","South West Urban"]
[10038,"CRAMPTON CRT","North Urban East"]
[51108,"CRAMPTON PL","South West Urban"]
[51109,"CRANBERRY PL","South East Urban"]
[35919,"CRANBROOK MEWS (PVT)","Central East"]
[30325,"CRANBROOK PL","Central East"]
[54434,"CRANFORD DR","South East Urban"]
[51110,"CRANMERE CRES","South West Urban"]
[53040,"CRANNICH PL","South West Urban"]
[15648,"CRANNICH PL LINK CYWAY","South West Urban"]
[53059,"CRANNOG FEN","South West Urban"]
[22291,"CRANSTON ST","North Urban East"]
[40977,"CRANWELL ST","West"]
[24027,"CRATER CRES (PVT)","North Urban West"]
[53303,"CRATLOE LANE","South East Urban"]
[52801,"CRAWFORD AVE (NORTH)","South West Urban"]
[51111,"CRAWFORD AVE (SOUTH)","South West Urban"]
[32951,"CRAYFORD ST EAST","West"]
[30326,"CRAYFORD ST WEST","West"]
[20108,"CREAMER AVE","North Urban East"]
[51112,"CREAMERY RD","South West Urban"]
[70130,"CREAMERY RD (WAIPIPI)","South Rural"]
[70226,"CREAMERY RD BUS LOOP","South Rural"]
[30327,"CRECY PL","West"]
[80523,"CREDA RD","South West Urban"]
[10203,"CREEK LANE","North Rural"]
[60309,"CREEK ST (DRURY)","South West Urban"]
[10204,"CREEK ST (SANDSPIT)","North Rural"]
[54214,"CREEVE PL","South East Urban"]
[60455,"CREIGHTONS RD (ARDMORE)","South Rural"]
[51113,"CREIGHTONS RD (CLEVEDON)","South Rural"]
[30328,"CREMORNE ST","Central"]
[51114,"CRESCENT HILLS CRT","South East Urban"]
[54477,"CRESCENT HILLS CRT HAMMERHEAD","South East Urban"]
[34701,"CRESCENT RD (EPSOM)","Central"]
[30329,"CRESCENT RD (PARNELL)","Central"]
[34984,"CRESCENT RD (WEST)","Hauraki Islands"]
[33483,"CRESCENT RD EAST (WAIHEKE)","Hauraki Islands"]
[31717,"CRESCENT RD EAST EXTN","Hauraki Islands"]
[11165,"CREST RD","North Rural"]
[22041,"CRESTA AVE","North Urban West"]
[60085,"CRESTLANDS PL","South West Urban"]
[60690,"CRESTLANDS PL LOOP","South West Urban"]
[22615,"CRESTVIEW PL","North Urban East"]
[60585,"CRESTVIEW RISE","South West Urban"]
[20194,"CRETE AVE","North Urban East"]
[47162,"CRETIAN CRES","West"]
[22839,"CREWE CLOSE","North Urban West"]
[20132,"CRICHTON TCE","North Urban East"]
[33484,"CRICKET AVE","Central"]
[22892,"CRICKLADE TCE","North Urban West"]
[60086,"CRICKLEWOOD ST","South West Urban"]
[40976,"CRIEFF PL","West"]
[22803,"CRIMSON PARK","North Urban West"]
[70935,"CRISP AVE","South Rural"]
[70132,"CRISPE RD","South Rural"]
[51115,"CRISPIAN PL","South West Urban"]
[33486,"CRITERION ST","South West Urban"]
[40975,"CROCKETT LANE","West"]
[22042,"CROCOMBE CRES","North Urban West"]
[30330,"CROCUS PL","Central East"]
[10205,"CROFT LANE","North Rural"]
[20397,"CROFTFIELD LANE","North Urban West"]
[22896,"CROFTFIELD LANE EXTN","North Urban West"]
[53270,"CROFTVIEW RD","South West Urban"]
[80633,"CROIX GREENS","North Urban East"]
[51116,"CROMDALE AVE","South East Urban"]
[54702,"CROMDALE AVE EXTN","South East Urban"]
[51117,"CROMER PL","South West Urban"]
[40974,"CROMPTON RD","West"]
[24045,"CROMWELL LANE (PVT)","North Urban West"]
[70936,"CROMWELL PL","South Rural"]
[33488,"CROMWELL ST (MT EDEN)","Central"]
[40973,"CRON AVE","West"]
[48136,"CRON AVE WWAY","West"]
[22043,"CRONIN PL","North Urban West"]
[70133,"CRONIN RD","South Rural"]
[51118,"CROOKS RD","South East Urban"]
[70937,"CROSBIE RD","South Rural"]
[40972,"CROSBY RD","West"]
[48264,"CROSBY RD WWAY","West"]
[60087,"CROSKERY RD","South West Urban"]
[60535,"CROSKERY RD SLIP","South West Urban"]
[11455,"CROSLAND RD","North Rural"]
[60308,"CROSS ST (DRURY)","South West Urban"]
[30331,"CROSS ST (NEWTON)","Central"]
[60088,"CROSS ST (PAPAKURA)","South West Urban"]
[10208,"CROSS ST 2 (MANLY)","North Urban East"]
[10209,"CROSS ST 3 (SANDSPIT)","North Rural"]
[60665,"CROSS ST CARPARK (RP111 RHS)","South West Urban"]
[53121,"CROSSANDRA DR","South West Urban"]
[30332,"CROSSFIELD RD","Central East"]
[31568,"CROSSFIELD/WEST TAMAKI SLIP","Central East"]
[53179,"CROSSLANDS PL","South Rural"]
[33489,"CROWHURST ST","Central"]
[51119,"CROWN CRES","South West Urban"]
[20239,"CROWN HILL CLOSE","North Urban East"]
[30333,"CROWN LANE","Central East"]
[40105,"CROWN LYNN PL","West"]
[70136,"CROWN RD (PUKEKOHE)","South Rural"]
[10210,"CROWN RD (TINDALLS BAY)","North Urban East"]
[33490,"CROWN ST","Central"]
[40971,"CROWS RD","West"]
[30334,"CROWTHER ST","West"]
[33491,"CROYDON RD (MT EDEN)","Central"]
[40062,"CROYDON RD (WAITAKERE)","West"]
[30335,"CRUDGE ST","West"]
[30336,"CRUICKSHANK CRES","Central East"]
[40116,"CRUM AVE","West"]
[30338,"CRUMMER RD (EAST)","Central"]
[36091,"CRUMMER RD (WEST)","Central"]
[51120,"CRYERS RD","South East Urban"]
[54405,"CRYERS RD/TRUGOOD DR SLIP","South East Urban"]
[40970,"CRYSTAL AVE","West"]
[70137,"CUFF RD","South Rural"]
[33492,"CULDAFF PL","Central"]
[33493,"CULLEN AVE","Central"]
[51121,"CULLINAN AVE","South West Urban"]
[30339,"CULLWICK RD","Central East"]
[40969,"CULPERRY RD","West"]
[51122,"CULVER TCE","South East Urban"]
[30340,"CUMBERLAND AVE","Central"]
[10211,"CUMBERLAND ST","North Rural"]
[60304,"CUMBRIAN PL","South West Urban"]
[40824,"CUMULUS WAY","West"]
[40122,"CUNARD ST","West"]
[48043,"CUNARD ST WWAY","West"]
[20503,"CUNLIFFE PL","North Urban West"]
[60465,"CUNNINGHAM PL (NORTH)","South West Urban"]
[60536,"CUNNINGHAM PL (SOUTH)","South West Urban"]
[53679,"CUNNOLDS LANE (PVT)","South Rural"]
[51123,"CURACAO PL","South East Urban"]
[33978,"CURLEW BAY RD","South West Urban"]
[51124,"CURLEW PL","South West Urban"]
[10212,"CURLEY AVE","North Urban East"]
[30341,"CURRAN ST","Central"]
[36086,"CURRAN ST EXTN","Central"]
[36085,"CURRAN/WESTHAVEN RAB","Central"]
[35011,"CURREEN RD","Hauraki Islands"]
[51125,"CURRELL WAY","South East Urban"]
[20256,"CURREY CRES","North Urban East"]
[33495,"CURRIE AVE","Central"]
[22866,"CURRYS LANE","North Urban West"]
[33497,"CURZON ST","Central East"]
[40968,"CUSHLA PL","West"]
[70938,"CUSTOMS ST (PUKEKOHE)","South Rural"]
[30342,"CUSTOMS ST EAST","Central"]
[31528,"CUSTOMS ST WEST (CITY)","Central"]
[30343,"CUSTOMS ST WEST (VIADUCT)","Central"]
[15233,"CUSTOMS ST WEST/VIADUCT HARBOUR CYWAY (RP312)","Central"]
[35861,"CUSTOMS WEST (CITY) WWAY (RP54)","Central"]
[10213,"CUTHBERT RD","North Rural"]
[22914,"CUTHILL CLOSE","North Urban West"]
[40100,"CUTLER ST","West"]
[22906,"CUTTER PL","North Urban West"]
[24049,"CUTTS CRES (PVT)","North Urban West"]
[51126,"CYCLADES PL","South East Urban"]
[53123,"CYCLAMEN RD","South West Urban"]
[40967,"CYCLARAMA CRES","West"]
[41189,"CYCLARAMA CRES (NORTHBOUND)","West"]
[20351,"CYPRESS PL","North Urban East"]
[40966,"CYRIL CRES","West"]
[53421,"CYRIL FRENCH DR","South East Urban"]
[53608,"CYRIL FRENCH/BRONWYLIAN RAB","South East Urban"]
[51127,"CYRIL KAY RD (AIRPORT)","South West Urban"]
[40965,"DA VINCI PL","North Urban West"]
[48253,"DA VINCI PL WWAY","North Urban West"]
[10214,"DACRE GR","North Urban East"]
[30344,"DACRE ST","Central"]
[40964,"DAFFODIL ST","West"]
[40534,"DAFFODIL ST EXTN","West"]
[51128,"DAGENHAM ST","South West Urban"]
[24063,"DAHLIA DR (PVT)","North Urban West"]
[47095,"DAINTON PL","West"]
[11590,"DAIRY FLAT HIGHWAY","North Rural"]
[51129,"DAIRY RD","South West Urban"]
[10215,"DAIRY STREAM RD","North Rural"]
[53218,"DAIRYLAND DR","South East Urban"]
[15485,"DAIRYLAND DR/GILNOCKIE CL CYWAY","South East Urban"]
[22047,"DAKOTA AVE","North Urban West"]
[53315,"DALCROSS DR","South East Urban"]
[31527,"DALDY ST (NORTH)","Central"]
[30345,"DALDY ST (SOUTH)","Central"]
[22840,"DALDYS BUSH LANE","North Urban West"]
[51130,"DALE CRES","South East Urban"]
[70138,"DALE RD (RAMARAMA)","South Rural"]
[70836,"DALE RD (SOUTH/RAMARAMA)","South Rural"]
[40963,"DALE RD (WAITAKERE)","North Urban West"]
[51131,"DALGETY DR","South West Urban"]
[54755,"DALGETY DR CARPARK (RP95 LHS)","South West Urban"]
[60089,"DALKEITH PL","South West Urban"]
[22794,"DALLAN PL","North Urban West"]
[30346,"DALLAS PL","West"]
[20246,"DALLINGHOE CRES","North Urban East"]
[40962,"DALLOW PL","West"]
[33498,"DALLY TCE","Central"]
[51132,"DALMAHOY PL","South West Urban"]
[15651,"DALMAHOY PL LINK CYWAY","South West Urban"]
[40961,"DALMATIA PL","West"]
[48079,"DALMATIA PL WWAY","West"]
[22292,"DALMENY CLOSE","North Urban East"]
[80364,"DALRAY AVE","South West Urban"]
[51133,"DALRY PL","South West Urban"]
[70939,"DALTON CRT","South Rural"]
[10216,"DALTON RD","North Rural"]
[30347,"DALTON ST","Central East"]
[51134,"DALWHINNIE PDE","South East Urban"]
[15742,"DALWHINNIE PDE/CROMDALE AVE CYWAY","South East Urban"]
[15741,"DALWHINNIE PDE/HOWICK INTERMEDIATE CYWAY","South East Urban"]
[51135,"DAMIAN WAY","South West Urban"]
[30348,"DAMPIER ST","West"]
[51136,"DAMSON PL","South East Urban"]
[71354,"DAN BRYANT PL","South Rural"]
[11375,"DAN TORI PL","North Urban East"]
[52736,"DANA PL","South East Urban"]
[22293,"DANBURY DR","North Urban East"]
[47049,"DANICA ESP","West"]
[48188,"DANICA ESP WWAY","West"]
[51137,"DANIEL AVE","South West Urban"]
[53765,"DANIEL AVE-BUCKLAND RD","South West Urban"]
[54248,"DANIELLE PL","South East Urban"]
[53026,"DANNEMORA DR","South East Urban"]
[15690,"DANNEMORA DR/POINT VIEW DR CYWAY","South East Urban"]
[40960,"DANUBE LANE","West"]
[22805,"DAPHENE HARDEN LANE","North Urban West"]
[51138,"DAPHNE RD","South West Urban"]
[40959,"DAPHNE ST","West"]
[53531,"DAPPLE PL","South East Urban"]
[30349,"DARBY ST","Central"]
[40958,"DARCY PL","West"]
[52829,"DARIA PL","South East Urban"]
[15698,"DARIA PL LINK CYWAY","South East Urban"]
[15699,"DARIA PL NORTH LINK CYWAY","South East Urban"]
[22772,"DARIMOUTH PL","North Urban West"]
[54756,"DARION DR","South East Urban"]
[40957,"DARLINGTON PL","West"]
[51139,"DARNELL CRES","South West Urban"]
[54404,"DARNELL CRES EXTN","South West Urban"]
[51140,"DARREN CRES","South East Urban"]
[10217,"DARROCH SLOPE","North Rural"]
[30350,"DARWIN LANE","Central East"]
[22955,"DATA WAY","North Urban West"]
[20349,"DATURA PL","North Urban East"]
[30351,"DAVENTRY ST","Central"]
[41305,"DAVERN LANE","West"]
[51141,"DAVID AVE","South West Urban"]
[22230,"DAVID BEATTIE PL","North Urban West"]
[11538,"DAVID MCCATHIE PL","North Urban East"]
[54319,"DAVID RAB","South West Urban"]
[11404,"DAVID SIDWELL PL","North Urban East"]
[20077,"DAVID ST","North Urban East"]
[11371,"DAVID WILLIAM PL","North Rural"]
[10218,"DAVIDSON RD","North Rural"]
[10219,"DAVIE MARTIN RD","North Rural"]
[51142,"DAVIES AVE","South West Urban"]
[23058,"DAVIES DR","North Urban West"]
[60398,"DAVIES RD (DRURY)","South Rural"]
[70139,"DAVIES RD (RAMARAMA)","South Rural"]
[10220,"DAVIES RD (WELLSFORD)","North Rural"]
[52913,"DAVINGTON WAY","South East Urban"]
[33499,"DAVIS CRES","Central"]
[34959,"DAVIS CRES EXTN (RP114 RHS)","Central"]
[51143,"DAVITA PL","South East Urban"]
[15587,"DAVITA PL LINK CYWAY","South East Urban"]
[40956,"DAWN PL (WAITAKERE)","West"]
[71304,"DAWN PL (WAIUKU)","South Rural"]
[40955,"DAWNHAVEN DR","West"]
[53304,"DAWOOD PL","South West Urban"]
[15561,"DAWOOD PL LINK CYWAY (RP141)","South West Urban"]
[15558,"DAWOOD PL LINK CYWAY (RP84)","South West Urban"]
[54762,"DAWSON RD (FLAT BUSH) (SE)","South East Urban"]
[51144,"DAWSON RD (OTARA) (SW)","South West Urban"]
[10221,"DAWSON RD (SNELLS BEACH)","North Rural"]
[15471,"DAWSON RD/NUNEATON DR CYWAY(RP1593)","South West Urban"]
[15470,"DAWSON RD/ZELDA AVE CYWAY (RP1320)","South West Urban"]
[10222,"DAY DAWN CRES","North Rural"]
[70140,"DAY RD (PATUMAHOE)","South Rural"]
[10223,"DAY RD (WAITEITEI)","North Rural"]
[30352,"DAY ST","Central"]
[51145,"DAYSPRING WAY","South East Urban"]
[15626,"DAYSPRING WAY LINK CYWAY","South East Urban"]
[40954,"DAYTONA RD","West"]
[70141,"DAZELEY RD","South Rural"]
[51146,"DE BLOGE PL","South West Urban"]
[53008,"DE HAVILLAND DR","South West Urban"]
[41438,"DE HAVILLAND RD","North Urban West"]
[54372,"DE HAVILLAND/FAIRCHILD RAB","South West Urban"]
[10224,"DE LUEN AVE","North Urban East"]
[30358,"DE LUEN ST","Central"]
[51147,"DE QUINCEY TCE","South East Urban"]
[54536,"DE QUINCEY TCE HAMMERHEAD","South East Urban"]
[15640,"DE QUINCY TCE LINK CYWAY (RP405)","South East Urban"]
[15638,"DE QUINCY TCE LINK CYWAY (RP69)","South East Urban"]
[15639,"DE QUINCY TCE LINK CYWAY (RP77)","South East Urban"]
[51148,"DE THIERY PL","South East Urban"]
[53768,"DE THIERY PL-MEGAN AVE","South East Urban"]
[40953,"DE VAL DR","West"]
[48023,"DE VAL DR WWAY","West"]
[10225,"DEACON RD","North Rural"]
[30353,"DEAN ST","Central"]
[40952,"DEANE AVE","West"]
[40951,"DEANNA DR","North Urban West"]
[33500,"DEAS PL","South West Urban"]
[35264,"DEBORAH HATTON LANE (PVT)","Central East"]
[51149,"DEBORAH PL (MANGERE)","South West Urban"]
[20739,"DEBORAH PL (OKURA)","North Urban East"]
[53769,"DEBORAH PL-IMRIE AVE","South West Urban"]
[30354,"DEBRON AVE","Central East"]
[30355,"DEDWOOD TCE","Central"]
[22786,"DEE PL","North Urban East"]
[22943,"DEELE CLOSE","North Urban West"]
[22294,"DEEP CREEK RD","North Urban East"]
[53516,"DEERFIELD PL","South East Urban"]
[51150,"DEERING PL","South West Urban"]
[10226,"DEERNESS CRES","North Rural"]
[51151,"DEERYS RD","South Rural"]
[80508,"DEFENDER CRES","South Rural"]
[40950,"DEIRDRE PL","West"]
[52883,"DEL MAR CRT","South East Urban"]
[54425,"DEL MAR CRT EXTN","South East Urban"]
[22685,"DELAMARE CRT","North Urban East"]
[35265,"DELAMORE DR","Hauraki Islands"]
[35061,"DELARGEY AVE (PVT)","Central"]
[30356,"DELEMERE PL","Central East"]
[35863,"DELEMERE/FARRINGDON WWAY (RP104)","Central East"]
[20684,"DELISLE PL","North Urban West"]
[30357,"DELL AVE","Central East"]
[71307,"DELL RD","South Rural"]
[51152,"DELL WAY","South East Urban"]
[60457,"DELLA PL","South West Urban"]
[53172,"DELMONT CLOSE","South East Urban"]
[33502,"DELPHINE CLOSE","Central"]
[30032,"DELPHINE CLOSE HAMMERHEAD","Central"]
[52865,"DELRAY PL","South East Urban"]
[10227,"DELSHAW AVE","North Urban East"]
[40117,"DELTA AVE","West"]
[80343,"DELTA AVE WWAY","West"]
[40174,"DELWOOD AVE","West"]
[30359,"DELWYN LANE","Central East"]
[30360,"DEMPSEY ST","Central East"]
[40949,"DENARIUS LANE (PVT)","West"]
[33504,"DENBIGH AVE","Central"]
[21017,"DENBY LANE","North Urban West"]
[30361,"DENBY ST","Central"]
[20630,"DENE COURT LANE","North Urban West"]
[11363,"DENEHURST DR","North Rural"]
[11120,"DENHAM WAY","North Urban East"]
[22921,"DENIM PL","North Urban West"]
[33505,"DENIZE RD","Central"]
[35070,"DENNING PL (PVT)","Central East"]
[51153,"DENNIS AVE","South West Urban"]
[54090,"DENNIS AVE SERVICE LANE (RP412 LHS)","South West Urban"]
[10228,"DENNIS RD (KOURAWHERO)","North Rural"]
[51154,"DENNIS RD (PAPATOETOE)","South West Urban"]
[33506,"DENNY AVE","Central"]
[60267,"DENT PL","South West Urban"]
[40948,"DENVER AVE","West"]
[80379,"DENVER AVE WWAY","West"]
[40077,"DENYER PL","West"]
[51155,"DEODAR PL","South West Urban"]
[80496,"DEOL DR","South Rural"]
[34848,"DERBY DOWNS PL","Central East"]
[22120,"DERBY ST","North Urban East"]
[60399,"DERBYSHIRE LANE","South West Urban"]
[53407,"DERG PL","South East Urban"]
[33507,"DERNA RD","Central East"]
[51156,"DERRETT PL","South West Urban"]
[51157,"DERRIMORE HGTS","South West Urban"]
[54410,"DERRIMORE RAB","South East Urban"]
[30362,"DERRY ST","Central"]
[53129,"DERRYVEAGH LANE","South West Urban"]
[40947,"DERWENT CRES","West"]
[30363,"DERWENT ST","Central"]
[20566,"DES SWANN DR","North Urban East"]
[51158,"DESFORD PL","South West Urban"]
[51159,"DESMOND PL","South West Urban"]
[80280,"DESMOND RD","North Urban East"]
[60311,"DESTINO CRT","South West Urban"]
[51160,"DETRO ST","South West Urban"]
[21018,"DEUXBERRY AVE","North Urban West"]
[22694,"DEVANA CRT","North Urban East"]
[22295,"DEVERELL PL","North Urban East"]
[51161,"DEVERON RD","South West Urban"]
[24109,"DEVON CRT (PVT)","North Urban East"]
[70940,"DEVON LANE","South Rural"]
[71431,"DEVON LANE CAR PARK","South Rural"]
[51162,"DEVON RD","South East Urban"]
[54834,"DEVON RD WWAY","South East Urban"]
[30364,"DEVON ST (NEWTON)","Central"]
[40946,"DEVON ST (WAITAKERE)","West"]
[26004,"DEVONPORT COMMUNITY HOUSE CARPARK","North Urban East"]
[24022,"DEVONPORT WARK (VICTORIA) (PVT)","North Urban East"]
[20694,"DEVONSHIRE RD","North Urban West"]
[24031,"DEVONVIEWS (PVT)","North Urban East"]
[30365,"DEVORE ST","Central East"]
[53299,"DEWHURST PARK ACCESS (PVT)","South West Urban"]
[51163,"DEWHURST PL","South West Urban"]
[20222,"DEWSBURY TCE","North Urban East"]
[33508,"DEXTER AVE","Central"]
[30366,"DIAMOND ST","Central"]
[20049,"DIANA DR","North Urban West"]
[47033,"DIANA PL","West"]
[51164,"DIANNE LOUISE DR","South East Urban"]
[22296,"DIANTHUS PL","North Urban East"]
[30367,"DICKENS ST","Central"]
[15250,"DICKENS ST/GREY LYNN PARK LINK CYWAY","Central"]
[70145,"DICKEY RD","South Rural"]
[30368,"DICKEY ST","West"]
[34986,"DICKSON RD","Hauraki Islands"]
[30369,"DIGNAN ST","Central"]
[10229,"DILL RD","North Rural"]
[51165,"DILLIMORE AVE","South East Urban"]
[51166,"DILLON CRES","South West Urban"]
[30371,"DILWORTH AVE","Central East"]
[30370,"DILWORTH TCE (PVT)","Central"]
[30372,"DINGLE RD","Central East"]
[33509,"DINGLEBANK RD","Central East"]
[51167,"DINGWALL PL","South West Urban"]
[10230,"DINNING RD","North Rural"]
[20080,"DIOMEDE ST","North Urban East"]
[53617,"DIONE PL","South East Urban"]
[51168,"DIORELLA DR","South West Urban"]
[54408,"DIORELLA DR CARPARK (RP231 LHS)","South East Urban"]
[51169,"DIOSMA PL","South East Urban"]
[80353,"DISCOVERY DR","North Urban East"]
[80521,"DISLEY RD","South West Urban"]
[30373,"DISRAELI ST","Central"]
[33126,"DISRAELI ST HLA (#27 - GARRY)","Central"]
[51170,"DISSMEYER DR","South West Urban"]
[54406,"DISSMEYER DR CARPARK (RP318 RHS)","South East Urban"]
[51171,"DIVERSEY LANE","South West Urban"]
[40945,"DIVICH AVE","West"]
[10231,"DOBELL RD","North Urban East"]
[30374,"DOCK ST","Central"]
[35967,"DOCKSIDE LANE (PVT)","Central"]
[70148,"DODD RD","South Rural"]
[20189,"DODSON AVE","North Urban East"]
[26036,"DODSON AVE CARPARK","North Urban East"]
[20192,"DODSON NORTH SERVICE LANE","North Urban East"]
[20817,"DODSON RD (SOUTH) SERVICE LANE","North Urban East"]
[40169,"DOLAN PL","West"]
[48025,"DOLAN PL WWAY","West"]
[48026,"DOLAN PL WWAY - MARGAN AVE #11 WWAY","West"]
[40944,"DOLBEAR ST","West"]
[53579,"DOLBEL PL","South West Urban"]
[53525,"DOLE PL","South West Urban"]
[35260,"DOLPHIN LANE (PVT)","Hauraki Islands"]
[51172,"DOLPHIN ST","South East Urban"]
[10232,"DOMAIN CRES","North Rural"]
[11415,"DOMAIN CRES LLA (#66 - #90)","North Rural"]
[30375,"DOMAIN DR","Central"]
[54120,"DOMAIN LANE","South West Urban"]
[20451,"DOMAIN RD (GLENFIELD)","North Urban West"]
[51173,"DOMAIN RD (MANGERE)","South West Urban"]
[51174,"DOMAIN RD (MANUREWA)","South West Urban"]
[34702,"DOMAIN RD (PANMURE)","Central East"]
[10233,"DOMAIN RD (PUHOI)","North Rural"]
[70149,"DOMAIN RD (PUKEKOHE)","South Rural"]
[54384,"DOMAIN RD CARPARK (RP24 RHS)","South West Urban"]
[22514,"DOMAIN ST (DEVONPORT)","North Urban East"]
[70865,"DOMAIN ST (WAIUKU)","South Rural"]
[10235,"DOMENT CRES","North Urban East"]
[30378,"DOMETT AVE","Central"]
[70150,"DOMINIKOVICH RD","South Rural"]
[35766,"DOMINION RAMPS A-C CYWAY (RP160)","Central"]
[31855,"DOMINION RD (MT EDEN)","Central"]
[30015,"DOMINION RD (MT EDEN/NORTHBOUND)","Central"]
[60090,"DOMINION RD (PAPAKURA)","South West Urban"]
[33513,"DOMINION RD EXTN","Central"]
[30377,"DOMINION RD INTERCHANGE RAMP A","Central"]
[34914,"DOMINION RD INTERCHANGE RAMP B","Central"]
[34915,"DOMINION RD INTERCHANGE RAMP C","Central"]
[34916,"DOMINION RD INTERCHANGE RAMP D","Central"]
[36108,"DOMINION RD LINK CYWAY","Central"]
[20168,"DOMINION ST","North Urban East"]
[35838,"DOMINION/DENBIGH RAB","Central"]
[35693,"DOMINION/FREELAND WWAY (RP5533)","Central"]
[35839,"DOMINION/RICHARDSON RAB","Central"]
[40943,"DON BUCK RD","West"]
[47140,"DON BUCK RD HLA (#34 - #54)","West"]
[47142,"DON BUCK RD LLA (#236 - #232)","West"]
[47144,"DON BUCK RD LLA (#431 - #443)","West"]
[47143,"DON BUCK RD LLA (#436 - #456)","West"]
[47139,"DON BUCK RD LLA (#456 - #464)","West"]
[47141,"DON BUCK RD LLA (#466 - #476)","West"]
[41156,"DON BUCK/RED HILLS RAB","West"]
[41155,"DON BUCK/TRIANGLE RAB","West"]
[47163,"DON BUCK/WESTGATE RAB","West"]
[33516,"DON CROOT ST","Central"]
[22859,"DON MCKINNON DR","North Urban West"]
[51175,"DON PL","South West Urban"]
[53770,"DON PL-BAIRDS RD","South West Urban"]
[60091,"DON ST","South West Urban"]
[33514,"DONALD BRUCE RD","Hauraki Islands"]
[31713,"DONALD BRUCE RD CARPARK (RP1595)","Hauraki Islands"]
[33515,"DONALD CRES","Central"]
[11214,"DONALD PL","North Urban East"]
[11328,"DONALD ST","North Urban East"]
[10236,"DONALDSON DR","North Rural"]
[51176,"DONCASTER ST","South West Urban"]
[53090,"DONEGAL PARK DR","South East Urban"]
[30379,"DONEGAL ST","West"]
[60313,"DONEGAN PL","South West Urban"]
[51177,"DONNELL AVE","South West Urban"]
[31580,"DONNELLY ST","Central East"]
[34703,"DONNOR PL","Central East"]
[10237,"DONOHUE RD","North Rural"]
[40942,"DONOVAN AVE","West"]
[30380,"DONOVAN ST","West"]
[60312,"DONZELLA PL","South West Urban"]
[15417,"DONZELLA PL LINK CYWAY","South West Urban"]
[40941,"DOONE PL","West"]
[40940,"DORA ST","West"]
[35288,"DORAVAL PL","Central East"]
[11387,"DORCHESTER PL","North Urban East"]
[30381,"DORCHESTER ST","Central East"]
[34704,"DOREEN AVE","Central"]
[51178,"DORENDIA PL","South West Urban"]
[53771,"DORENDIA PL-ADEN PL","South West Urban"]
[10238,"DORMER RD","North Rural"]
[11126,"DORNIE PL","North Rural"]
[34705,"DORNWELL RD","Central"]
[35692,"DORNWELL/CLINKER WWAY (RP220)","Central"]
[40939,"DOROTHY RD","West"]
[51179,"DORRINGTON PL","South East Urban"]
[51180,"DORRIT LANE  (PVT)","South East Urban"]
[30382,"DORSET ST","Central"]
[51181,"DOSINA PL","South West Urban"]
[53772,"DOSINA PL-PENION DR","South West Urban"]
[11472,"DOUBLE BAY PL","North Urban East"]
[34706,"DOUG GOODWIN PL","Central"]
[51182,"DOUGHTY PL","South West Urban"]
[22778,"DOUGLAS ALEXANDER PDE","North Urban West"]
[34707,"DOUGLAS AVE","Central"]
[34708,"DOUGLAS RD","Central"]
[70152,"DOUGLAS RD (AWHITU)","South Rural"]
[70153,"DOUGLAS RD (PUKEKOHE)","South Rural"]
[70245,"DOUGLAS RD EXTN (AWHITU)","South Rural"]
[30383,"DOUGLAS ST","Central"]
[22978,"DOVE PL","North Urban West"]
[35629,"DOVEDALE PL (PVT)","Central"]
[30384,"DOVER PL","Central East"]
[47244,"DOVEY PL","West"]
[53087,"DOWD PL","South East Urban"]
[51183,"DOWLING PL","South East Urban"]
[10239,"DOWNER ACCESS RD","North Rural"]
[11132,"DOWNER ST","North Rural"]
[20433,"DOWNING ST","North Urban West"]
[70154,"DOWNS RD","South Rural"]
[51184,"DOWNSVIEW RD","South East Urban"]
[10240,"D'OYLY DR","North Urban East"]
[51185,"DR PICKERING AVE","South West Urban"]
[54344,"DR PICKERING AVE CPARK (RP187 LHS)","South West Urban"]
[54349,"DR PICKERING AVE CPARK (RP187 RHS)","South West Urban"]
[54348,"DR PICKERING AVE CPARK (RP243 LHS)","South West Urban"]
[30385,"DRAKE ST (AUCKLAND)","Central"]
[51186,"DRAKE ST (HOWICK)","South East Urban"]
[24046,"DRAYCOTT LANE (PVT)","North Urban West"]
[51187,"DREADON AVE","South West Urban"]
[51188,"DREADON RD","South West Urban"]
[51189,"DREIFUSS PL","South West Urban"]
[22980,"DRESSAGE LANE","North Urban West"]
[33517,"DREW ST","Central"]
[11485,"DRIFTWOOD DR","North Urban East"]
[10241,"DRINNAN RD","North Rural"]
[52791,"DRISCOLL PL","South East Urban"]
[51190,"DRIVER RD","South West Urban"]
[22049,"DROME VIEW PL","North Urban West"]
[54757,"DROMOLAND DR","South East Urban"]
[53051,"DROMORA CLOSE","South East Urban"]
[30386,"DROMORNE RD","Central East"]
[24074,"DROP OFF DR (PVT)","North Urban East"]
[40938,"DROWER RD","West"]
[54302,"DRUCES RD (NORTHBOUND)","South West Urban"]
[52728,"DRUCES RD (SOUTHBOUND)","South West Urban"]
[54386,"DRUCES RD EXTN (RP91 LHS)","South West Urban"]
[53773,"DRUMBEG CLOSE-FALCARRAGH CRES","South East Urban"]
[53436,"DRUMBERG CLOSE","South East Urban"]
[60693,"DRUMKEEN PL","South West Urban"]
[47050,"DRUMMOND DR","West"]
[53053,"DRUMQUIN RISE","South East Urban"]
[15677,"DRUMQUIN RISE LINK CYWAY","South East Urban"]
[54547,"DRUMQUIN RISE LOOP","South East Urban"]
[53513,"DRUMSTON PL","South East Urban"]
[60400,"DRURY HILLS RD","South Rural"]
[10242,"DRURY LANE","North Rural"]
[35645,"DRURY LANE (PVT)","Central"]
[40115,"DRURY ST","West"]
[51192,"DRYDEN AVE","South West Urban"]
[33518,"DRYDEN PL","Central East"]
[30387,"DRYDEN ST","Central"]
[15244,"DRYDEN ST/GREY LYNN PARK LINK CYWAY (RP750)","Central"]
[51193,"DRYSDALE PL","South East Urban"]
[33519,"DUART AVE","Central"]
[70942,"DUBLIN ST (PUKEKOHE)","South Rural"]
[30388,"DUBLIN ST (ST MARYS BAY)","Central"]
[10243,"DUCK CREEK RD (WARKWORTH)","North Rural"]
[10244,"DUCK CREEK RD 2 (STILLWATER)","North Urban East"]
[60092,"DUCKWORTH RD","South West Urban"]
[60537,"DUCKWORTH/KERI VISTA RAB","South West Urban"]
[21019,"DUDDING AVE","North Urban West"]
[22009,"DUDERS AVE","North Urban East"]
[30389,"DUDLEY RD","Central East"]
[11006,"DUFFY RD","West"]
[40937,"DUFFYS RD","West"]
[51194,"DUGGAN AVE","South West Urban"]
[53775,"DUGGAN AVE-KEMBLE CLOSE","South West Urban"]
[53774,"DUGGAN AVE-NICOLA PL","South West Urban"]
[70943,"DUKE AVE","South Rural"]
[21020,"DUKE ST (NORTHCOTE)","North Urban West"]
[60093,"DUKE ST (PAPAKURA)","South West Urban"]
[33520,"DUKE ST (THREE KINGS)","Central"]
[10247,"DUKE ST 2 (RIVERHEAD)","North Rural"]
[60094,"DULCIE PL","South West Urban"]
[52807,"DULWICH PL","South East Urban"]
[60095,"DUMAS PL","South West Urban"]
[53596,"DUNAFF PL","South East Urban"]
[33521,"DUNBAR RD (BALMORAL)","Central"]
[10248,"DUNBAR RD (POINT WELLS)","North Rural"]
[47051,"DUNBARTON DR","West"]
[33522,"DUNCAN AVE (SANDRINGHAM)","Central"]
[40936,"DUNCAN AVE (WAITAKERE)","West"]
[30390,"DUNCAN MACLEAN LINK","Central"]
[70158,"DUNCAN RD","South Rural"]
[40935,"DUNCAN RISE","North Urban West"]
[10249,"DUNCANSBY RD","North Urban East"]
[11276,"DUNCANSBY RD 23 - 35","North Urban East"]
[11275,"DUNCANSBY RD 26 - 32","North Urban East"]
[11274,"DUNCANSBY RD 49 - 61","North Urban East"]
[33523,"DUNCUMB ST","Central"]
[30391,"DUNDALE AVE","West"]
[40934,"DUNDAS PL","West"]
[30392,"DUNDEE PL","West"]
[35747,"DUNDEE/DUNDALE WWAY (RP347 LHS)","West"]
[30393,"DUNDONALD ST","Central"]
[35762,"DUNDONALD/BASQUE WWAY (RP172)","Central"]
[30394,"DUNEDIN ST","Central"]
[51196,"DUNGARVON PL (MANUREWA)","South West Urban"]
[10250,"DUNGARVON PL (OMAHA BEACH)","North Rural"]
[30395,"DUNHOLME RD","Central East"]
[33524,"DUNKERRON AVE","Central"]
[80319,"DUNKINEELY RD","South East Urban"]
[33525,"DUNKIRK RD","Central East"]
[33526,"DUNKIRK TCE","Central"]
[33527,"DUNLOP LANE","Central East"]
[40933,"DUNLOP RD","West"]
[53383,"DUNLOY PL","South East Urban"]
[52792,"DUNN PL","South East Urban"]
[70159,"DUNN RD (ARARIMU)","South Rural"]
[33528,"DUNN RD (MT WELLINGTON)","Central East"]
[10251,"DUNNING RD","North Rural"]
[51197,"DUNNOTAR RD","South West Urban"]
[54183,"DUNNOTAR RD CARPARK (RP127 RHS)","South West Urban"]
[54182,"DUNNOTAR RD CARPARK (RP143 LHS)","South West Urban"]
[54185,"DUNNOTAR RD CARPARK (RP36 RHS)","South West Urban"]
[54184,"DUNNOTAR RD CARPARK (RP62 LHS)","South West Urban"]
[70944,"DUNOLLY PL","South Rural"]
[53423,"DUNOON CLOSE","South East Urban"]
[22297,"DUNRAVEN PL","North Urban East"]
[71361,"DUNROBIN LANE","South Rural"]
[52986,"DUNROBIN PL (PVT)","South East Urban"]
[70160,"DUNSMUIR RD","South Rural"]
[51198,"DUNSTALL PL","South West Urban"]
[54636,"DUNSTALL PL EXTN","South West Urban"]
[51199,"DUNSTAN PL","South West Urban"]
[53776,"DUNSTAN PL-RONGOMAI RD","South West Urban"]
[53655,"DUNTRUNE RD","South East Urban"]
[53305,"DUNVEGAN RISE","South East Urban"]
[22973,"DURBIN CRT","North Urban West"]
[10252,"DUREY RD","North Rural"]
[30396,"DURHAM LANE","Central"]
[36092,"DURHAM LANE HAMMERHEAD","Central"]
[40932,"DURHAM ST","West"]
[30397,"DURHAM ST EAST","Central"]
[30398,"DURHAM ST WEST","Central"]
[10253,"DURNESS PL","North Urban East"]
[40004,"DURRANT PL","West"]
[35568,"D'URVILLE HGTS (PVT)","Central"]
[10254,"D'URVILLE PL","North Urban East"]
[47300,"DUXFIELD DR","West"]
[10255,"DYE ACCESS RD","North Rural"]
[10256,"DYER RD","North Rural"]
[70161,"DYKE RD","South Rural"]
[10257,"DYSART LANE","North Rural"]
[11237,"E.C.RD AC/WAY OPP. SKIPPER QUARRY","North Urban East"]
[10258,"EAGLE PL","North Urban East"]
[11446,"EAGLE VIEW RISE","North Rural"]
[33529,"EAGLEHURST RD","Central East"]
[34955,"EAGLEHURST RD LLA (#5 - #11)","Central East"]
[53113,"EAGLEMONT DR","South East Urban"]
[51200,"EAGLEN PL","South East Urban"]
[22298,"EAGLESON ST","North Urban East"]
[51201,"EALING CRES","South Rural"]
[54817,"EALING CRES CARPARK (RP432 LHS)","South Rural"]
[40931,"EARL RD","West"]
[51202,"EARL RICHARDSON AVE","South West Urban"]
[30399,"EARLE ST","Central"]
[51203,"EARLS CRT","South West Urban"]
[53313,"EARLSHALL DR","South East Urban"]
[11405,"EARLSWAY","North Rural"]
[51204,"EARLSWORTH RD","South West Urban"]
[20177,"EARNOCH AVE","North Urban East"]
[53150,"EARNSLAW CRES","South East Urban"]
[10259,"EAST AVE","North Urban East"]
[70162,"EAST COAST RD","South Rural"]
[21061,"EAST COAST RD (AC.WAY) 455-451","North Urban East"]
[22068,"EAST COAST RD (AC.WAY) 586-606","North Urban East"]
[10260,"EAST COAST RD (SILVERDALE/REDVALE","North Urban East"]
[20001,"EAST COAST RD (TAKA/GLENFIELD/E.C","North Urban East"]
[23069,"EAST COAST RD HLA (#235 - #247)","North Urban East"]
[22592,"EAST COAST RD HLA (#730 - SPENCER)","North Urban East"]
[23076,"EAST COAST RD HLA (#786 - #794)","North Urban East"]
[23080,"EAST COAST RD HLA (#917 - #925)","North Urban East"]
[22590,"EAST COAST RD HLA (WOSLEY AVE)","North Urban East"]
[22165,"EAST COAST RD LLA (#368 - #382)","North Urban East"]
[21023,"EAST COAST RD LLA (#391 - #409)","North Urban East"]
[23070,"EAST COAST RD LLA (#581 - #589)","North Urban East"]
[22946,"EAST COAST RD LLA (#589 - #613)","North Urban East"]
[23091,"EAST COAST RD LLA (#685 - #695)","North Urban East"]
[23072,"EAST COAST RD LLA (#699 - #703)","North Urban East"]
[23073,"EAST COAST RD LLA (#727 - #731)","North Urban East"]
[23074,"EAST COAST RD LLA (#733 - #735)","North Urban East"]
[22985,"EAST COAST RD LLA (#764 - #772)","North Urban East"]
[23075,"EAST COAST RD LLA (#769 - #775)","North Urban East"]
[23077,"EAST COAST RD LLA (#801 - #817)","North Urban East"]
[23078,"EAST COAST RD LLA (#867 - #879)","North Urban East"]
[23079,"EAST COAST RD LLA (#890 - #904)","North Urban East"]
[23081,"EAST COAST RD LLA (#928 - #938)","North Urban East"]
[23082,"EAST COAST RD LLA (#959 - #965)","North Urban East"]
[11584,"EAST POINT","North Urban East"]
[60317,"EAST ST (DRURY)","South West Urban"]
[10261,"EAST ST (MAH EAST)","North Rural"]
[30401,"EAST ST (NEWTON)","Central"]
[60096,"EAST ST (PAPAKURA)","South West Urban"]
[71179,"EAST ST (PUKEKOHE)","South Rural"]
[60676,"EAST ST CARPARK (RP183 LHS)","South West Urban"]
[71519,"EAST ST HLA (#71 - #79)","South Rural"]
[60275,"EAST ST SERVICE LANE (RP324 LHS)","South West Urban"]
[51205,"EAST TAMAKI RD (EASTBOUND/OTARA) (SW)","South West Urban"]
[54763,"EAST TAMAKI RD (EASTBOUND/TAMAKI) (SE)","South East Urban"]
[54497,"EAST TAMAKI RD (WESTBOUND) (SW)","South West Urban"]
[54752,"EAST TAMAKI RD CARPARK (RP2643 RHS)","South East Urban"]
[54202,"EAST TAMAKI RD CARPARK (RP2710 RHS)","South West Urban"]
[15606,"EAST TAMAKI RD LINK CYWAY (RP2123)","South West Urban"]
[15513,"EAST TAMAKI RD LINK CYWAY(RP868)","South West Urban"]
[54592,"EAST TAMAKI RD LLA (#264 - #274)","South East Urban"]
[52916,"EAST TAMAKI RD SERVICE LANE (RP2636)","South West Urban"]
[15509,"EAST TAMAKI RD/BAIRDS RD CYWAY (RP1980)","South West Urban"]
[15515,"EAST TAMAKI RD/BOND ST CYWAY (RP833)","South West Urban"]
[15516,"EAST TAMAKI RD/DOUGHTY PL CYWAY (RP2535)","South West Urban"]
[15614,"EAST TAMAKI RD/GAYE CRES CYWAY (RP2050)","South West Urban"]
[53777,"EAST TAMAKI RD-CHARLES ST","South West Urban"]
[53778,"EAST TAMAKI RD-CLAYTON AVE","South West Urban"]
[53780,"EAST TAMAKI RD-DAIRY RD","South West Urban"]
[54460,"EAST TAMAKI/CRAIGAVON RAB","South East Urban"]
[71554,"EAST/BELGIUM RAB","South Rural"]
[24021,"EASTBOURNE RD (NORTH SHORE) (PVT)","North Urban West"]
[30402,"EASTBOURNE RD (REMUERA)","Central East"]
[60097,"EASTBURN ST","South West Urban"]
[20209,"EASTCLIFFE RD","North Urban East"]
[30403,"EASTDALE RD","West"]
[40144,"EASTER PDE","West"]
[51206,"EASTERN BEACH RD","South East Urban"]
[15779,"EASTERN BEACH RD/VIVIAN WILSON DR CYWAY","South East Urban"]
[54660,"EASTERN BEACH/MCCRYSTAL RAB","South East Urban"]
[40059,"EASTGLEN RD","West"]
[52996,"EASTLAND RD","South East Urban"]
[20468,"EASTON PARK PDE","North Urban West"]
[80421,"EASTREEF COURT","North Urban East"]
[51207,"EASTRIDGE CRT","South East Urban"]
[54476,"EASTRIDGE CRT EXTN","South East Urban"]
[53783,"EASTRIDGE CRT-FIELDSTONE CRT","South East Urban"]
[53782,"EASTRIDGE CRT-MILLHOUSE DR","South East Urban"]
[53784,"EASTRIDGE CRT-WHITFORD RD","South East Urban"]
[71411,"EASTSIDE DR","South Rural"]
[22922,"EASTVALE CLOSE","North Urban West"]
[80549,"EASTVIEW CRESCENT","North Urban East"]
[30404,"EASTVIEW RD","Central East"]
[31583,"EASTVIEW/APIRANA SLIP","Central East"]
[22544,"EASTWOOD RISE","North Urban East"]
[33530,"EATON RD","Central"]
[80128,"EAVES BUSH PDE","North Urban East"]
[21098,"EBAN AVE","North Urban West"]
[53277,"EBANJANE WAY","South West Urban"]
[51208,"EBENEZER WAY","South West Urban"]
[40930,"EBONY PL","West"]
[51209,"ECCLES PL","South West Urban"]
[53024,"ECHELON PL","South East Urban"]
[51210,"ECLIPSE PL","South East Urban"]
[54021,"EDBROOKE DR","South East Urban"]
[51211,"EDDOWES ST","South West Urban"]
[30405,"EDEN CRES","Central"]
[70945,"EDEN PL","South Rural"]
[70165,"EDEN RD","South Rural"]
[51212,"EDEN ST (MANGERE)","South West Urban"]
[34709,"EDEN ST (NEWMARKET)","Central"]
[33532,"EDEN TCE","Hauraki Islands"]
[33533,"EDEN VIEW RD","Central"]
[51213,"EDENDALE RD (HOWICK)","South East Urban"]
[35959,"EDENDALE RD (KINGSLAND)","Central"]
[15776,"EDENDALE RD/SOMMERVILLE SHOPPING CENTRE CYWAY","South East Urban"]
[33535,"EDENVALE CRES","Central"]
[31642,"EDENVALE CRES EXTN (RP354 RHS)","Central"]
[33536,"EDENVALE PARK RD","Central"]
[51214,"EDGAR PEARCE PL","South East Urban"]
[30406,"EDGARS RD","Central"]
[30407,"EDGERLEY AVE","Central"]
[10262,"EDGERLEY RD","North Rural"]
[40929,"EDGERTON RD","West"]
[40928,"EDGEWARE RD","West"]
[60696,"EDGEWATER DR (KARAKA)","South West Urban"]
[51215,"EDGEWATER DR (PAKURANGA)","South East Urban"]
[54209,"EDGEWATER DR CARPARK (RP23 RHS)","South East Urban"]
[54208,"EDGEWATER DR CARPARK (RP35 RHS)","South East Urban"]
[54043,"EDGEWATER DR SERVICE LANE (RP60)","South East Urban"]
[10263,"EDGEWATER GR","North Urban East"]
[70867,"EDGEWATER PDE","South Rural"]
[40173,"EDGEWOOD WAY","West"]
[20416,"EDGEWORTH RD","North Urban West"]
[60098,"EDINBURGH AVE","South West Urban"]
[60678,"EDINBURGH AVE CARPARK (RP311 RHS)","South West Urban"]
[71257,"EDINBURGH LANE (RP916 LHS)","South Rural"]
[30408,"EDINBURGH ST (CITY)","Central"]
[70946,"EDINBURGH ST (PUKEKOHE)","South Rural"]
[34710,"EDINBURGH ST (TE PAPAPA)","Central East"]
[71433,"EDINBURGH ST CARPARK (RP1143 LHS)","South Rural"]
[71545,"EDINBURGH/HARRIS RAB","South Rural"]
[70109,"EDINBURGH/MASSEY RAB","South Rural"]
[71550,"EDINBURGH/SEDDON RAB","South Rural"]
[71370,"EDINBURGH/STADIUM RAB","South Rural"]
[53215,"EDINGALE CRT","South East Urban"]
[30409,"EDISON PL","Central East"]
[10264,"EDITH PL","North Rural"]
[10265,"EDITH RIDGE RD","North Rural"]
[30410,"EDITH ST","Central"]
[33537,"EDMONTON AVE","Central East"]
[40926,"EDMONTON RD","West"]
[41329,"EDMONTON/ALDERMAN RAB","West"]
[34918,"EDMONTON/MT SMART WWAY (RP347)","Central East"]
[60099,"EDMUND HILLARY AVE","South West Urban"]
[30411,"EDMUND ST","Central East"]
[35794,"EDMUND/TARAWERA WWAY (RP330 RHS)","Central East"]
[51216,"EDNEY LANE","South West Urban"]
[51217,"EDORVALE AVE","South West Urban"]
[53787,"EDORVALE AVE-WINSPEAR PL","South West Urban"]
[40925,"EDSEL ST","West"]
[54394,"EDSEL WAY","South West Urban"]
[40924,"EDSEL/VITASOVICH RAB","West"]
[10266,"EDWARD AVE (OREWA)","North Urban East"]
[51218,"EDWARD AVE (OTARA)","South West Urban"]
[11482,"EDWARD JONKERS DR","North Rural"]
[10267,"EDWARD ST","North Rural"]
[31215,"EDWARD WAYTE PL","Central"]
[40923,"EDWARDS AVE","West"]
[70947,"EDWARDS CRT","South Rural"]
[30412,"EDWARDS RD (GREY LYNN)","Central"]
[10268,"EDWARDS RD (WARKWORTH)","North Rural"]
[40922,"EDWIN FREEMAN PL","West"]
[10269,"EDWIN MITCHELSON RD","North Rural"]
[33538,"EDWIN ST","Central"]
[53447,"EDZELL CLOSE","South East Urban"]
[70166,"EGGLETON RD","South Rural"]
[33539,"EGLINTON AVE","Central"]
[30413,"EGLON ST","Central"]
[20088,"EGREMONT ST","North Urban East"]
[22733,"EGRET CRT","North Urban West"]
[52805,"EIGER PL","South East Urban"]
[80571,"EIGHTH VIEW AVE","South Rural"]
[51219,"EILEEN LANE","South West Urban"]
[52467,"EKAPO ST (PVT)","South West Urban"]
[10270,"EL HAMA RD","North Rural"]
[80620,"EL HAMA RD CARPARK","North Rural"]
[54482,"EL KOBAR DR (NORTHBOUND)","South East Urban"]
[54245,"EL KOBAR DR (SOUTHBOUND)","South East Urban"]
[30414,"ELAM ST","Central"]
[11402,"ELAN PL","North Urban East"]
[60316,"ELANA CRT","South West Urban"]
[15408,"ELANA CRT/ESPLANADE LINK CYWAY","South West Urban"]
[40921,"ELCOAT AVE","West"]
[47308,"ELDER PL","West"]
[52806,"ELDERBERRY RD","South East Urban"]
[20106,"ELDERWOOD LANE","North Urban East"]
[33540,"ELDON RD","Central"]
[20134,"ELDON ST","North Urban East"]
[30415,"ELEANOR PL (BLOCKHOUSE BAY)","West"]
[54795,"ELEANOR PL (MANUKAU)","South West Urban"]
[51220,"ELECTRA PL","South West Urban"]
[33541,"ELGAR ST","Central East"]
[10271,"ELGIN PL","North Urban East"]
[30416,"ELGIN ST","Central"]
[15247,"ELGIN ST/GREY LYNN PARK LINK CYWAY (RP530)","Central"]
[15248,"ELGIN ST/GREY LYNN PARK LINK CYWAY (RP635)","Central"]
[53656,"ELIAS CRT","South West Urban"]
[53593,"ELIE PL","South West Urban"]
[15434,"ELIE PL LINK CYWAY","South West Urban"]
[51221,"ELIMAR DR","South East Urban"]
[40920,"ELISA LANE","West"]
[48210,"ELISA LANE WWAY","West"]
[51222,"ELIZABETH AVE","South West Urban"]
[40919,"ELIZABETH DR","West"]
[30419,"ELIZABETH KNOX PL","Central East"]
[60427,"ELIZABETH PL (DRURY)","South Rural"]
[22299,"ELIZABETH PL (MAIRANGI BAY)","North Urban East"]
[10272,"ELIZABETH POINT RD","North Rural"]
[30418,"ELIZABETH ST (FREEMANS BAY)","Central"]
[33542,"ELIZABETH ST (MT EDEN)","Central"]
[10273,"ELIZABETH ST (OREWA)","North Urban East"]
[51223,"ELIZABETH ST (PAKURANGA)","South East Urban"]
[60100,"ELIZABETH ST (PAPAKURA)","South West Urban"]
[10274,"ELIZABETH ST 2 (WARKWORTH)","North Rural"]
[53789,"ELIZABETH ST-CAROLE CRES","South East Urban"]
[30417,"ELIZABETHAN GARDENS","Central East"]
[47292,"ELKSTONE PL","West"]
[48119,"ELKSTONE PL WWAY","West"]
[22300,"ELLANGOWAN RD","North Urban East"]
[20268,"ELLEN AVE","North Urban West"]
[15010,"ELLEN AVE/COBBLESTONE LN CYWAY","North Urban West"]
[51224,"ELLEN LANE","South West Urban"]
[51225,"ELLEN ST","South West Urban"]
[11346,"ELLENBURY PL","North Urban East"]
[36050,"ELLERSLIE CRT (PVT)","Central East"]
[35639,"ELLERSLIE GARDENS (PVT)","Central East"]
[34849,"ELLERSLIE INTERCHANGE (EASTBOUND)","Central East"]
[34857,"ELLERSLIE INTERCHANGE (WESTBOUND)","Central East"]
[33543,"ELLERSLIE PANMURE HIGHWAY","Central East"]
[33544,"ELLERSLIE PARK RD","Central East"]
[35281,"ELLERSLIE RACECOURSE DR","Central East"]
[33545,"ELLERTON RD","Central"]
[51226,"ELLESMERE CRES","South East Urban"]
[70169,"ELLETT RD","South Rural"]
[70316,"ELLETT RD WEST","South Rural"]
[20387,"ELLICE RD","North Urban West"]
[20467,"ELLIOT AVE","North Urban West"]
[23014,"ELLIOT ROSE AVE","North Urban West"]
[51227,"ELLIOT ST (HOWICK)","South East Urban"]
[60101,"ELLIOT ST (PAPAKURA)","South West Urban"]
[10275,"ELLIOT ST (RIVERHEAD)","North Rural"]
[30420,"ELLIOTT ST","Central"]
[33546,"ELLIS AVE","Central"]
[51228,"ELLISON PL","South East Urban"]
[10276,"ELLISTON CRES","North Urban East"]
[71448,"ELLIVANI RISE","South Rural"]
[24064,"ELM HAVEN (PVT)","North Urban West"]
[52959,"ELM PARK SCHOOL ACCESSWAY (PVT)","South East Urban"]
[30421,"ELM ST (AVONDALE)","West"]
[70878,"ELM ST (WAIUKU)","South Rural"]
[51229,"ELMDON ST","South West Urban"]
[15570,"ELMDON ST/MOYLE PARK CYWAY","South West Urban"]
[22301,"ELMIRA PL","North Urban East"]
[20643,"ELMORE RD","North Urban West"]
[30422,"ELMSTONE AVE","Central East"]
[51230,"ELMWOOD PL","South West Urban"]
[53016,"ELOISE PL","South West Urban"]
[33547,"ELPHINSTONE AVE","Central"]
[60315,"ELRITA PL","South West Urban"]
[53114,"ELS CLOSE","South East Urban"]
[51231,"ELSA LANE","South West Urban"]
[51232,"ELSEMORE CRES (PVT)","South East Urban"]
[22665,"ELSFIELD PL","North Urban East"]
[71305,"ELSIE DR","South Rural"]
[60102,"ELSIE MORTON PL","South West Urban"]
[51233,"ELSTED PL","South West Urban"]
[30423,"ELSTREE AVE","Central East"]
[30424,"ELTHAM RD","Central East"]
[40918,"ELVIRA PL","West"]
[47302,"ELWARTH WAY","West"]
[33548,"ELWOOD PL","Central East"]
[53412,"ELWYN CLOSE","South East Urban"]
[30425,"ELY AVE","Central East"]
[20514,"EMBASSY PL","North Urban West"]
[52936,"EMBLETON CLOSE","South East Urban"]
[51234,"EMBLING PL","South East Urban"]
[80230,"EMELL ST","North Urban East"]
[33549,"EMERALD ST","Central"]
[22762,"EMERALD WAY","North Urban West"]
[24054,"EMERGENCY CIRCLE (PVT)","North Urban East"]
[51235,"EMERSON RD","South West Urban"]
[53791,"EMERSON RD-RAPSON RD","South West Urban"]
[30426,"EMERSON ST","Central East"]
[20473,"EMERY GR","North Urban West"]
[35997,"EMILIA NIXON LANE","Central East"]
[20757,"EMILY LANE","North Urban West"]
[30427,"EMILY PL","Central"]
[34971,"EMILY PL LOOP","Central"]
[20500,"EMIRAU PL","North Urban West"]
[22756,"EMLYN PL","North Urban East"]
[52895,"EMMA CRT","South East Urban"]
[15697,"EMMA CRT LINK CYWAY","South East Urban"]
[60501,"EMMERDALE AVE","South West Urban"]
[30428,"EMMETT ST","Central"]
[60314,"EMORY DR","South West Urban"]
[15411,"EMORY DR/ESPLANADE NTH LINK CYWAY","South West Urban"]
[15410,"EMORY DR/ESPLANADE STH LINK CYWAY","South West Urban"]
[15412,"EMORY DR/WALTER STREVENS DR CYWAY","South West Urban"]
[33550,"EMPIRE AVE","Hauraki Islands"]
[22119,"EMPIRE RD (DEVONPORT)","North Urban East"]
[30429,"EMPIRE RD (EPSOM)","Central"]
[10277,"EMPIRE RD (OREWA)","North Urban East"]
[11392,"EMPRESSA HEIGHTS","North Rural"]
[71293,"EMSWORTH CRT","South Rural"]
[53033,"EMYVALIE PL","South East Urban"]
[15689,"EMYVALIE PL LINK CYWAY","South East Urban"]
[30430,"ENDEAVOUR ST","West"]
[40917,"ENDERBY DR","West"]
[11408,"ENDSLEY RISE","North Rural"]
[51236,"ENDYMION PL","South East Urban"]
[15783,"ENDYMION PL CYWAY (RP66)","South East Urban"]
[54670,"ENDYMION PL HAMMERHEAD","South East Urban"]
[15803,"ENDYMION PL SOUTH LINK CYWAY","South East Urban"]
[33552,"ENFIELD ST","Central"]
[30431,"ENGLAND ST (NORTH)","Central"]
[31546,"ENGLAND ST (SOUTH)","Central"]
[22915,"ENGLISH OAK DR","North Urban West"]
[51237,"ENID PL","South West Urban"]
[47269,"ENNERDALE LANE","West"]
[51238,"ENNIS AVE","South East Urban"]
[33553,"ENNISMORE RD","Central"]
[20551,"ENSIGN RD","North Urban West"]
[51239,"ENSOR PL","South West Urban"]
[47316,"ENTERPRISE DR","West"]
[22052,"ENTERPRISE ST","North Urban West"]
[30432,"ENTRICAN AVE","Central East"]
[35764,"ENTRICAN/RANGITOTO WWAY (RP455)","Central East"]
[52869,"ENUAMANU RD","South West Urban"]
[54630,"ENUAMANU RD CARPARK (RP125 LHS)","South West Urban"]
[40916,"EPPING RD","West"]
[48190,"EPPING RD WWAY","West"]
[30434,"EPPING ST","Central East"]
[35866,"EPPING/HEATHERBANK WWAY (RP307)","Central East"]
[35865,"EPPING/LINE WWAY (RP147 RHS)","Central East"]
[30433,"EPSOM AVE","Central"]
[33554,"EPWORTH AVE","Central"]
[71552,"EQUUS LANE","South Rural"]
[40915,"ERANGI PL","West"]
[60604,"ERCEG WAY","South West Urban"]
[60605,"ERCEG WAY HAMMERHEAD","South West Urban"]
[22055,"EREWHON PL","North Urban West"]
[51240,"ERIC BAKER PL","South West Urban"]
[80677,"ERIC FARLEY DRIVE","North Rural"]
[80592,"ERIC GIFFORD DR","West"]
[30435,"ERIC PATON WAY","Central East"]
[20181,"ERIC PRICE AVE","North Urban East"]
[53151,"ERIC RUSH PL","South East Urban"]
[53587,"ERICA RD (EAST TAMAKI)","South East Urban"]
[20347,"ERICA RD (SUNNYNOOK)","North Urban East"]
[53642,"ERICA/KESTEV RAB","South East Urban"]
[30436,"ERIMA AVE","Central East"]
[32972,"ERIN ST","Central"]
[53325,"ERNE CRES","South East Urban"]
[71350,"ERNEST GEORGE DR","South Rural"]
[71420,"ERNEST SHACKLETON PL","South Rural"]
[21022,"ERNIE MAYS ST","North Urban West"]
[33556,"ERNIE PINCHES ST","Central"]
[36095,"ERNIE PINCHES/HILLSBO CYWAY","Central"]
[53152,"ERONI CLARKE CLOSE","South East Urban"]
[22931,"ERRIGAL CLOSE","North Urban West"]
[33557,"ERSON AVE","Central East"]
[33558,"ERUA RD","Hauraki Islands"]
[51241,"ERVINE PL","South East Urban"]
[10278,"ESCOTT RD","North Rural"]
[22053,"ESKDALE RD","North Urban West"]
[51242,"ESKE PL","South East Urban"]
[10279,"ESME GR","North Rural"]
[30437,"ESMERALDA AVE","West"]
[20003,"ESMONDE RD","North Urban East"]
[23043,"ESMONDE RD BUS RAMP","North Urban East"]
[22516,"ESMONDE RD DEC (EAST)","North Urban East"]
[80441,"ESMONDE RD DEC (WEST)","North Urban West"]
[22517,"ESMONDE RD INC (EAST)","North Urban East"]
[80442,"ESMONDE RD INC (WEST)","North Urban West"]
[51243,"ESPADA PL","South West Urban"]
[47257,"ESPALIER DR","West"]
[41075,"ESPALIER DR LOOP","West"]
[48109,"ESPALIER DRV WWAY","West"]
[30438,"ESPERANCE RD","Central East"]
[35786,"ESPERANCE/MT TAYLOR WWAY (RP458)","Central East"]
[51244,"ESPERANTO RD","South West Urban"]
[35067,"ESPLANADE (PVT)","Hauraki Islands"]
[34711,"ESPLANADE RD","Central"]
[34898,"ESPLANADE RD LLA (#37 - BELLEVUE)","Central"]
[15406,"ESPLANADE RESERVE EAST LINK CYWAY","South West Urban"]
[33559,"ESSEX RD","Central"]
[35939,"ESSEX RD CARPARK (RP68 LHS)","Central"]
[40914,"ESSEX ST","West"]
[51245,"ESSINGTON PL","South East Urban"]
[33560,"ESSLIN RD","Hauraki Islands"]
[41057,"ESTATE WAY","West"]
[51246,"ESTELLE PL","South East Urban"]
[15588,"ESTELLE PL LINK CYWAY","South East Urban"]
[11169,"ESTHER PL","North Urban East"]
[11597,"ESTUARY CLOSE","North Rural"]
[51247,"ESTUARY RD (MANUREWA)","South West Urban"]
[54392,"ESTUARY RD CARPARK (RP 35 LHS)","South West Urban"]
[71196,"ESTUARY VIEW RD","South Rural"]
[51248,"ESTUARY VIEWS (SHELLY PARK)","South East Urban"]
[51249,"ETERNA PL","South West Urban"]
[33561,"ETHEL ST","Central"]
[51250,"ETHEREGE PL","South East Urban"]
[51251,"ETHERTON DR","South West Urban"]
[15717,"ETHERTON DR/SETTLERS COVE CYWAY","South West Urban"]
[22045,"ETON AVE","North Urban East"]
[60515,"ETTERICK LANE","South West Urban"]
[51252,"ETTRICK PL","South West Urban"]
[52962,"ETWALL CRT","South East Urban"]
[22054,"EUCALYPTUS PL","North Urban West"]
[20490,"EUGEN PL","North Urban West"]
[51253,"EUGENIA RISE","South West Urban"]
[54320,"EUGENIA/EVERGLADE RAB","South West Urban"]
[51254,"EULOGY PL","South West Urban"]
[33562,"EUSTON RD","Central"]
[20109,"EVAN ST","North Urban East"]
[60318,"EVANDA CRES","South West Urban"]
[30439,"EVANDALE ST","Central East"]
[35860,"EVANDALE/HEATHERBANK WWAY (RP116)","Central East"]
[71362,"EVANS CRT","South Rural"]
[60103,"EVANS PL","South West Urban"]
[40054,"EVANS RD","West"]
[51255,"EVANS RD (MANUREWA)","South West Urban"]
[10280,"EVANS RD (PARKHURST)","North Rural"]
[51040,"EVELINA LANE","South East Urban"]
[20267,"EVELYN PL","North Urban West"]
[51256,"EVELYN RD","South East Urban"]
[80535,"EVELYN ST","North Rural"]
[30440,"EVELYN ST (EDEN TERRACE)","Central"]
[52759,"EVELYN ST (PAPATOETOE)","South West Urban"]
[10281,"EVERARD AVE","North Urban East"]
[11284,"EVERARD AVE 34 - 36","North Urban East"]
[22103,"EVEREST ST","North Urban East"]
[51258,"EVERGLADE DR","South West Urban"]
[41306,"EVERGREEN RISE","West"]
[51260,"EVERINGHAM PL","South East Urban"]
[51261,"EVERITT RD","South West Urban"]
[54200,"EVERITT RD CARPARK (RP29 RHS)","South West Urban"]
[54095,"EVERITT RD SERVICE LANE (RP49 RHS)","South West Urban"]
[53306,"EVERLEA PL","South West Urban"]
[20091,"EVERSLEIGH RD","North Urban East"]
[36018,"EVERTON PL (PVT)","Central East"]
[10282,"EVES RD","North Rural"]
[30441,"EVESHAM AVE","Central East"]
[35791,"EVESHAM/ATHLONE WWAY (RP144 RHS)","Central East"]
[51262,"EWART RD","South West Urban"]
[51263,"EWBANK PL","South West Urban"]
[53793,"EWBANK PL-FEASEGATE ST","South West Urban"]
[20592,"EWEN ALISON AVE","North Urban East"]
[71281,"EWEN PL","South Rural"]
[20136,"EWEN ST","North Urban East"]
[33564,"EWENSON AVE","Central East"]
[51264,"EWHURST PL","South West Urban"]
[40913,"EWING RD (WAITAKERE)","West"]
[33565,"EWINGTON AVE","Central"]
[22745,"EXCELSIA PL","North Urban West"]
[22746,"EXCELSIA PL HAMMERHEAD","North Urban West"]
[11329,"EXCELSIOR WAY","North Rural"]
[30442,"EXCHANGE LANE (CITY)","Central"]
[22562,"EXETER PL","North Urban West"]
[33566,"EXETER RD","Central"]
[40912,"EXHIBITION DR","West"]
[35257,"EXLER PL","West"]
[35740,"EXMINISTER/DONOVAN WWAY (RP145)","West"]
[35741,"EXMINISTER/DONOVAN WWAY (RP262)","West"]
[30443,"EXMINSTER ST","West"]
[21024,"EXMOUTH RD","North Urban West"]
[22540,"EXMOUTH RD (AC.WAY)","North Urban West"]
[30444,"EXMOUTH ST","Central"]
[47332,"EXOTIC PL","West"]
[53025,"EYNSHAM CRT","South East Urban"]
[40911,"EYRE ST","West"]
[51265,"EYRES RD","South Rural"]
[33567,"FABER AVE","Central East"]
[70948,"FACTORY RD (PUKEKOHE)","South Rural"]
[10283,"FACTORY RD (WAIMAUKU)","North Rural"]
[70172,"FAHEY RD","South Rural"]
[70950,"FAIR OAKS","South Rural"]
[54040,"FAIRBAIRN PL","South East Urban"]
[40910,"FAIRBANKS PL","West"]
[33568,"FAIRBURN RD","South West Urban"]
[53070,"FAIRCHILD AVE","South West Urban"]
[22057,"FAIRCLOUGH RD","North Urban West"]
[60104,"FAIRDALE AVE","South West Urban"]
[60538,"FAIRDALE AVE LOOP","South West Urban"]
[22058,"FAIRDALE PL","North Urban West"]
[40909,"FAIRDENE AVE","West"]
[51267,"FAIREY PL","South West Urban"]
[21025,"FAIRFAX AVE (NORTHCOTE)","North Urban West"]
[33569,"FAIRFAX AVE (PENROSE)","Central East"]
[53115,"FAIRFIELD LANE","South East Urban"]
[70949,"FAIRFIELD ST","South Rural"]
[47290,"FAIRFORD AVE","West"]
[10284,"FAIRHAVEN WALK","North Urban East"]
[54117,"FAIRHILL PL","South East Urban"]
[33570,"FAIRHOLM AVE","Central"]
[30445,"FAIRLANDS AVE","Central"]
[30769,"FAIRLANDS AVE LLA (#40 - #48)","Central"]
[40908,"FAIRLEA RD","West"]
[33571,"FAIRLEIGH AVE","Central"]
[51268,"FAIRLIGHT PL","South West Urban"]
[54317,"FAIRLIGHT PL HAMMERHEAD","South West Urban"]
[24084,"FAIRMONT PL (PVT)","North Urban West"]
[40907,"FAIRMOUNT RD","West"]
[33572,"FAIRSEA PL","Central"]
[20668,"FAIRVIEW AVE (ALBANY)","North Urban West"]
[60105,"FAIRVIEW AVE (PAPAKURA)","South West Urban"]
[33573,"FAIRVIEW CRES","Hauraki Islands"]
[24055,"FAIRVIEW DR (PVT)","North Urban West"]
[33574,"FAIRVIEW RD (MT EDEN)","Central"]
[51269,"FAIRVIEW RD (PAPATOETOE)","South West Urban"]
[10285,"FAIRWAY AVE","North Urban East"]
[33575,"FAIRWAY DR","Central"]
[40058,"FAITH BULLOCK PL","West"]
[20612,"FAITH GR","North Urban West"]
[53091,"FALCARRAGH CRES","South East Urban"]
[54395,"FALCON RD","South West Urban"]
[30446,"FALCON ST","Central"]
[52952,"FALDO DR","South East Urban"]
[30447,"FALKIRK ST","West"]
[22303,"FALLOW ST","North Urban East"]
[70174,"FALLS RD (HUNUA)","South Rural"]
[40906,"FALLS RD (WAITAKERE)","West"]
[10287,"FALLS RD (WARKWORTH)","North Rural"]
[10288,"FALLS ST","North Rural"]
[52882,"FALLSBROOK LANE ROW (PVT)","South West Urban"]
[22304,"FALMOUTH ST","North Urban East"]
[51270,"FALSTAFF PL","South East Urban"]
[54662,"FALSTAFF PL CARPARK (RP164 LHS)","South East Urban"]
[15808,"FALSTAFF PL/CLYSIDE AVE CYWAY","South East Urban"]
[15809,"FALSTAFF PL/ECLIPSE PL CYWAY","South East Urban"]
[22818,"FALSTONE LANE","North Urban East"]
[30448,"FANCOURT ST","Central East"]
[30449,"FANSHAWE ST","Central"]
[31306,"FANSHAWE ST (EASTBOUND)","Central"]
[15222,"FANSHAWE ST/VICTORIA PARK LINK CYWAY (RP1120)","Central"]
[54133,"FANTAIL CRES","South Rural"]
[30450,"FARADAY ST","Central"]
[41225,"FARAM PL","West"]
[48303,"FARAM PL WWAY","West"]
[53170,"FARETI PL","South West Urban"]
[71285,"FARLEY RD","South Rural"]
[53657,"FARLEY ST","South West Urban"]
[71324,"FARM PARK RD","South Rural"]
[35657,"FARM RD (PVT)","Central"]
[52997,"FARMDALE CRT","South East Urban"]
[54441,"FARMDALE CRT HAMMERHEAD","South East Urban"]
[51272,"FARMER ST","South West Urban"]
[54591,"FARMER ST CARPARK (RP25 LHS)","South West Urban"]
[54152,"FARMER ST SERVICE LANE (RP43 LHS)","South West Urban"]
[53796,"FARMER ST-FLEMING ST","South West Urban"]
[10290,"FARMERS LIME RD","North Rural"]
[30451,"FARMHOUSE LANE","Central East"]
[51273,"FARNBOROUGH CRES","South West Urban"]
[10291,"FARNELL PL","North Urban East"]
[30452,"FARNHAM ST","Central"]
[33576,"FARNOL ST","Central"]
[40905,"FARQUHAR RD","West"]
[48127,"FARQUHAR RD WWAY","West"]
[71390,"FARQUHARSON RD","South Rural"]
[70175,"FARR RD (PAPARATA)","South Rural"]
[40904,"FARR RD (WAITAKERE)","North Urban West"]
[10292,"FARRAND RD","North Rural"]
[30453,"FARRAR ST","Central"]
[15245,"FARRAR ST/GREY LYNN PARK LINK CYWAY","Central"]
[33577,"FARRELLY AVE","Central"]
[30454,"FARRINGDON ST","Central East"]
[40903,"FARWOOD DR","West"]
[51191,"FATAFEHI PL","South West Urban"]
[40902,"FATHOM PL","West"]
[30455,"FAULDER AVE","Central"]
[21026,"FAULKNER RD","North Urban West"]
[70951,"FAUSETT AVE","South Rural"]
[70176,"FAUSETT RD","South Rural"]
[51274,"FAVONA RD","South West Urban"]
[40901,"FAWCETT RD","West"]
[40900,"FAYETTE PL","West"]
[22843,"FEARNLEY GR","North Urban West"]
[33578,"FEARON AVE","Central"]
[34850,"FEARON AVE EXTN (RP93 LHS)","Central"]
[15257,"FEARON AVE/FEARON AVE EXTN CYWAY","Central"]
[15259,"FEARON PARK CARPARK LINK CYWAY","Central"]
[51275,"FEASEGATE ST","South West Urban"]
[53797,"FEASEGATE ST-GARTH PL","South West Urban"]
[51276,"FEATHERSTON CRES","South West Urban"]
[15524,"FEATHERSTON CRES/PRESTON RD LINK CYWAY","South West Urban"]
[70177,"FEATON AVE","South Rural"]
[30456,"FEDERAL ST (NORTH)","Central"]
[31526,"FEDERAL ST (SOUTH)","Central"]
[53245,"FEENY CRES","South East Urban"]
[40899,"FELGROVE ST","West"]
[48128,"FELGROVE ST WWAY","West"]
[51277,"FELICIA PL","South West Urban"]
[20695,"FELICITY PL","North Urban West"]
[33580,"FELIX ST","Central East"]
[51278,"FELLBROOK ST","South West Urban"]
[80727,"FELLING STREET","North Urban East"]
[22059,"FELSTEAD ST","North Urban West"]
[30457,"FELTON MATHEW AVE","Central East"]
[51279,"FELTWELL PL","South West Urban"]
[30458,"FENCHURCH ST","Central East"]
[51280,"FENCIBLE DR","South East Urban"]
[54211,"FENCIBLE DR CARPARK (RP296 RHS)","South East Urban"]
[54904,"FENCIBLE DR LOWER CARPARK (RP429)","South East Urban"]
[54127,"FENCIBLE DR UPPER CARPARK (RP429)","South East Urban"]
[33581,"FENCIBLE PL","South West Urban"]
[52944,"FENCOTIE PL","South East Urban"]
[80117,"FENDALTON PL","North Urban East"]
[80228,"FENNEL CRES","North Urban East"]
[20098,"FENTHAM RD","North Urban East"]
[30459,"FENTON CIRCUS","Central East"]
[30460,"FENTON ST (EDEN TERRACE)","Central"]
[51281,"FENTON ST (PAPATOETOE)","South West Urban"]
[51282,"FENTON TCE","South East Urban"]
[20190,"FENWICK AVE","North Urban East"]
[26021,"FENWICK AVE CARPARK DP38179","North Urban East"]
[33582,"FERGUSON AVE (GREENLANE)","Central East"]
[51283,"FERGUSON RD","South West Urban"]
[54205,"FERGUSON RD CARPARK (RP807 RHS)","South West Urban"]
[15510,"FERGUSON RD PRESBYTERIAN CHURCH LINK CYWAY","South West Urban"]
[54103,"FERGUSON RD SERVICE LANE (RP803)","South West Urban"]
[15511,"FERGUSON RD SOUTH LINK CYWAY","South West Urban"]
[15519,"FERGUSON RD/CIVIL PL CYWAY","South West Urban"]
[51285,"FERGUSON ST (MANGERE)","South West Urban"]
[51284,"FERGUSON ST (MANUREWA)","South West Urban"]
[15424,"FERGUSON ST/TRIMDON ST CYWAY","South West Urban"]
[54256,"FERGUSON ST-TE MAHIA RAILWAY","South West Urban"]
[33583,"FERGUSSON AVE (SANDRINGHAM)","Central"]
[15335,"FERGUSSON AVE/FERGUSSON RESERVE CYWAY","Central"]
[53479,"FERGY CRES","South West Urban"]
[15750,"FERGY CRES LINK CYWAY","South West Urban"]
[33584,"FERN AVE","Central"]
[35795,"FERN GLEN NORTH/CHALLENGER WWAY","Central East"]
[30462,"FERN GLEN RD NORTH","Central East"]
[30477,"FERN GLEN RD SOUTH","Central East"]
[53610,"FERN PL","South Rural"]
[60106,"FERNAIG ST","South West Urban"]
[22977,"FERNBANK LANE","North Urban West"]
[40898,"FERNBIRD PL","West"]
[48282,"FERNBIRD PL WWAY","West"]
[52971,"FERNBROOK CLOSE","South East Urban"]
[30461,"FERNCROFT ST","Central"]
[10293,"FERNDALE AVE","North Rural"]
[51286,"FERNDALE DR (KAWAKAWA BAY)","South Rural"]
[10294,"FERNDALE DR (SNELLS BEACH)","North Rural"]
[54738,"FERNDALE DR EXTN","South Rural"]
[34712,"FERNDALE RD","Central East"]
[51287,"FERNDOWN AVE","South West Urban"]
[33585,"FERNER AVE","Central"]
[47164,"FERNGROVE AVE","West"]
[48201,"FERNGROVE AVE WWAY","West"]
[11613,"FERNGULLY RD","North Rural"]
[40897,"FERNHAVEN PL","West"]
[40896,"FERNHILL DR","West"]
[22802,"FERNHILL WAY","North Urban West"]
[22618,"FERNLEA RISE","North Urban West"]
[33586,"FERNLEIGH AVE (ROYAL OAK)","Central"]
[70872,"FERNLEIGH AVE (WAIUKU)","South Rural"]
[53609,"FERNLOCHE PL","South East Urban"]
[40895,"FERNTREE TCE","North Urban West"]
[20465,"FERNWOOD GR","North Urban West"]
[30480,"FERNWOOD PL","Central East"]
[40894,"FERRY PDE","North Urban West"]
[10295,"FERRY RD","North Urban East"]
[11283,"FERRY RD 27 - 35","North Urban East"]
[30481,"FERRYHILL RD","Central"]
[60268,"FETU PUPULA PL","South West Urban"]
[33588,"FICKLING AVE","Central"]
[10296,"FIDDLERS HILL RD","North Rural"]
[10297,"FIDELIS AVE","North Rural"]
[22305,"FIDELIS ST","North Urban East"]
[11218,"FIELD LANE","North Rural"]
[51288,"FIELDING CRES","South East Urban"]
[71333,"FIELDING RD (AWHITU)","South Rural"]
[60323,"FIELDING RD (DRURY)","South Rural"]
[30099,"FIELDS LANE","Central"]
[22824,"FIELDS PDE","North Urban West"]
[51289,"FIELDS RD","South West Urban"]
[51290,"FIELDSTONE CRT","South East Urban"]
[51291,"FIESTA DR","South East Urban"]
[30483,"FIFE ST","Central"]
[20114,"FIFESHIRE ST","North Urban East"]
[30484,"FIFTH AVE","Central"]
[35768,"FIFTH/FONTENOY WWAY (RP320 LHS)","Central"]
[80027,"FIG TREE LANE","North Urban East"]
[60580,"FIGARO CRES","South West Urban"]
[53057,"FIGTREE TCE","South West Urban"]
[33590,"FILGATE ST (EAST)","Central"]
[34886,"FILGATE ST (WEST)","Central"]
[53556,"FINBAR CLOSE","South East Urban"]
[53798,"FINBAR CLOSE-MULTOSE DR","South East Urban"]
[33591,"FINCH ST","Central"]
[30157,"FINCH ST LLA (#4 - #32)","Central"]
[15310,"FINCH ST/MOTORWAY LINK CYWAY","Central"]
[22306,"FINCHLEY RD","North Urban East"]
[70180,"FINDLAY RD","South Rural"]
[33592,"FINDLAY ST","Central East"]
[35888,"FINDLAY/HEWSON WWAY (RP337)","Central East"]
[15721,"FINDLAYSON AVE LINK CYWAY","South West Urban"]
[11428,"FINGAL WAY","North Urban East"]
[51292,"FINLAY PL","South West Urban"]
[53799,"FINLAY PL-BAIRDS RD","South West Urban"]
[51293,"FINLAYSON AVE","South West Urban"]
[53800,"FINLAYSON AVE-TEMPLETON PL","South West Urban"]
[53801,"FINLAYSON AVE-WAI ITI PL","South West Urban"]
[54377,"FINLAYSON/BURUNDI RAB","South West Urban"]
[40893,"FINLOW DR","West"]
[20379,"FINN PL (GLENFIELD)","North Urban West"]
[33593,"FINN PL (PANMURE)","Central East"]
[51294,"FINNERTY AVE","South East Urban"]
[54673,"FINNERTY AVE CARPARK (RP386 RHS)","South East Urban"]
[47323,"FINSBURY PL","West"]
[53030,"FINTONA PL","South East Urban"]
[15674,"FINTONA PL LINK CYWAY","South East Urban"]
[53604,"FINTRY PL","South East Urban"]
[60625,"FIORANO PL","South West Urban"]
[30485,"FIR ST","Central"]
[35746,"FIR/SAXON WWAY (RP575 LHS)","Central"]
[40892,"FIRLE PL","West"]
[70181,"FIRST AVE","South Rural"]
[22530,"FIRST AVE (DEVONPORT)","North Urban East"]
[33595,"FIRST AVE (KINGSLAND)","Central"]
[51295,"FIRST AVE (ORERE POINT)","South Rural"]
[33594,"FIRST AVE (WAIHEKE)","Hauraki Islands"]
[35026,"FIRST AVE EXTN","Hauraki Islands"]
[51296,"FIRST VIEW AVE","South Rural"]
[51297,"FIRTH CRES","South West Urban"]
[53802,"FIRTH CRES-FIRTH CRES","South West Urban"]
[22307,"FIRTH RD (BROWNS BAY)","North Urban East"]
[30486,"FIRTH RD (GREY LYNN)","Central"]
[60319,"FIRTH ST","South West Urban"]
[33596,"FISHER CRES (MT WELLINGTON)","Central East"]
[51298,"FISHER CRES (OTARA)","South West Urban"]
[15518,"FISHER CRES/CAPSTICK RD CYWAY","South West Urban"]
[15517,"FISHER CRES/EAST TAMAKI PRIMARY SCHOOL CYWAY","South West Urban"]
[51299,"FISHER PDE","South East Urban"]
[15582,"FISHER PDE LINK CYWAY (RP1040)","South East Urban"]
[15581,"FISHER PDE LINK CYWAY (RP1425)","South East Urban"]
[15585,"FISHER PDE LINK CYWAY (RP572)","South East Urban"]
[15584,"FISHER PDE LINK CYWAY (RP795)","South East Urban"]
[53804,"FISHER PDE-LILIAN PL","South East Urban"]
[35674,"FISHER POINT DR (PVT)","Central"]
[34840,"FISHER RD (WAIHEKE)","Hauraki Islands"]
[70183,"FISHER RD (WAIUKU)","South Rural"]
[33597,"FISHER ST","Hauraki Islands"]
[10298,"FISHERMANS COVE","North Urban East"]
[30487,"FISHERTON ST","Central"]
[10299,"FISHLOCK RD","North Rural"]
[53439,"FITCHBURG PL","South West Urban"]
[60322,"FITZGERALD RD (DRURY)","South Rural"]
[33599,"FITZGERALD RD (MT WELLINGTON)","Central East"]
[10300,"FITZGERALD RD (TAPORA)","North Rural"]
[40891,"FITZHERBERT AVE","West"]
[48278,"FITZHERBERT AVE WWAY","West"]
[22060,"FITZPATRICK PL","North Urban West"]
[51300,"FITZPATRICK RD","South Rural"]
[51301,"FITZROY ST (PAPATOETOE)","South West Urban"]
[30488,"FITZROY ST (PONSONBY)","Central"]
[54005,"FITZROY ST-PUHINUI RD #1","South West Urban"]
[54006,"FITZROY ST-PUHINUI RD #2","South West Urban"]
[54499,"FITZROY/YORK RAB","South West Urban"]
[40890,"FITZWATER PL","West"]
[22308,"FITZWILLIAM DR","North Urban East"]
[40889,"FLAGSTAFF PL","West"]
[22010,"FLAGSTAFF TCE","North Urban East"]
[10302,"FLAGSTAFFE RD","North Rural"]
[51302,"FLAMINGO CRT","South West Urban"]
[60321,"FLANAGAN RD","South Rural"]
[30489,"FLANDERS ST","Central East"]
[40888,"FLANSHAW RD","West"]
[15128,"FLANSHAW RD R.O.W LINK CYWAY","West"]
[51303,"FLAT BUSH RD","South West Urban"]
[54201,"FLAT BUSH RD CARPARK (RP971 LHS)","South West Urban"]
[51304,"FLAT BUSH SCHOOL RD","South East Urban"]
[51195,"FLAT BUSH SCHOOL RD SERVICE LANE (RP1285 LHS)","South East Urban"]
[54597,"FLAT BUSH SCHOOL/BROOKVIEW RAB","South East Urban"]
[40887,"FLAUNTY PL","West"]
[11539,"FLAVEL DR","North Urban East"]
[22309,"FLAVIA CLOSE","North Urban East"]
[33601,"FLAVIA PL","Central"]
[31703,"FLAX PL","Central East"]
[22061,"FLAXDALE ST","North Urban West"]
[70187,"FLAY RD","South Rural"]
[20654,"FLEET ST (DEVONPORT)","North Urban East"]
[30490,"FLEET ST (EDEN TERRACE/NORTH)","Central"]
[31640,"FLEET ST (EDEN TERRACE/SOUTH)","Central"]
[71203,"FLEET ST (GLENBROOK BEACH)","South Rural"]
[26005,"FLEET ST CARPARK EAST","North Urban East"]
[24091,"FLEET TCE (PVT)","North Urban East"]
[47256,"FLEETWOOD DR","West"]
[33602,"FLEMING ST","Central East"]
[51305,"FLEMING ST (MANGERE)","South West Urban"]
[51306,"FLEMING ST (MANUREWA)","South West Urban"]
[53807,"FLEMING ST-VINE ST","South West Urban"]
[11547,"FLETCHER LANE","North Rural"]
[10303,"FLETCHER RD","North Rural"]
[33603,"FLETCHER ST","Central"]
[51307,"FLEUR AVE","South East Urban"]
[60417,"FLEUR RD","South West Urban"]
[10304,"FLEXMAN PL","North Urban East"]
[51308,"FLINDERS PL","South West Urban"]
[53808,"FLINDERS PL-DESMOND PL","South West Urban"]
[35962,"FLINT WAY","Central East"]
[54192,"FLINTRIDGE DR","South East Urban"]
[15728,"FLINTRIDGE DR LINK CYWAY (RP113)","South East Urban"]
[15729,"FLINTRIDGE DR LINK CYWAY (RP196)","South East Urban"]
[15727,"FLINTRIDGE DR/SALFORD CRES CYWAY","South East Urban"]
[53000,"FLORA PL","South West Urban"]
[10305,"FLORENCE AVE","North Urban East"]
[11323,"FLORENCE AVE (EAST)","North Urban East"]
[33604,"FLORENCE DALY PL","Central"]
[30491,"FLORIDA PL","Central East"]
[10307,"FLOUNDER POINT RD","North Urban East"]
[80639,"FLOUNDER RD","North Urban West"]
[30492,"FLOWER ST","Central"]
[80542,"FLOYD RD","North Rural"]
[22811,"FLOYDS LANE","North Urban West"]
[71546,"FLYNN RD","South Rural"]
[22062,"FLYNN ST","North Urban West"]
[33605,"FOCH AVE","Central"]
[22310,"FOLEY PL","North Urban East"]
[10308,"FOLEY QUARRY RD","North Rural"]
[22311,"FOLKSTONE ST","North Urban East"]
[80566,"FONG RD","South East Urban"]
[54230,"FONO CRES","South West Urban"]
[30493,"FONTENOY ST","Central"]
[30494,"FONTEYN ST","West"]
[34900,"FOOTBALL RD","Central"]
[33606,"FOOTE ST","Central"]
[47285,"FOOTHILLS LANE","West"]
[52948,"FOOTWIDE PL","South West Urban"]
[80665,"FORBES MCCAMMON DRIVE","West"]
[51309,"FORBES RD","South West Urban"]
[54640,"FORBES RD CARPARK (RP20 RHS)","South West Urban"]
[33607,"FORBES ST","Central East"]
[51310,"FORBURY PL","South West Urban"]
[22063,"FORDHAM ST","North Urban West"]
[51311,"FORDYCE AVE","South East Urban"]
[53809,"FORDYCE AVE-ROADLEY AVE","South East Urban"]
[10309,"FORDYCE RD (PARAKAI)","North Rural"]
[10310,"FORDYCE RD 2 (TAUHOA)","North Rural"]
[10311,"FOREST GLEN","North Urban East"]
[40885,"FOREST HILL RD","West"]
[40886,"FOREST HILL/PINE RAB","West"]
[10312,"FORESTRY RD (RIVERHEAD)","North Rural"]
[10313,"FORESTRY RD 2 (WAITOKI)","North Rural"]
[30495,"FORFAR RD","Central East"]
[10314,"FORGE RD","North Urban East"]
[35563,"FORGE WAY","Central East"]
[10315,"FORK RD","North Rural"]
[30496,"FORMBY AVE","Central"]
[35585,"FORMOSA CRT (PVT)","Central East"]
[36051,"FORMOSA GARDEN (PVT)","South Rural"]
[20028,"FORREST HILL RD","North Urban East"]
[40884,"FORSTER PL","West"]
[40883,"FORSYTHE PL","West"]
[48284,"FORSYTHE PL WWAY","West"]
[30497,"FORT LANE (PVT)","Central"]
[33608,"FORT RICHARD RD","South West Urban"]
[30498,"FORT ST","Central"]
[51312,"FORTUNES RD","South East Urban"]
[54540,"FORTUNES/PRINCE REGENT RAB","South East Urban"]
[51313,"FORTYFOOT LANE","South East Urban"]
[40882,"FOSTER AVE","West"]
[40881,"FOSTER AVE HAMMERHEAD","West"]
[10316,"FOSTER CRES","North Rural"]
[11614,"FOSTER CRES  WWAY- SNELLS BEACH","North Rural"]
[51314,"FOSTER PL","South West Urban"]
[10317,"FOSTER RD","North Rural"]
[47358,"FOUNDATION PL","West"]
[10318,"FOUNDRY RD","North Urban East"]
[60003,"FOUNTAIN AVE (EASTBOUND)","South West Urban"]
[60609,"FOUNTAIN AVE (WESTBOUND)","South West Urban"]
[71402,"FOUR OAKS PL","South Rural"]
[51315,"FOUR TREES","South East Urban"]
[33609,"FOURTH AVE (KINGSLAND)","Central"]
[33610,"FOURTH AVE (WAIHEKE)","Hauraki Islands"]
[51316,"FOURTH VIEW AVE","South Rural"]
[40880,"FOWEY AVE","West"]
[33611,"FOWLDS AVE","Central"]
[30097,"FOWLDS/HAVERSTOCK RAB","Central"]
[10319,"FOWLER ACCESS RD","North Rural"]
[33612,"FOWLER AVE","Central"]
[21027,"FOWLER ST","North Urban West"]
[30499,"FOX ST","Central"]
[60324,"FOXBRIDGE LANE","South West Urban"]
[15409,"FOXBRIDGE LN LINK CYWAY","South West Urban"]
[51317,"FOXLAW ST","South West Urban"]
[52991,"FOXLEY PL","South East Urban"]
[70191,"FOY RD","South Rural"]
[40879,"FOYLE PL","West"]
[60325,"FRAMALDA PL","South West Urban"]
[35920,"FRAN ANDREWS DR (PVT)","West"]
[70856,"FRANCE ST","South Rural"]
[70254,"FRANCE ST BUS LOOP (RP156 LHS)","South Rural"]
[30500,"FRANCE ST SOUTH","Central"]
[71205,"FRANCES PL","South Rural"]
[51318,"FRANCES ST","South West Urban"]
[53810,"FRANCES ST-JUTLAND RD","South West Urban"]
[41338,"FRANCESCA PL","North Urban West"]
[10320,"FRANCIS AVE","North Urban East"]
[30502,"FRANCIS CURTIS AVE","West"]
[11548,"FRANCIS PL","North Rural"]
[33617,"FRANCIS RYAN CLOSE","Central"]
[11440,"FRANCIS SKINNER PL","North Urban East"]
[30501,"FRANCIS ST (GREY LYNN)","Central"]
[20116,"FRANCIS ST (HAURAKI)","North Urban East"]
[53253,"FRANCO LANE","South East Urban"]
[51319,"FRANGIPANI AVE","South West Urban"]
[15650,"FRANGIPANI AVE/MCQUARRIE AVE CYWAY","South West Urban"]
[15659,"FRANGIPANI AVE/SUNNINGDALE ST CYWAY","South West Urban"]
[51320,"FRANICH ST","South West Urban"]
[54198,"FRANICH ST CARPARK (RP213 LHS)","South West Urban"]
[54093,"FRANICH ST SERVICE LANE (RP196 LHS)","South West Urban"]
[53153,"FRANK BUNCE GR","South East Urban"]
[40878,"FRANK EVANS PL","West"]
[33619,"FRANK GREY PL","South West Urban"]
[70952,"FRANK HEWITT ST","South Rural"]
[71401,"FRANK KNIGHT PL","South Rural"]
[80664,"FRANK NEWTON ROAD","West"]
[51321,"FRANK NOBILO DR","South East Urban"]
[51322,"FRANK PL","South West Urban"]
[33618,"FRANK ST","Hauraki Islands"]
[51323,"FRANKLIN AVE","South West Urban"]
[30503,"FRANKLIN RD (FREEMANS BAY)","Central"]
[70953,"FRANKLIN RD (PUKEKOHE)","South Rural"]
[51324,"FRANKLYNE RD","South West Urban"]
[15601,"FRANKLYNE RD LINK CYWAY (RP569)","South West Urban"]
[15602,"FRANKLYNE RD/JOHNSTONES CYWAY (RP396)","South West Urban"]
[53316,"FRANSHELL CRES","South East Urban"]
[15478,"FRANSHELL CRES/LILYBANK CRES CYWAY","South East Urban"]
[21028,"FRASER AVE","North Urban West"]
[22511,"FRASER RD (DEVONPORT)","North Urban East"]
[34919,"FRASER RD (MT WELLINGTON)","Central East"]
[51325,"FRASER RD (PAPATOETOE)","South West Urban"]
[22512,"FRASER RD HAMMERHEAD","North Urban East"]
[53811,"FRASER RD-ROSE RD","South West Urban"]
[20195,"FRATER AVE","North Urban East"]
[51326,"FRATLEY AVE","South East Urban"]
[53812,"FRATLEY AVE-MELISSA PL","South East Urban"]
[51327,"FRED LADD WAY (AIRPORT)","South West Urban"]
[40451,"FRED TAYLOR DR","West"]
[41324,"FRED TAYLOR/DON BUCK RAB","West"]
[20004,"FRED THOMAS DR","North Urban East"]
[33621,"FRED WOODWARD PL","Central"]
[31663,"FRED WOODWARD PL EXT #1 (RP100 RHS)","Central"]
[31664,"FRED WOODWARD PL EXT #2 (RP107 LHS)","Central"]
[52872,"FREDA PL","South West Urban"]
[34713,"FREDERICK GREEN PL (PVT)","Central"]
[53284,"FREDERICK REECE DR","South West Urban"]
[33622,"FREDERICK ST (HILLSBOROUGH)","Central"]
[31628,"FREDERICK/QUEENSTOWN RAB","Central"]
[80509,"FREEDOM LANE","South Rural"]
[60107,"FREELANCE TCE","South West Urban"]
[33623,"FREELAND AVE","Central"]
[53020,"FREEMAN WAY  (PVT)","South West Urban"]
[30504,"FREEMONT ST","Central"]
[35755,"FREEMONT/BRIGHTON WWAY (RP158)","Central"]
[33624,"FREER ST","Central"]
[47096,"FREESTONE PL","West"]
[47165,"FREESTONE PL EXTN","West"]
[51328,"FREIGHT PL","South West Urban"]
[52818,"FREMANTLE PL","South East Urban"]
[30505,"FREMLIN PL","West"]
[33625,"FRENCH RD","Hauraki Islands"]
[33084,"FRENCH ST (PVT)","Central"]
[47314,"FRENZ DR","West"]
[11508,"FRESHFIELDS RD","North Rural"]
[51329,"FRESHNEY PL","South West Urban"]
[53813,"FRESHNEY PL-GREAT SOUTH RD","South West Urban"]
[47097,"FRESIL LANE","West"]
[22312,"FREYA PL","North Urban East"]
[51330,"FREYBERG AVE (PAPATOETOE)","South West Urban"]
[33626,"FREYBERG AVE (SANDRINGHAM)","Central"]
[53814,"FREYBERG AVE-BALANCE AVE","South West Urban"]
[70954,"FREYBERG CRES","South Rural"]
[30756,"FREYBERG PL (AUCKLAND)","Central"]
[51331,"FREYBERG PL (HOWICK)","South East Urban"]
[53515,"FRIAR CLOSE","South East Urban"]
[51332,"FRIEDLANDERS RD","South West Urban"]
[51333,"FRIESIAN DR","South West Urban"]
[20188,"FRIESTON RD","North Urban East"]
[22064,"FRIZELL ST","North Urban West"]
[51334,"FROBISHER WAY","South West Urban"]
[24050,"FRONT AVE (PVT)","North Urban East"]
[41226,"FROSSES PL","West"]
[10322,"FROST RD (DAIRY FLAT)","North Rural"]
[33629,"FROST RD (THREE KINGS)","Central"]
[10323,"FROST RD 2 (MATHESON BAY)","North Rural"]
[35841,"FROST/CARR RAB","Central"]
[31659,"FROST/MOTORWAY OVERBRIDGE CYWAY","Central"]
[40877,"FROSTBITE PL","West"]
[80486,"FRUITLANDS RD","North Rural"]
[40066,"FRUITVALE RD","West"]
[22065,"FUCHSIA PL","North Urban West"]
[48166,"FULLER LANE WWAY","West"]
[10324,"FULLER RD","North Rural"]
[33630,"FULLJAMES AVE","Central"]
[22781,"FULMAR WAY","North Urban West"]
[60108,"FULMEN PL","South West Urban"]
[51335,"FULTON CRES","South West Urban"]
[53815,"FULTON CRES-JUKES PL","South West Urban"]
[70194,"FULTON RD","South Rural"]
[15452,"FUNNEL PL/RANGATAUA PL CYWAY","South West Urban"]
[51336,"FUNNELL PL","South West Urban"]
[11366,"FURNACE PL","North Urban East"]
[35573,"FURNEAUX WAY (PVT)","Central"]
[70195,"FURNISS RD","South Rural"]
[24067,"FUSCHIA LANE (PVT)","North Urban West"]
[54024,"FUSION RD","South East Urban"]
[51337,"FYFE AVE","South West Urban"]
[31699,"FYNES AVE","Central East"]
[33631,"FYVIE AVE","Central"]
[70284,"G.IRWIN RD","South Rural"]
[33632,"GABADOR PL","Central East"]
[52793,"GADSBY RD","South West Urban"]
[54629,"GADSBY RD CARPARK (RP947 RHS)","South West Urban"]
[40876,"GAEDE TCE","West"]
[20738,"GAILS DR","North Urban East"]
[51338,"GAINSBOROUGH ST","South West Urban"]
[52813,"GAIRLOCH PL","South West Urban"]
[15649,"GAIRLOCH PL LINK CYWAY","South West Urban"]
[41283,"GALA PL","West"]
[30506,"GALATEA TCE","Central"]
[30507,"GALATOS ST","Central"]
[22313,"GALAXY DR","North Urban East"]
[80028,"GALBRAITH GREENS (NORTH)","North Urban East"]
[80035,"GALBRAITH GREENS (SOUTH)","North Urban East"]
[33634,"GALBRAITH ST","Central"]
[60109,"GALILEE AVE","South West Urban"]
[70196,"GALLAGHER RD","South Rural"]
[52747,"GALLAHER ST","South West Urban"]
[80388,"GALLANTRY CRES","South West Urban"]
[40875,"GALLONY AVE","West"]
[51340,"GALLOWAY CRES","South East Urban"]
[15574,"GALLOWAY CRES LINK CYWAY","South East Urban"]
[71323,"GALLOWAY RD","South Rural"]
[54194,"GALORA CLOSE","South East Urban"]
[51341,"GALSWORTHY PL","South East Urban"]
[51342,"GALVAN AVE","South East Urban"]
[31697,"GALWAY BAY TCE","Central East"]
[31523,"GALWAY ST (CITY/EAST)","Central"]
[31524,"GALWAY ST (CITY/MIDDLE)","Central"]
[30508,"GALWAY ST (CITY/WEST)","Central"]
[33635,"GALWAY ST (ONEHUNGA)","Central East"]
[51343,"GAMBARE PL","South West Urban"]
[33636,"GAMBIA PL","Central East"]
[60110,"GAME PL","South West Urban"]
[60653,"GAME PL HAMMERHEAD (NORTH)","South West Urban"]
[60540,"GAME PL HAMMERHEAD (SOUTH)","South West Urban"]
[40874,"GANE LANE","West"]
[51344,"GANGES AVE","South West Urban"]
[31698,"GANLEY TCE","Central East"]
[22314,"GANNET POINT","North Urban East"]
[51345,"GANYMEDE PL","South East Urban"]
[54669,"GANYMEDE PL HAMMERHEAD","South East Urban"]
[70197,"GAP RD","South Rural"]
[71558,"GAP RD CARPARK (RP185 RHS)","South Rural"]
[22315,"GARADICE RD","North Urban East"]
[41227,"GARCIA PL","West"]
[22889,"GARDEN LANE","North Urban East"]
[33637,"GARDEN PL (PVT)","Central"]
[33639,"GARDEN RD (GREAT BARRIER)","Hauraki Islands"]
[40873,"GARDEN RD (PIHA)","West"]
[30509,"GARDEN RD (REMUERA)","Central East"]
[31586,"GARDEN RD HLA (#17 - #19)","Central East"]
[20658,"GARDEN TCE (DEVONPORT)","North Urban East"]
[70955,"GARDEN TCE (PUKEKOHE)","South Rural"]
[24068,"GARDENIA GR (ALBANY) (PVT)","North Urban West"]
[51346,"GARDENIA GR (PAKURANGA)","South East Urban"]
[53816,"GARDENIA GR-LOLOMA DR","South East Urban"]
[51347,"GARDINER GR","South West Urban"]
[40075,"GARDNER AVE","West"]
[48024,"GARDNER AVE WWAY","West"]
[33640,"GARDNER RD","Central"]
[60334,"GARDONE TCE","South West Urban"]
[15757,"GARDONE TCE/KEYWELLA DR CYWAY","South West Urban"]
[40171,"GARELJA RD","West"]
[80593,"GARELJA RD (WESTGATE)","West"]
[15138,"GARELJA RD LINK CYWAY","West"]
[10326,"GARFIELD RD (HVILLE)","North Rural"]
[30510,"GARFIELD ST","Central"]
[35987,"GARIN WAY","Central East"]
[33641,"GARLAND RD (GREENLANE)","Central East"]
[20229,"GARMONS WAY","North Urban East"]
[20509,"GARNER PL","North Urban West"]
[30511,"GARNET RD","Central"]
[30474,"GARNET/MEOLA RAB","Central"]
[33644,"GARRATT RD","Hauraki Islands"]
[51348,"GARRETT PL","South West Urban"]
[33643,"GARRISON AVE","Central"]
[33646,"GARRY RD","Central"]
[33647,"GARSIDE PL","Central East"]
[51349,"GARTH PL","South West Urban"]
[40872,"GARTON DR","West"]
[41163,"GARTON/ARDE RAB","West"]
[47124,"GARTON/BREENAGH RAB","West"]
[41388,"GARTON/BROADFIELD RAB","West"]
[41164,"GARTON/FROSSES RAB","West"]
[51350,"GARUS AVE","South West Urban"]
[54583,"GARUS AVE CARPARK (RP17 RHS)","South West Urban"]
[70198,"GARVIE RD","South Rural"]
[10329,"GATFIELD RD","North Rural"]
[60333,"GATLAND RD","South West Urban"]
[22069,"GATMAN ST","North Urban West"]
[30512,"GAUNT ST","Central"]
[33648,"GAVIN ST","Central East"]
[34944,"GAVIN ST HLA (#20 - #26)","Central East"]
[80050,"GAVINIKE PL","North Rural"]
[51351,"GAYE CRES","South West Urban"]
[60111,"GAYLANDS PL","South West Urban"]
[60438,"GAYLORD PL","South West Urban"]
[33649,"GAYNOR ST","Central"]
[22070,"GAZELLE AVE","North Urban West"]
[70202,"GAZELLE RD","South Rural"]
[70203,"GEARON RD","South Rural"]
[30513,"GEDDES TCE","West"]
[51352,"GEE PL","South West Urban"]
[80659,"GELDERLAND WAY","South West Urban"]
[71186,"GELLERT RD","South Rural"]
[70204,"GELLING RD","South Rural"]
[22071,"GEMINI PL","North Urban West"]
[47298,"GENDO AVE","West"]
[53300,"GENESIS PL","South East Urban"]
[30514,"GENEVA PL","West"]
[24100,"GENOA WAY (PVT)","North Urban West"]
[51354,"GEOFFREY PL","South West Urban"]
[22316,"GEOFFREY RD","North Urban East"]
[51355,"GEOFFREY ROBERTS RD (AIRPORT)","South West Urban"]
[40176,"GEORDIE ST","West"]
[71444,"GEORGE ARTHUR PL","South Rural"]
[40871,"GEORGE AVE","North Urban West"]
[54736,"GEORGE BOLT MEMORIAL DR (NTHBOUND)","South West Urban"]
[51356,"GEORGE BOLT MEMORIAL DR (STHBOUND)","South West Urban"]
[54737,"GEORGE BOLT MEMORIAL/LANDING RAB","South West Urban"]
[33653,"GEORGE BOURKE DR","Central East"]
[70205,"GEORGE CRES","South Rural"]
[22952,"GEORGE DEANE PL","North Urban West"]
[40015,"GEORGE HERRING PL","West"]
[33654,"GEORGE LAURENSON LANE","Central"]
[10331,"GEORGE LOWE PL","North Urban East"]
[10332,"GEORGE ST (MAHURANGI EAST)","North Rural"]
[51357,"GEORGE ST (MANGERE)","South West Urban"]
[33651,"GEORGE ST (MT EDEN)","Central"]
[30515,"GEORGE ST (NEWMARKET)","Central"]
[60112,"GEORGE ST (PAPAKURA)","South West Urban"]
[10333,"GEORGE ST (RIVERHEAD)","North Rural"]
[80395,"GEORGE ST (SOUTH)","North Rural"]
[33655,"GEORGE ST (WAIHEKE)","Hauraki Islands"]
[70849,"GEORGE ST (WAIUKU)","South Rural"]
[30027,"GEORGE ST EXTN (MT EDEN)","Central"]
[33652,"GEORGE TCE","Central East"]
[22870,"GEORGIA TCE","North Urban West"]
[30516,"GEORGINA ST","Central"]
[10334,"GERALD STOKES AVE","North Rural"]
[30517,"GERALDINE PL","Central East"]
[51358,"GERALDINE RD","South West Urban"]
[54758,"GERANIUM AVE","South East Urban"]
[15726,"GERANIUM AVE/ORMISTON RD CYWAY","South East Urban"]
[34714,"GERARD BEESON PL","Central East"]
[30518,"GERARD WAY","Central East"]
[35798,"GERARD/PYATT WWAY (RP185 LHS)","Central East"]
[33656,"GERBIC PL","Central"]
[41339,"GERDA PL","West"]
[53250,"GEROLDS PL","South East Urban"]
[53350,"GERONA CRES","South West Urban"]
[22317,"GERONTIUS GLADE","North Urban East"]
[10335,"GERONTIUS LANE","North Rural"]
[33658,"GERRARD ST","Central"]
[35895,"GERRARD/HAUGHEY WWAY (RP77 RHS)","Central"]
[10336,"GERVIN RD","North Rural"]
[80455,"GERVIN ROAD EXTENSION","North Rural"]
[51359,"GERWYN PL","South East Urban"]
[54717,"GERWYN PL CARPARK (RP28 RHS)","South East Urban"]
[53501,"GIANI CRT","South West Urban"]
[15664,"GIARNI PL/CAPRIANA DR CYWAY","South West Urban"]
[51360,"GIBBONS RD (MANUREWA)","South West Urban"]
[20143,"GIBBONS RD (TAKAPUNA)","North Urban East"]
[54387,"GIBBONS RD CARPARK (RP334 RHS)","South West Urban"]
[54053,"GIBBONS RD CARPARK (RP474 LHS)","South West Urban"]
[54385,"GIBBONS RD CARPARK (RP474 RHS)","South West Urban"]
[15724,"GIBBONS RD/HANFORD PL CYWAY","South West Urban"]
[60113,"GIBBS CRES","South West Urban"]
[51361,"GIBBS RD","South West Urban"]
[53631,"GIBBSTON CRES","South East Urban"]
[30519,"GIBRALTAR CRES","Central"]
[51362,"GIBRALTAR ST","South East Urban"]
[51363,"GIBSON PL","South East Urban"]
[80500,"GIDRAN ST","South West Urban"]
[33659,"GIFFORD AVE","Central"]
[15283,"GIFFORD AVE CARPARK LINK CYWAY","Central"]
[15282,"GIFFORD AVE/MEMORIAL PARK LINK CYWAY (RP137)","Central"]
[15281,"GIFFORD AVE/MEMORIAL PARK LINK CYWAY (RP480)","Central"]
[35921,"GIFFORD LANE (PVT)","Central East"]
[51364,"GIFFORD RD","South West Urban"]
[30520,"GIFFORD ST","Central East"]
[60332,"GIGI PL","South West Urban"]
[51365,"GILA PL","South West Urban"]
[22318,"GILBERD PL","North Urban East"]
[30521,"GILBERT AVE","Central"]
[51366,"GILBERT RD","South West Urban"]
[10337,"GILBRANSEN RD","North Rural"]
[33660,"GILES RD","Hauraki Islands"]
[30522,"GILFILLAN ST","West"]
[53384,"GILFORD PL","South East Urban"]
[30523,"GILGIT RD","Central"]
[40870,"GILL AVE","West"]
[30524,"GILL CRES","West"]
[20477,"GILLAN PL","North Urban West"]
[51367,"GILLARD PL","South East Urban"]
[54652,"GILLARD PL EXTN","South East Urban"]
[53817,"GILLARD PL-OLIVER RD","South East Urban"]
[70210,"GILLESPIE RD","South Rural"]
[51368,"GILLETT PL","South East Urban"]
[33661,"GILLETTA RD","Central"]
[30164,"GILLETTA RD HLA (RP575 RHS)","Central"]
[40085,"GILLIAM ST","West"]
[30525,"GILLIES AVE","Central"]
[31647,"GILLIES AVE EXT (SECCOMBES - END)","Central"]
[33127,"GILLIES AVE HLA (#191 - #195)","Central"]
[33665,"GILLIES RD","Central East"]
[24005,"GILLISPIE PL (PVT)","North Urban East"]
[60114,"GILLS AVE","South West Urban"]
[20665,"GILLS RD (ALBANY)","North Urban West"]
[51369,"GILLS RD (PAKURANGA)","South East Urban"]
[54542,"GILLS RD CARPARK (RP1568 RHS)","South East Urban"]
[54541,"GILLS RD CARPARK (RP1672 RHS)","South East Urban"]
[15734,"GILLS RD/FIESTA DR CYWAY","South East Urban"]
[70211,"GILMORE RD","South Rural"]
[53185,"GILNOCKIE CLOSE","South East Urban"]
[22072,"GILPIN PL","North Urban West"]
[10338,"GILSHENNAN VALLEY","North Urban East"]
[80382,"GILSTON AVE","South East Urban"]
[47303,"GINA AVE","West"]
[47052,"GINDERS DR","West"]
[53491,"GINKO PL","South West Urban"]
[41439,"GIPSY MOTH ST","North Urban West"]
[71283,"GIRDHAR PL","South Rural"]
[20378,"GIRRAHWEEN DR","North Urban West"]
[53595,"GIRVAN TCE","South West Urban"]
[54371,"GIRVAN TCE HAMMERHEAD","South West Urban"]
[53820,"GIRVAN TCE-BELLSHILL CLOSE","South West Urban"]
[53819,"GIRVAN TCE-TURNBERRY DR","South West Urban"]
[70212,"GIVEN RD","South Rural"]
[51370,"GLADDING PL","South West Urban"]
[22073,"GLADE PL","North Urban West"]
[40869,"GLADFIELD LANE","West"]
[48151,"GLADFIELD LANE WWAY","West"]
[21029,"GLADSTONE RD (ONEWA)","North Urban West"]
[30526,"GLADSTONE RD (PARNELL)","Central"]
[33662,"GLADWIN RD","Central"]
[20497,"GLADYS AVE","North Urban West"]
[10340,"GLAMIS AVE","North Urban East"]
[22319,"GLAMORGAN DR","North Urban East"]
[11510,"GLANCE ST","North Rural"]
[53424,"GLANMIRE PL","South East Urban"]
[11117,"GLANVILLE CLOSE","North Urban East"]
[30527,"GLANVILLE TCE","Central"]
[53032,"GLANWORTH PL","South East Urban"]
[15688,"GLANWORTH PL LINK CYWAY","South East Urban"]
[51371,"GLASGOW AVE","South West Urban"]
[70956,"GLASGOW RD","South Rural"]
[33663,"GLASGOW TCE","Central"]
[33664,"GLASS RD (MT ROSKILL)","Central"]
[53570,"GLASSON AVE","South East Urban"]
[52942,"GLASSONBY RD","South East Urban"]
[20486,"GLASTRON PL","North Urban West"]
[53385,"GLASTRY CLOSE","South East Urban"]
[71421,"GLEAMING PL","South Rural"]
[22826,"GLEANOR AVE","North Urban West"]
[70883,"GLEBE PL","South Rural"]
[10341,"GLEDSTANE RD","North Urban East"]
[70214,"GLEESON RD","South Rural"]
[30529,"GLEN ATKINSON ST","Central East"]
[51372,"GLEN AVE","South West Urban"]
[22935,"GLEN BAY CLOSE","North Urban West"]
[33668,"GLEN BROOK RD","Hauraki Islands"]
[34979,"GLEN BROOK/OMIHA BAY ACCESS (RP20)","Hauraki Islands"]
[35907,"GLEN BROOK/OMIHA BAY WWAY (RP20)","Hauraki Islands"]
[40014,"GLEN CLOSE","West"]
[48038,"GLEN CLOSE WWAY","West"]
[30533,"GLEN ESK PL","Central East"]
[40858,"GLEN MARINE PDE","West"]
[40868,"GLEN NORMAN AVE","West"]
[30535,"GLEN OAKS","Central East"]
[53154,"GLEN OSBOURNE TCE","South East Urban"]
[53822,"GLEN OSBOURNE TCE-ERONI CLARKE CLOSE","South East Urban"]
[22835,"GLEN RD - BROWNS BAY","North Urban East"]
[22527,"GLEN RD - DEVONPORT","North Urban East"]
[20871,"GLEN RD (BROWNS BAY) SERVICE LANE","North Urban East"]
[40867,"GLEN RD (WAITAKERE)","West"]
[20463,"GLEN VISTA PL","North Urban West"]
[30528,"GLENALMOND RD","Central"]
[47053,"GLENARDEN WAY","West"]
[33667,"GLENARM AVE","Central"]
[40866,"GLENBERVIE CRES","West"]
[71481,"GLENBOGLE DR","South Rural"]
[70217,"GLENBROOK BEACH RD","South Rural"]
[70218,"GLENBROOK RD","South Rural"]
[30530,"GLENBROOK ST","Central East"]
[70219,"GLENBROOK STATION RD","South Rural"]
[80709,"GLENBROOK/KINGSEAT RAB","South Rural"]
[70220,"GLENBROOK-WAIUKU RD","South Rural"]
[60326,"GLENBURN PL","South West Urban"]
[40865,"GLENBURY PL","West"]
[22074,"GLENBUSH PL","North Urban West"]
[71425,"GLENCAIRN PL","South Rural"]
[53271,"GLENCALDER PL","South West Urban"]
[22320,"GLENCOE RD","North Urban East"]
[20520,"GLENCOURT PL","North Urban West"]
[53031,"GLENCULLEN PL","South East Urban"]
[15687,"GLENCULLEN PL LINK CYWAY","South East Urban"]
[40156,"GLENDALE RD","West"]
[15100,"GLENDALE RD/ROUTLEY DR CYWAY (RP791)","West"]
[15153,"GLENDALE RD/SAVOY RD CYWAY (RP1237)","West"]
[20484,"GLENDAWN PL","North Urban West"]
[40864,"GLENDENE AVE","West"]
[20462,"GLENDHU RD (EAST)","North Urban West"]
[20485,"GLENDHU RD (WEST)","North Urban West"]
[80560,"GLENDHU WEST/GLENDHU EAST WWAY (RP171 RHS)","North Urban West"]
[30531,"GLENDON AVE","West"]
[30532,"GLENDOWIE RD","Central East"]
[35822,"GLENDOWIE/RIDDELL WWAY (RP388)","Central East"]
[51373,"GLENEAGLES GR","South West Urban"]
[53823,"GLENEAGLES GR-CARNOUSTIE DR","South West Urban"]
[10342,"GLENELG RD","North Urban East"]
[40862,"GLENESK RD","West"]
[30534,"GLENFELL PL","Central"]
[51374,"GLENFERN RD (COCKLE BAY)","South East Urban"]
[35035,"GLENFERN RD (GREAT BARRIER ISLAND)","Hauraki Islands"]
[33669,"GLENFERRIE PL","Central"]
[26058,"GLENFIELD AREA OFFICE CARPARK","North Urban West"]
[26057,"GLENFIELD LEISURE CENTRE EAST CARPA","North Urban West"]
[26056,"GLENFIELD LEISURE CENTRE WEST CARPA","North Urban West"]
[20011,"GLENFIELD RD","North Urban West"]
[22597,"GLENFIELD RD LLA (#294 - #300)","North Urban West"]
[22598,"GLENFIELD RD LLA (#325 - #303)","North Urban West"]
[23088,"GLENFIELD RD LLA (#327 - #347)","North Urban West"]
[22599,"GLENFIELD RD LLA (#352 - #370)","North Urban West"]
[22871,"GLENFIELD RD LLA (#355 - #390)","North Urban West"]
[22872,"GLENFIELD RD LLA (#390 - #412)","North Urban West"]
[23032,"GLENFIELD RD LLA (#413 - #423)","North Urban West"]
[23086,"GLENFIELD RD LLA (#522 - #532)","North Urban West"]
[23085,"GLENFIELD RD LLA (#527 - #545)","North Urban West"]
[23087,"GLENFIELD RD LLA (#532 - #550)","North Urban West"]
[23071,"GLENFIELD RD LLA (OPPOSITE HALL)","North Urban West"]
[40861,"GLENFINN PL","West"]
[41204,"GLENFINN PL EXTN","West"]
[40860,"GLENFORD LANE","West"]
[48149,"GLENFORD LANE WWAY","West"]
[10343,"GLENGARRY AVE","North Urban East"]
[40146,"GLENGARRY RD","West"]
[47150,"GLENGARRY RD LLA (#113 - #119)","West"]
[60330,"GLENGOWAN PL","South West Urban"]
[40859,"GLENHAVEN PL","West"]
[80344,"GLENHAVEN PL WWAY","West"]
[51375,"GLENLEA PL","South East Urban"]
[40154,"GLENMALL PL","West"]
[47238,"GLENMALL PL (WESTBOUND)","West"]
[51376,"GLENMARY PL","South West Urban"]
[54563,"GLENMARY PL EXTN","South West Urban"]
[10344,"GLENMORE DR","North Rural"]
[10345,"GLENMORE RD (COATESVILLE)","North Rural"]
[51377,"GLENMORE RD (PAKURANGA)","South East Urban"]
[51378,"GLENNANDREW DR","South East Urban"]
[51379,"GLENNIS PL","South West Urban"]
[71530,"GLENNRON LANE","South Rural"]
[53488,"GLENOAKS RISE (PVT)","South East Urban"]
[60327,"GLENORA RD","South West Urban"]
[40042,"GLENORCHY ST","West"]
[41196,"GLENORCHY ST LLA (#2 - #10)","West"]
[53110,"GLENPARK PL","South West Urban"]
[22775,"GLENREAGH PL","North Urban East"]
[52814,"GLENROSS DR","South West Urban"]
[15647,"GLENROSS DR LINK CYWAY(RP434)","South West Urban"]
[15646,"GLENROSS DR LINK CYWAY(RP700)","South West Urban"]
[40856,"GLENROY PL","West"]
[51380,"GLENSHEE PL","South East Urban"]
[51381,"GLENSIDE AVE","South East Urban"]
[30536,"GLENSIDE CRES","Central"]
[33670,"GLENTIES LANE","Central East"]
[35689,"GLENTIES/CELTIC WWAY (RP125 LHS)","Central East"]
[33672,"GLENTUI RD","Central"]
[20386,"GLENVALE PL","North Urban West"]
[22321,"GLENVAR CLOSE","North Urban East"]
[20741,"GLENVAR RD","North Urban East"]
[33673,"GLENVEAGH DR","Central"]
[53130,"GLENVEAGH PARK DR","South West Urban"]
[40039,"GLENVIEW RD","West"]
[40855,"GLENVIL LANE","West"]
[48148,"GLENVIL LANE WWAY","West"]
[22075,"GLENWOOD AVE","North Urban West"]
[54239,"GLESAN PL (PVT)","South Rural"]
[60329,"GLOAMING PL","South West Urban"]
[40854,"GLORIA AVE","West"]
[33674,"GLOUCESTER PARK RD","Central East"]
[51382,"GLOUCESTER RD","South West Urban"]
[54057,"GLOUCESTER RD CARPARK (RP15 RHS)","South West Urban"]
[54091,"GLOUCESTER RD SERVICE LANE (RP50)","South West Urban"]
[30537,"GLOVER RD","Central East"]
[33063,"GLOVER RD EXTN (RP476 RHS)","Central East"]
[33128,"GLOVER RD HLA (#55 - #39)","Central East"]
[40853,"GLUCINA AVE","North Urban West"]
[41175,"GLUCINA PL","West"]
[33676,"GLYNN ST","Central"]
[40852,"GLYNNBROOKE ST","West"]
[33677,"GOAD CRES","Central"]
[10346,"GOAT ISLAND RD","North Rural"]
[10347,"GOATLEY RD","North Rural"]
[11445,"GOATLEY SIDE RD","North Rural"]
[71461,"GOBLE RD","South Rural"]
[30538,"GODDEN CRES","Central East"]
[30539,"GODFREY PL","Central East"]
[31552,"GODFREY PL HAMMERHEAD","Central East"]
[20642,"GODLEY LANE","North Urban West"]
[40851,"GODLEY RD","West"]
[48007,"GODLEY RD - VARDEN RD WWAY","West"]
[48008,"GODLEY RD WWAY","West"]
[48009,"GODLEY RD WWAY - TAUPIKO PL WWAY","West"]
[22689,"GODWIN CRT","North Urban West"]
[33678,"GODWIT PL (LYNFIELD)","Central"]
[70899,"GODWIT PL (WAIUKU)","South Rural"]
[53668,"GOH PL","South West Urban"]
[22926,"GOLD ST","North Urban West"]
[51383,"GOLDEN ARCHES PL","South West Urban"]
[80301,"GOLDEN MORNING DR","North Urban West"]
[51384,"GOLDERS PL","South East Urban"]
[20265,"GOLDFIELD","North Urban West"]
[20701,"GOLDFINCH RISE","North Urban West"]
[15016,"GOLDFINCH RISE/BARBADOS DR CYWAY","North Urban West"]
[15031,"GOLDFINCH RISE/BARBADOS DR LOOP CYWAY","North Urban West"]
[11201,"GOLDFLATS LANE","North Rural"]
[30540,"GOLDIE ST","Central East"]
[70221,"GOLDING RD","South Rural"]
[51385,"GOLDNIB PL","South West Urban"]
[30541,"GOLDSMITH RD","Central"]
[35252,"GOLDSTINE PL","Central"]
[33679,"GOLF AVE","South West Urban"]
[33680,"GOLF RD (EPSOM)","Central"]
[40850,"GOLF RD (WAITAKERE)","West"]
[10348,"GOLF RD (WARKWORTH)","North Rural"]
[47167,"GOLF RD HLA (#207 - #195)","West"]
[52951,"GOLFLAND DR","South East Urban"]
[33681,"GOLLAN RD","Central East"]
[52742,"GOOCH PL","South East Urban"]
[15777,"GOOCH PL LINK CYWAY","South East Urban"]
[10349,"GOODALL RD","North Rural"]
[11616,"GOODALL RESERVE  WWAY","North Rural"]
[33682,"GOODALL ST","Central"]
[36052,"GOODALL ST (OPP #8) (PVT)","Central"]
[35251,"GOODLAND ST","Central"]
[33683,"GOODMAN PL","Central East"]
[33684,"GOODWIN AVE","Hauraki Islands"]
[60115,"GOODWIN DR","South West Urban"]
[51387,"GOODWOOD DR","South West Urban"]
[53537,"GORDAL PL","South East Urban"]
[20219,"GORDON AVE","North Urban East"]
[10350,"GORDON CRAIG PL","North Rural"]
[34852,"GORDON RD (OTAHUHU)","South West Urban"]
[51388,"GORDON RD (PAPATOETOE)","South West Urban"]
[33686,"GORDON RD (ST LUKES)","Central"]
[70223,"GORDON RD (WAIPIPI)","South Rural"]
[30469,"GORDON RD EXTN (ST LUKES)","Central"]
[53824,"GORDON RD-ASHLYNNE AVE","South West Urban"]
[47340,"GORDON STANLEY DR","West"]
[80644,"GORDON WAY","North Rural"]
[33685,"GORDONS RD","Hauraki Islands"]
[30542,"GORE ST","Central"]
[30543,"GORE ST LANE","Central"]
[33687,"GORING RD","Central"]
[33688,"GORRIE AVE","Central"]
[36053,"GORST LANE (PVT)","Central"]
[53390,"GORTIN CLOSE","South East Urban"]
[54216,"GORTNEST PL","South East Urban"]
[51389,"GOSFORD DR","South East Urban"]
[15763,"GOSFORD DR LINK CYWAY","South East Urban"]
[80477,"GOSPEL HEIGHTS RD","South East Urban"]
[33689,"GOSPORT PL","Central East"]
[51390,"GOSSAMER DR","South East Urban"]
[54706,"GOSSAMER DR CARPARK (RP1682 RHS)","South East Urban"]
[54705,"GOSSAMER DR CARPARK (RP985 LHS)","South East Urban"]
[54159,"GOSSAMER DR SERVICE LANE (RP1707)","South East Urban"]
[54042,"GOSSAMER DR SERVICE LANE (RP347)","South East Urban"]
[53825,"GOSSAMER DR-JADE AVE","South East Urban"]
[54707,"GOSSAMER/REEVES RAB","South East Urban"]
[33690,"GOTHIC PL","Central"]
[10353,"GOUDIE RD","North Rural"]
[10354,"GOVAN WILSON RD","North Rural"]
[35971,"GOVERNOR FITZROY PL","Central"]
[10630,"GOVERNOR GREY RD","North Rural"]
[10355,"GOW ST","North Rural"]
[30544,"GOWING DR","Central East"]
[71422,"GRACE JAMES RD","South Rural"]
[30545,"GRACE ST","Central East"]
[51391,"GRACECHURCH DR","South East Urban"]
[54431,"GRACECHURCH DR CARPARK (RP42 RHS)","South East Urban"]
[47168,"GRACEVIEW WAY","North Urban West"]
[51392,"GRAEME AVE","South West Urban"]
[54580,"GRAEME AVE CARPARK (RP20 LHS)","South West Urban"]
[30546,"GRAFTON BRIDGE","Central"]
[34942,"GRAFTON MEWS (PVT)","Central"]
[30547,"GRAFTON RD (NORTH)","Central"]
[31452,"GRAFTON RD (SOUTH)","Central"]
[33129,"GRAFTON RD HLA (#118 - #132)","Central"]
[40849,"GRAHAM AVE","West"]
[48146,"GRAHAM AVE WWAY 1","West"]
[48147,"GRAHAM AVE WWAY 2","West"]
[33691,"GRAHAM BELL AVE","Central"]
[33692,"GRAHAM BREED DR","Central"]
[22862,"GRAHAM COLLINS DR","North Urban West"]
[60328,"GRAHAM RD (TAKANINI)","South West Urban"]
[30548,"GRAHAM ST (AUCKLAND)","Central"]
[70957,"GRAHAM ST (PUKEKOHE)","South Rural"]
[60271,"GRAHAM TAGG CLOSE","South West Urban"]
[22108,"GRAHAME ST","North Urban East"]
[70225,"GRAHAMS BEACH RD","South Rural"]
[40848,"GRAINGER RD","West"]
[51393,"GRAMMAR SCHOOL RD","South East Urban"]
[52928,"GRAMMAR SCHOOL RD EXTN #1","South East Urban"]
[52929,"GRAMMAR SCHOOL RD EXTN #2","South East Urban"]
[52930,"GRAMMAR SCHOOL RD EXTN #3","South East Urban"]
[30549,"GRAMPIAN RD","Central East"]
[31556,"GRAMPIAN/HAMPTON RAB","Central East"]
[30550,"GRANADA PL","Central East"]
[35789,"GRANADA/SIERRA WWAY (RP128 RHS)","Central East"]
[30551,"GRAND DR (MEADOWBANK)","Central East"]
[11188,"GRAND DR (OREWA)","North Urban East"]
[15264,"GRAND DR/WAIATARUA RES LINK CYWAY (RP1266)","Central East"]
[15268,"GRAND DR/WAIATARUA RESERVE LINK CYWAY (RP153)","Central East"]
[10358,"GRAND VIEW RD (MATHESON BAY)","North Rural"]
[30552,"GRAND VIEW RD (REMUERA)","Central East"]
[33694,"GRANDE AVE","Central"]
[51394,"GRANDE VUE RD (MANUREWA)","South West Urban"]
[51395,"GRANDE VUE RD (PAPATOETOE)","South West Urban"]
[54071,"GRANDE VUE RD CARPARK (RP13 RHS)","South West Urban"]
[53826,"GRANDE VUE RD-COLLIE ST","South West Urban"]
[53827,"GRANDE VUE RD-PATRICIA PL","South West Urban"]
[30464,"GRANDE/SUMMIT WWAY (RP484 RHS)","Central"]
[40847,"GRANDISON CRES","West"]
[34903,"GRANDSTAND RD NORTH","Central"]
[34902,"GRANDSTAND RD SOUTH","Central"]
[10357,"GRANDVIEW RD","North Urban East"]
[33695,"GRANGE RD (MT EDEN)","Central"]
[51396,"GRANGE RD (OTARA)","South West Urban"]
[10359,"GRANGE ST","North Rural"]
[51397,"GRANGER RD","South East Urban"]
[53330,"GRANGEWOOD CLOSE","South West Urban"]
[51398,"GRANITE PL","South West Urban"]
[53267,"GRANSNA LANE","South East Urban"]
[51399,"GRANT AVE","South West Urban"]
[11333,"GRANT RIDGE RD","North Rural"]
[10360,"GRANT ST (MAHURANGI)","North Rural"]
[30553,"GRANT ST (MT ALBERT)","Central"]
[30554,"GRANTHAM RD (GLENDOWIE)","Central East"]
[51400,"GRANTHAM RD (PAPATOETOE)","South West Urban"]
[53828,"GRANTHAM RD-REAGAN RD","South West Urban"]
[40846,"GRANVILLE DR","West"]
[10361,"GRANVILLE RD","North Rural"]
[80252,"GRAPNEL ST","North Urban East"]
[11438,"GRASSFIELD PL","North Rural"]
[40845,"GRASSMERE RD","West"]
[51401,"GRASSWAYS AVE","South East Urban"]
[30555,"GRATTAN PL","Central"]
[41376,"GRAVEN CRT","West"]
[41404,"GRAVEN CRT HAMMERHEAD","West"]
[51402,"GRAY AVE","South West Urban"]
[53829,"GRAY AVE-STAINES AVE","South West Urban"]
[22322,"GRAY CRES","North Urban East"]
[35047,"GRAY RD","Hauraki Islands"]
[51403,"GRAYSON AVE","South West Urban"]
[10362,"GRAYSON RD","North Rural"]
[33696,"GRAYSONS LANE","Central"]
[33697,"GREAT BARRIER RD","Hauraki Islands"]
[10364,"GREAT NORTH RD","North Rural"]
[30556,"GREAT NORTH RD (CWC)","Central"]
[80310,"GREAT NORTH RD (CWW)","West"]
[10363,"GREAT NORTH RD (SH1 WARKWORTH)","North Rural"]
[40844,"GREAT NORTH RD (WAITAKERE)","West"]
[35940,"GREAT NORTH RD EXT CARPARK (RP35)","Central"]
[31541,"GREAT NORTH RD EXTN (RP2878)","Central"]
[35030,"GREAT NORTH RD S/LANE (RP4221 LHS)","Central"]
[30760,"GREAT NORTH RD SHOPS SLIP (RP8086)","West"]
[15129,"GREAT NORTH RD/HENDERSON CREEK RESERVE CYWAY (RP7529)","West"]
[15161,"GREAT NORTH RD/MOTORWAY NTH LINK CYWAY","Central"]
[15160,"GREAT NORTH RD/MOTORWAY STH LINK CYWAY","Central"]
[35836,"GREAT NORTH/ST JUDE RAB","West"]
[41327,"GREAT NORTH/TE ATATU RAB","West"]
[51405,"GREAT SOUTH RD (MANUKAU)","South West Urban"]
[30557,"GREAT SOUTH RD (NEWMARKET) (CWC)","Central"]
[80308,"GREAT SOUTH RD (NEWMARKET) (CWCE)","Central East"]
[80309,"GREAT SOUTH RD (NEWMARKET) (SW)","South West Urban"]
[60116,"GREAT SOUTH RD (PAPAKURA)","South West Urban"]
[60713,"GREAT SOUTH RD (RAMARAMA)","South Rural"]
[54070,"GREAT SOUTH RD CARPARK (RP19337)","South West Urban"]
[54067,"GREAT SOUTH RD CARPARK (RP20870)","South West Urban"]
[31626,"GREAT SOUTH RD EXTN (RP10112)","South West Urban"]
[70228,"GREAT SOUTH RD HLA (RP35934 LHS)","South Rural"]
[71440,"GREAT SOUTH RD HLA (RP36279 RHS)","South Rural"]
[54226,"GREAT SOUTH RD LLA (RP21326 RHS)","South West Urban"]
[80417,"GREAT SOUTH RD WWAY (RP 26685 RHS)","South West Urban"]
[15425,"GREAT SOUTH RD/FERGUSON ST CYWAY(RP21634)","South West Urban"]
[15421,"GREAT SOUTH RD/GLENGOWAN PL CYWAY (RP22896)","South West Urban"]
[15460,"GREAT SOUTH RD/IONA PL CYWAY (RP17496)","South West Urban"]
[15459,"GREAT SOUTH RD/IONA PL CYWAY (RP17555)","South West Urban"]
[54759,"GREAT SOUTH RD/SUPERCLINIC SLIP","South West Urban"]
[15465,"GREAT SOUTH RD/WILMSHURST AVE CYWAY (RP14839)","South West Urban"]
[54046,"GREAT SOUTH RD-ERIC BAKER PL","South West Urban"]
[31624,"GREAT SOUTH/MOTORWAY RAMPS RAB","Central East"]
[60541,"GREAT SOUTH/NORRIE RAB","South West Urban"]
[31668,"GREAT SOUTH/PIKI THOMPSON SLIP","South West Urban"]
[31625,"GREAT SOUTH/PRINCES RAB","South West Urban"]
[60543,"GREAT SOUTH/WALTERS RAB","South West Urban"]
[60643,"GREAT SOUTH/WOOD RAB","South West Urban"]
[51408,"GREBE ST","South West Urban"]
[53832,"GREBE ST-MAHIA RD","South West Urban"]
[10365,"GREEN HOLLOWS RD","North Rural"]
[10366,"GREEN LANE (HELENSVILLE)","North Rural"]
[70958,"GREEN LANE (PUKEKOHE)","South Rural"]
[80311,"GREEN LANE EAST (CWC)","Central"]
[30560,"GREEN LANE EAST (CWCE)","Central East"]
[31622,"GREEN LANE EAST (EASTBOUND) (CWC)","Central"]
[80312,"GREEN LANE EAST (EASTBOUND) (CWCE)","Central East"]
[33703,"GREEN LANE WEST","Central"]
[30561,"GREEN LANE WEST (EASTBOUND)","Central"]
[10367,"GREEN RD (DAIRY FLAT)","North Rural"]
[33698,"GREEN RD (MT WELLINGTON)","Central East"]
[10368,"GREEN RD 2 (MATAKANA)","North Rural"]
[10369,"GREEN RD 3 (PARAKAI)","North Rural"]
[60117,"GREEN ST (PAPAKURA)","South West Urban"]
[30558,"GREEN ST (ST MARYS BAY)","Central"]
[30559,"GREENBANK DR","Central East"]
[47170,"GREENBERRY DR","West"]
[22974,"GREENBOUGH LANE","North Urban West"]
[53510,"GREENBROOKE DR","South East Urban"]
[20444,"GREENDALE SPUR","North Urban West"]
[71237,"GREENFIELD RD (AWHITU)","South Rural"]
[33699,"GREENFIELD RD (EPSOM)","Central"]
[60118,"GREENHAVEN AVE","South West Urban"]
[51409,"GREENHILL CRES","South East Urban"]
[54722,"GREENHILL/GRASSWAYS RAB","South East Urban"]
[20055,"GREENHITHE RD","North Urban West"]
[22853,"GREENLEAF WAY","North Urban East"]
[80418,"GREENLINK RISE","North Urban East"]
[51410,"GREENMEADOWS AVE","South West Urban"]
[54347,"GREENMEADOWS AVE CARPARK (RP17 RHS)","South West Urban"]
[51411,"GREENMOUNT DR","South East Urban"]
[71299,"GREENOCK DR","South Rural"]
[40843,"GREENOCK RD","West"]
[33700,"GREENPARK RD","Central East"]
[22687,"GREENRIDGE CRT","North Urban West"]
[21030,"GREENSLADE CRESENT","North Urban West"]
[51412,"GREENSTONE PL","South West Urban"]
[20524,"GREENVALLEY RISE","North Urban West"]
[11380,"GREENVIEW LANE","North Urban East"]
[33701,"GREENVILLE AVE","Central"]
[30562,"GREENWAY PL","Central East"]
[11407,"GREENWAY RISE","North Urban East"]
[22956,"GREENWICH WAY","North Urban West"]
[51413,"GREENWOOD RD","South West Urban"]
[41340,"GREENWOODS CLOSE","West"]
[51414,"GREERS RD","South West Urban"]
[40842,"GREGG PL","West"]
[33704,"GREGORY PL","Central"]
[10981,"GREGORY RD","West"]
[71416,"GREIG PL","South Rural"]
[20326,"GRENADA AVE","North Urban East"]
[22589,"GRENADINE PL","North Urban West"]
[40841,"GRENDON RD","West"]
[53372,"GRETA BANKS PL","South West Urban"]
[11291,"GRETA PL","North Urban East"]
[20552,"GRETEL PL","North Urban West"]
[22766,"GRETNA GREEN","North Urban East"]
[53219,"GRETTON CRT","South East Urban"]
[20015,"GREVILLE RD","North Urban West"]
[51415,"GREVILLEA CRT","South West Urban"]
[15239,"GREY LYNN PARK EAST LOOP CYWAY","Central"]
[15238,"GREY LYNN PARK WEST - EAST CYWAY","Central"]
[15240,"GREY LYNN PARK WEST LOOP CYWAY","Central"]
[34883,"GREY ST","Central East"]
[80559,"GREYDENE PL","North Urban East"]
[80285,"GREYFORT RD","North Urban East"]
[30563,"GREYS AVE","Central"]
[33706,"GRIBBLEHIRST RD","Central"]
[10371,"GRICE RD","North Rural"]
[80245,"GRIDCO RD (PVT)","South West Urban"]
[70959,"GRIERSON PL","South Rural"]
[33709,"GRIFFEN PARK RD","Central"]
[33707,"GRIFFIN AVE","Central"]
[35734,"GRIFFIN/MARKET WWAY (RP171 LHS)","Central"]
[40840,"GRIFFITHS PL","West"]
[51416,"GRIGGS RD","South Rural"]
[40839,"GRIMSHAW PL","West"]
[11589,"GRIVELLE","North Rural"]
[30564,"GROSVENOR ST","Central"]
[15243,"GROSVENOR ST/GREY LYNN PARK CYWAY","Central"]
[33710,"GROTTO ST","Central East"]
[51417,"GROVE LANE","South East Urban"]
[53833,"GROVE LANE-UDYS RD","South East Urban"]
[22098,"GROVE RD (DEVONPORT)","North Urban East"]
[60119,"GROVE RD (PAPAKURA)","South West Urban"]
[33711,"GROVE RD (SANDRINGHAM)","Central"]
[60658,"GROVE RD CARPARK (RP21 LHS)","South West Urban"]
[60657,"GROVE RD CARPARK (RP539 LHS)","South West Urban"]
[40838,"GROVELANDS WAY","West"]
[11443,"GROVENOR DR (NORTH)","North Urban East"]
[11434,"GROVENOR DR (SOUTH)","North Urban East"]
[51418,"GROWERS LANE","South West Urban"]
[11225,"GRUMPY RD","North Rural"]
[51419,"GRUNDY PL","South West Urban"]
[80596,"GRUT GREENS EASTBOUND","North Urban East"]
[80594,"GRUT GREENS LOOP","North Urban East"]
[80597,"GRUT GREENS WESTBOUND","North Urban East"]
[31710,"GUARD CRES","Central East"]
[33712,"GUARDWELL TCE","Central"]
[51420,"GUBB PL","South West Urban"]
[30565,"GUDGEON ST","Central"]
[53665,"GUIDE PL","South West Urban"]
[30566,"GUILDFORD PL","Central East"]
[20071,"GUINIVEN AVE","North Urban East"]
[47334,"GUINNESS PL","West"]
[51422,"GULF CREST","South East Urban"]
[10373,"GULF HARBOUR DR","North Urban East"]
[33713,"GULF PL","Hauraki Islands"]
[22323,"GULF VIEW RD","North Urban East"]
[22324,"GULL LANE","North Urban East"]
[60331,"GULLIVER PL","South West Urban"]
[40837,"GUM RD","West"]
[10375,"GUM STORE RD","North Rural"]
[11542,"GUM TREE LANE","North Rural"]
[80462,"GUMDIGGER RISE","North Urban East"]
[10374,"GUMDIGGERS LANE","North Rural"]
[11557,"GUMFIELD DR","North Rural"]
[70229,"GUN CLUB RD","South Rural"]
[30567,"GUNDRY ST","Central"]
[47169,"GUNNER DR","West"]
[33714,"GUNSON RD","Central East"]
[30568,"GUNSON ST","Central"]
[80667,"GUNTON DR","West"]
[10376,"GURNARD RD","North Urban East"]
[51423,"GUTHREY PL","South West Urban"]
[10377,"GUY RD","North Rural"]
[31593,"GUYON ST","Central East"]
[51424,"GUYS RD","South East Urban"]
[54470,"GUYS/HUNTINGTON RAB","South East Urban"]
[53459,"GUYS/KELVIN HART RAB","South East Urban"]
[54471,"GUYS/LURGAN RAB","South East Urban"]
[51425,"GWENAND PL","South East Urban"]
[40836,"GWENDOLINE AVE","West"]
[30569,"GWILLIAM PL","Central"]
[35779,"GWILLIAM/GRATTAN WWAY (RP159)","Central"]
[35778,"GWILLIAM/SHERIDAN WWAY (RP122)","Central"]
[60120,"GYPSY MOTH PL","South West Urban"]
[53240,"HA CRES","South West Urban"]
[30570,"HAAST ST","Central East"]
[30571,"HACKETT ST","Central"]
[80568,"HADDINGTON DR","South East Urban"]
[51426,"HADDON ST","South West Urban"]
[30572,"HADFIELD AVE","Central"]
[22079,"HADFIELD ST","North Urban West"]
[51427,"HADLEY WOOD DR","South West Urban"]
[53837,"HADLEY WOOD DR-SUNNINGDALE ST","South West Urban"]
[35922,"HADLOW TCE (PVT)","Central"]
[10398,"HAFTON RD","North Rural"]
[52954,"HAGEN CLOSE","South East Urban"]
[22080,"HAGUE PL","North Urban West"]
[33715,"HAIG AVE","Central"]
[11344,"HAIGH ACCESS LANE","North Urban East"]
[10378,"HAIGH ACCESS RD","North Urban East"]
[40834,"HAILES RD","West"]
[51428,"HAIN AVE","South West Urban"]
[30573,"HAKANOA ST","Central"]
[60645,"HAKAWAI AVE (NORTHBOUND)","South West Urban"]
[60650,"HAKAWAI AVE (SOUTHBOUND)","South West Urban"]
[51429,"HAKEA PL","South West Urban"]
[53838,"HAKEA PL-EVERGLADE DR","South West Urban"]
[47343,"HAKI WIHONGI PL","West"]
[60121,"HALBERG ST (ARDMORE)","South West Urban"]
[20410,"HALBERG ST (GLENFIELD)","North Urban West"]
[40835,"HALCOMBE PL","West"]
[51430,"HALCYON PL","South West Urban"]
[22325,"HALDER PL","North Urban East"]
[20481,"HALE CRES","North Urban West"]
[33717,"HALESOWEN AVE","Central"]
[51431,"HALF MOON RISE","South East Urban"]
[30574,"HALFORD PL","Central East"]
[35867,"HALFORD/EVANDALE WWAY (RP68 END)","Central East"]
[52740,"HALIDAY PL","South East Urban"]
[33718,"HALIFAX AVE","Central"]
[51432,"HALL AVE (NORTH)","South West Urban"]
[33720,"HALL AVE (OTAHUHU)","South West Urban"]
[36117,"HALL AVE (OTAHUHU) CARPARK (RP180)","South West Urban"]
[52985,"HALL AVE (SOUTH)","South West Urban"]
[54168,"HALL AVE (SOUTH) CARPARK (RP18 LHS)","South West Urban"]
[10380,"HALL HEAD RD","North Rural"]
[10381,"HALL LANE","North Rural"]
[71284,"HALL LANE (RP63 RHS)","South Rural"]
[20429,"HALL RD (GLENFIELD)","North Urban West"]
[70232,"HALL RD (WAIUKU)","South Rural"]
[70961,"HALL ST (PUKEKOHE)","South Rural"]
[71437,"HALL ST CARPARK #1 (RP112 RHS)","South Rural"]
[71436,"HALL ST CARPARK #2 (RP247 LHS)","South Rural"]
[70182,"HALL ST CARPARK #3 (RP270 LHS)","South Rural"]
[33719,"HALLAM ST","Central"]
[51433,"HALLBERRY RD","South West Urban"]
[53839,"HALLBERRY RD-BUCKLAND RD","South West Urban"]
[10379,"HALLDENE TCE","North Urban East"]
[33721,"HALLEYS PL","Central"]
[40833,"HALLORAN PL","West"]
[48311,"HALLORAN PL WWAY","West"]
[33722,"HALSEY DR","Central"]
[51434,"HALSEY RD","South West Urban"]
[30575,"HALSEY ST","Central"]
[15231,"HALSEY ST/VIADUCT HARBOUR AVE CYWAY","Central"]
[15225,"HALSEY ST/VICTORIA PARK LINK CYWAY (RP20)","Central"]
[53023,"HALSTEAD PL","South East Urban"]
[33723,"HALSTON RD","Central"]
[51435,"HALSWELL ST","South West Urban"]
[51436,"HALVER RD","South West Urban"]
[40832,"HALYARD PL","West"]
[48181,"HALYARD PL WWAY 1","West"]
[48182,"HALYARD PL WWAY 2","West"]
[22212,"HAMANA ST","North Urban East"]
[10382,"HAMATANA RD","North Rural"]
[40831,"HAMBLYN PL","West"]
[30576,"HAMER ST","Central"]
[33724,"HAMES TCE","Central"]
[35897,"HAMES/HILLSBOROUGH WWAY (RP13)","Central"]
[51437,"HAMILL RD","South West Urban"]
[70862,"HAMILTON DR","South Rural"]
[20412,"HAMILTON PL (GLENFIELD)","North Urban West"]
[70962,"HAMILTON PL (PUKEKOHE)","South Rural"]
[70233,"HAMILTON RD (AWHITU)","South Rural"]
[30577,"HAMILTON RD (HERNE BAY)","Central"]
[51438,"HAMILTON RD (PAPATOETOE)","South West Urban"]
[33726,"HAMILTON RD (WAIHEKE)","Hauraki Islands"]
[10383,"HAMILTON RD (WAIMAUKU)","North Rural"]
[10384,"HAMILTON RD 2 (WARKWORTH)","North Rural"]
[71409,"HAMILTON RD SLIP (AWHITU)","South Rural"]
[51439,"HAMISH PL","South East Urban"]
[70963,"HAMLET PL","South Rural"]
[60336,"HAMLIN RD (ARDMORE)","South Rural"]
[70234,"HAMLIN RD (AWHITU)","South Rural"]
[33727,"HAMLIN RD (MT WELLINGTON)","Central East"]
[60544,"HAMLIN RD SLIP","South Rural"]
[10385,"HAMMOND AVE","North Urban East"]
[22081,"HAMMOND PL","North Urban West"]
[26047,"HAMMOND PL CARPARK DP 38599 LOT 10","North Urban West"]
[26044,"HAMMOND PL CARPARK DP 38599 LOT 6","North Urban West"]
[33728,"HAMON AVE","Central"]
[31654,"HAMON AVE LOOP","Central"]
[53470,"HAMPERVALE PL","South East Urban"]
[33729,"HAMPSTEAD RD","Central"]
[30578,"HAMPTON DR","Central East"]
[35641,"HAMPTON HTS (PVT)","Central East"]
[80059,"HAMPTON MEWS","North Rural"]
[40830,"HAMURANA PL","West"]
[10386,"HAND RD","North Rural"]
[20749,"HANDLEY AVE","North Urban East"]
[30579,"HANENE ST","Central East"]
[51441,"HANFORD PL","South West Urban"]
[54376,"HANFORD PL EXTN","South West Urban"]
[80696,"HANGAHAI RD","South East Urban"]
[10387,"HANHAM RD","North Rural"]
[22181,"HANLON CRES","North Urban East"]
[41341,"HANLY CLOSE","North Urban West"]
[51442,"HANNAH RD","South West Urban"]
[30700,"HANNIGAN DR","Central East"]
[35797,"HANNIGAN/MERTON WWAY (RP611 RHS)","Central East"]
[60122,"HANOVER PL","South West Urban"]
[10389,"HANOVER ST 2 (WELLSFORD)","North Rural"]
[33730,"HANS ST","South West Urban"]
[60629,"HANSEN PL","South West Urban"]
[40829,"HANSON PL","West"]
[53046,"HANSWORTH PL","South East Urban"]
[40828,"HANUI PL","West"]
[52993,"HAPE DR (AIRPORT)","South West Urban"]
[30580,"HAPIMANA ST","Central East"]
[30581,"HAPUA ST","Central East"]
[35754,"HAPUA/WILES WWAY (RP294 LHS)","Central East"]
[80454,"HAPUKA CLOSE","North Rural"]
[80430,"HARAKEKE ROAD","North Urban West"]
[51443,"HARANIA AVE","South West Urban"]
[10390,"HARANUI RD","North Rural"]
[30582,"HARAPAKI RD","Central East"]
[35048,"HARATAONGA RD","Hauraki Islands"]
[10391,"HARATAUA RD","North Rural"]
[70866,"HARBOUR CREST DR","South Rural"]
[41228,"HARBOUR LIGHTS CLOSE","North Urban West"]
[11537,"HARBOUR PDE","North Urban East"]
[54820,"HARBOUR RIDGE DR","South West Urban"]
[30583,"HARBOUR ST","Central"]
[35023,"HARBOUR ST LLA (#10 - #16)","Central"]
[10392,"HARBOUR VIEW RD (LEIGH)","North Rural"]
[30584,"HARBOUR VIEW RD (PT CHEVALIER)","Central"]
[40827,"HARBOUR VIEW RD (WAITAKERE)","West"]
[10393,"HARBOUR VIEW RD 2 (POINT WELLS)","North Rural"]
[15155,"HARBOUR VIEW RD/KAREMOANA DR CYWAY","West"]
[33731,"HARBOUR VIEW TCE","Central East"]
[47115,"HARBOUR VIEW/BEACH RAB","West"]
[35783,"HARBOUR VIEW/PT CHEV W/WAY (RP483)","Central"]
[11341,"HARBOUR VILLAGE DR","North Urban East"]
[53542,"HARBOURSIDE CRT","South Rural"]
[60594,"HARBOURSIDE DR","South West Urban"]
[15672,"HARBOURSIDE DR EAST LINK CYWAY (RP1608)","South West Urban"]
[15669,"HARBOURSIDE DR EAST LINK CYWAY (RP1789)","South West Urban"]
[15673,"HARBOURSIDE DR LINK CYWAY (RP1300)","South West Urban"]
[15668,"HARBOURSIDE DR LINK CYWAY (RP1789)","South West Urban"]
[15667,"HARBOURSIDE DR WEST LINK CYWAY (RP1608)","South West Urban"]
[15670,"HARBOURSIDE DR/PESCARA PT CYWAY (RP2497)","South West Urban"]
[60707,"HARBOURSIDE/ISLAND RAB","South West Urban"]
[60601,"HARBOURSIDE/PORTOFINO RAB","South West Urban"]
[33732,"HARBUTT AVE","Central"]
[30585,"HARCOURT ST","Central"]
[20644,"HARDENS LANE","North Urban West"]
[51444,"HARDIE ST","South West Urban"]
[33733,"HARDING AVE (PANMURE)","Central East"]
[40826,"HARDING AVE (WAITAKERE)","West"]
[10394,"HARDING RD","North Rural"]
[30586,"HARDINGE ST","Central"]
[35891,"HARDINGE/FANSHAWE WWAY (RP124)","Central"]
[33734,"HARDINGTON ST","Central East"]
[33735,"HARDLEY AVE (THREE KINGS)","Central"]
[10395,"HARDLEY AVE (TINDALLS BAY)","North Urban East"]
[80723,"HAREWOOD STREET","North Urban West"]
[51445,"HARFORD PL","South East Urban"]
[33736,"HARGEST TCE","Central"]
[30587,"HARGREAVES ST","Central"]
[35727,"HARGREAVES/BEAUMONT WWAY (RP0)","Central"]
[22838,"HARKIN CLOSE","North Urban West"]
[70235,"HARKNESS RD","South Rural"]
[24095,"HARLEY  WAY (PVT)","North Urban East"]
[20126,"HARLEY RD","North Urban East"]
[22549,"HARLEY RD LOWER","North Urban East"]
[22550,"HARLEY RD UPPER","North Urban East"]
[30588,"HARLOW PL","Central East"]
[33737,"HARLSTON RD","Central"]
[40825,"HARMEL RD","West"]
[33738,"HARMONY AVE","South West Urban"]
[53018,"HAROBED PL","South West Urban"]
[33739,"HAROLD ST","Central"]
[33740,"HARONUI RD","Central East"]
[22082,"HARPER ST (ONEWA)","North Urban West"]
[60123,"HARPER ST (RED HILL)","South West Urban"]
[33741,"HARPOON HILL","Hauraki Islands"]
[60124,"HARRIER PL","South West Urban"]
[51446,"HARRIET ST","South West Urban"]
[70964,"HARRINGTON AVE","South Rural"]
[40823,"HARRINGTON RD","West"]
[80335,"HARRIS DR","North Urban East"]
[51447,"HARRIS RD (EAST TAMAKI)","South East Urban"]
[33742,"HARRIS RD (MT WELLINGTON)","Central East"]
[70965,"HARRIS ST","South Rural"]
[35640,"HARRISON MEWS (PVT)","Central East"]
[60401,"HARRISON RD (DRURY)","South Rural"]
[33743,"HARRISON RD (MT WELLINGTON)","Central East"]
[20101,"HARRISON ST (BELMONT)","North Urban East"]
[10396,"HARRISON ST (WELLSFORD)","North Rural"]
[11379,"HARRISON ST SERVICE LANE","North Rural"]
[80286,"HARRISVILLE RD","South Rural"]
[33744,"HARROD ST","Central East"]
[51448,"HARROW PL","South West Urban"]
[22995,"HARROWGLEN DR","North Urban West"]
[80529,"HARROWGLEN DR (HLA)","North Urban West"]
[60402,"HARRY DODD RD","South Rural"]
[60403,"HARRY DREADON RD","South Rural"]
[30589,"HARRY HUMAN HGTS","Central East"]
[70960,"HARRY MOORE PL","South Rural"]
[40822,"HARRY WARD PL","West"]
[40821,"HARRYBROOK RD","West"]
[70241,"HART RD (PUKEKOHE)","South Rural"]
[20125,"HART RD (TAKAPUNA)","North Urban East"]
[15009,"HART RD/HARLEY CL CYWAY","North Urban East"]
[60125,"HARTFIELD RISE","South West Urban"]
[30590,"HARTLAND AVE","Central East"]
[51449,"HARTLES PL","South East Urban"]
[33745,"HARTLEY AVE","Hauraki Islands"]
[40820,"HARTLEY TCE","West"]
[70242,"HARTNER RD","South Rural"]
[10397,"HARURU RD","North Rural"]
[22679,"HARVARD PL (ALBANY)","North Urban West"]
[51450,"HARVARD PL (MANGERE)","South West Urban"]
[41440,"HARVARD ST","North Urban West"]
[80553,"HARVEST AVE","North Urban East"]
[41229,"HARVEST DR","West"]
[48099,"HARVEST DRV WWAY","West"]
[30591,"HARVEY PL","Central East"]
[70244,"HARVEY RD","South Rural"]
[51451,"HARWELL PL","South West Urban"]
[53841,"HARWELL PL-KILLINGTON CRES","South West Urban"]
[53840,"HARWELL PL-UPWOOD PL","South West Urban"]
[11628,"HARWICH CRT","North Urban East"]
[51452,"HARWOOD CRES","South West Urban"]
[33747,"HARWOOD RD","Central East"]
[33749,"HARWOOD ST","Central"]
[35723,"HARWOOD/FERNDALE WWAY (RP327)","Central East"]
[30592,"HASBURY AVE","Central"]
[51453,"HASELER CRES","South East Urban"]
[30593,"HASLETT ST","Central"]
[15317,"HASLETT ST/MOTORWAY LINK CYWAY","Central"]
[40819,"HASSAN DR","West"]
[48285,"HASSAN DRV WWAY","West"]
[52799,"HASTIE AVE (EAST)","South West Urban"]
[51454,"HASTIE AVE (WEST)","South West Urban"]
[20746,"HASTINGS PDE","North Urban East"]
[22326,"HASTINGS RD","North Urban East"]
[22829,"HASTINGS RD HLA","North Urban East"]
[22223,"HASTINGS RD LLA","North Urban East"]
[20877,"HASTINGS RD SERVICE LANE","North Urban East"]
[80438,"HASTINGS STREET","North Urban West"]
[11176,"HASZARD RD","West"]
[10399,"HATFIELD HEIGHTS","North Urban East"]
[23065,"HATFIELD PL","North Urban West"]
[51455,"HATHERLEY PL","South West Urban"]
[20407,"HATHERLOW ST","North Urban West"]
[51456,"HATTAWAY AVE","South East Urban"]
[54835,"HATTAWAY-DEVON RD","South East Urban"]
[70243,"HATTON RD (AWHITU)","South Rural"]
[10400,"HATTON RD (OREWA)","North Urban East"]
[33750,"HAUGHEY AVE","Central"]
[10401,"HAUITI DR","North Rural"]
[33752,"HAUITI RD","South West Urban"]
[30594,"HAULTAIN ST","Central"]
[51457,"HAUMIA WAY","South West Urban"]
[80705,"HAURAHI PAI ROAD","North Rural"]
[20674,"HAURAKI CRES","North Urban West"]
[20097,"HAURAKI RD (HAURAKI)","North Urban East"]
[10402,"HAURAKI RD (LEIGH)","North Rural"]
[33751,"HAURAKI RD (WAIHEKE)","Hauraki Islands"]
[53239,"HAUTU DR","South West Urban"]
[20446,"HAVANA PL","North Urban West"]
[40818,"HAVELLE AVE","West"]
[20294,"HAVELOCK AVE","North Urban East"]
[52915,"HAVEN CREST","South East Urban"]
[53272,"HAVEN DR","South East Urban"]
[54472,"HAVEN/MATARANGI RAB","South East Urban"]
[20558,"HAVENWOOD PL","North Urban West"]
[33753,"HAVERSTOCK RD","Central"]
[11569,"HAVILAH VIEW","North Urban East"]
[11413,"HAWAIIAN PDE","North Urban East"]
[30595,"HAWAIKI ST","Central East"]
[30596,"HAWEA RD","Central"]
[30597,"HAWERA RD","Central East"]
[53647,"HAWKDUN DR","South East Urban"]
[10405,"HAWKE ACCESS RD","North Rural"]
[51458,"HAWKE CRES","South Rural"]
[70966,"HAWKE PL","South Rural"]
[10404,"HAWKENS RD","North Rural"]
[10406,"HAWKING RD","North Rural"]
[30598,"HAWKINS ST","Central East"]
[35852,"HAWKINS/RIPON WWAY (RP128 RHS)","Central East"]
[53105,"HAWKLEY CLOSE","South East Urban"]
[71449,"HAWTHORNE LANE","South Rural"]
[33755,"HAWTHORNE PL","Central East"]
[33756,"HAY PL","Central"]
[33757,"HAY RD","Central East"]
[30600,"HAYCOCK AVE","Central"]
[34913,"HAYDEN ST","Central"]
[33759,"HAYDN AVE","Central East"]
[51459,"HAYES PL","South East Urban"]
[40817,"HAYES RD","West"]
[60491,"HAYFIELD WAY","South West Urban"]
[52790,"HAYLEY LANE","South East Urban"]
[22048,"HAYMAN PL","North Urban West"]
[51460,"HAYMAN ST","South West Urban"]
[33760,"HAYR RD","Central"]
[51461,"HAYWARD RD","South West Urban"]
[10407,"HAYWOOD LANE","North Rural"]
[51462,"HAZARDS RD","South West Urban"]
[54059,"HAZARDS RD CARPARK (RP193 LHS)","South West Urban"]
[33761,"HAZEL AVE","Central"]
[22983,"HAZEL GLEN (PVT)","North Urban West"]
[60126,"HAZELDENE PL","South West Urban"]
[51463,"HAZELMAY PL","South East Urban"]
[33762,"HAZELMERE RD","Central"]
[10408,"HAZELMERE ST","North Rural"]
[70248,"HEAD RD","South Rural"]
[51464,"HEADCORN PL","South East Urban"]
[15693,"HEADCORN PL LINK CYWAY","South East Urban"]
[80607,"HEADLAND DR","North Urban East"]
[70249,"HEALD RD","South Rural"]
[24075,"HEALTH RD (PVT)","North Urban East"]
[51465,"HEALY RD","South West Urban"]
[30601,"HEAPHY ST","West"]
[60335,"HEARD RD","South West Urban"]
[21032,"HEATH AVE","North Urban West"]
[51466,"HEATHBERRY CLOSE","South West Urban"]
[54507,"HEATHBERRY CLOSE EXTN","South West Urban"]
[20228,"HEATHCOTE RD","North Urban East"]
[60127,"HEATHDALE CRES","South West Urban"]
[60519,"HEATHDALE CRES LINK RD","South West Urban"]
[20341,"HEATHER PL","North Urban East"]
[30602,"HEATHER ST","Central"]
[30603,"HEATHERBANK ST","Central East"]
[22327,"HEATHERLEIGH RISE","North Urban East"]
[20573,"HEATHGLEN PL","North Urban West"]
[52779,"HEATHRIDGE PL","South East Urban"]
[22563,"HEATON GR","North Urban West"]
[10409,"HEAVEN RD","North Rural"]
[60441,"HEB PL","South West Urban"]
[22084,"HEBE PL","North Urban West"]
[22328,"HEBRON RD","North Urban East"]
[35036,"HECTOR SANDERSON RD","Hauraki Islands"]
[30604,"HECTOR ST","Central"]
[51467,"HEDGE ROW","South East Urban"]
[33764,"HEDLEY RD","Central"]
[60511,"HEENANS WAY","South West Urban"]
[53618,"HEIDI CRES","South East Urban"]
[70250,"HEIGHTS RD","South Rural"]
[30605,"HEKE ST","Central"]
[33765,"HEKERUA RD","Hauraki Islands"]
[30606,"HELEN PL","Central East"]
[22739,"HELEN RYBURN PL","North Urban East"]
[40816,"HELENA ST","West"]
[48313,"HELENA ST WWAY","West"]
[40815,"HELGA CRES","West"]
[54815,"HELIANTHUS AVE","South East Urban"]
[20371,"HELICON PL","North Urban West"]
[41342,"HELIOS PL","West"]
[51468,"HELLABYS RD","South West Urban"]
[71308,"HELLAND DR","South Rural"]
[40814,"HELLEUR RD","West"]
[10410,"HELLYER RD","North Rural"]
[22085,"HELLYERS ST","North Urban West"]
[51469,"HELMS PL","South West Urban"]
[15445,"HELMS PL/MINTON PL SB CYWAY","South West Urban"]
[22329,"HELVETIA DR","North Urban East"]
[70252,"HELVETIA RD","South Rural"]
[20095,"HEMI ST","North Urban East"]
[30607,"HEMINGTON ST","Central"]
[51470,"HEMSWAY PL","South East Urban"]
[33766,"HENDERSON PL","Central East"]
[40002,"HENDERSON VALLEY RD","West"]
[41060,"HENDERSON VALLEY/FOREST HILL RAB","West"]
[33767,"HENDON AVE","Central"]
[47098,"HENDRIKA CRT","North Urban West"]
[33768,"HENDRY AVE","Central"]
[15291,"HENDRY AVE/MELROSE RD EAST CYWAY","Central"]
[36103,"HENEHAN CRES (PVT)","Central"]
[10411,"HENLEY RD (KAUKAPAKAPA)","North Rural"]
[33769,"HENLEY RD (MT EDEN)","Central"]
[31634,"HENLEY/WOODSIDE RAB","Central"]
[54233,"HENRIETTE PL","South West Urban"]
[70967,"HENRY CURD TCE","South Rural"]
[71240,"HENRY LANE","South Rural"]
[35059,"HENRY LOUIS CRT (PVT)","Central"]
[22953,"HENRY PARTINGTON PL","North Urban West"]
[22691,"HENRY ROSE PL","North Urban West"]
[30608,"HENRY ST","West"]
[33770,"HENSHAW AVE","Central"]
[30609,"HENSLOWE PL","Central East"]
[51471,"HENSON RD","South Rural"]
[51472,"HENWOOD RD (PAPATOETOE)","South West Urban"]
[10176,"HENWOOD RD (TAUPAKI)","North Rural"]
[54584,"HENWOOD RD EXTN","South West Urban"]
[11544,"HEPBURN #3469 (PVT)","North Rural"]
[10412,"HEPBURN CREEK RD","North Rural"]
[40812,"HEPBURN RD","West"]
[48123,"HEPBURN RD WWAY","West"]
[30610,"HEPBURN ST","Central"]
[40025,"HEPPER ST","West"]
[51473,"HERALD PL","South West Urban"]
[80595,"HERBERT POLLARD DR","South Rural"]
[33771,"HERBERT RD","Central"]
[20133,"HERBERT ST","North Urban East"]
[47130,"HERCULES DR","West"]
[34715,"HERD RD","Central"]
[30611,"HERDMAN ST","Central"]
[35745,"HERDMAN/DAVENTRY WWAY (RP381)","Central"]
[30612,"HEREFORD ST (CITY)","Central"]
[40811,"HEREFORD ST (WAITAKERE)","West"]
[48178,"HEREFORD ST WWAY","West"]
[40810,"HEREMAI ST","West"]
[33772,"HERETAUNGA AVE","Central East"]
[35638,"HERITAGE ESTATE (PVT)","Central East"]
[11506,"HERITAGE LANE","North Rural"]
[35066,"HERITAGE RISE","Central East"]
[53406,"HERITAGE WAY","South West Urban"]
[10413,"HERMAN ST","North Urban East"]
[30613,"HERNE BAY RD","Central"]
[15217,"HERNE BAY TENNIS CLUB CYWAY","Central"]
[11345,"HERON LANE","North Rural"]
[51474,"HERON PL (PAKURANGA)","South East Urban"]
[70898,"HERON PL (WAIUKU)","South Rural"]
[22797,"HERONS WAY","North Urban West"]
[41343,"HERRINGS COVE PL","West"]
[30614,"HERRINGSON AVE","Central"]
[30615,"HERTFORD ST","West"]
[33773,"HESKETH ST","Central"]
[40024,"HETANA ST","West"]
[15135,"HETANA ST/TRAIN STATION CYWAY","West"]
[40809,"HETHERINGTON RD","West"]
[41230,"HEVERSHAM PL","West"]
[40808,"HEWLETT RD","West"]
[47171,"HEWLETT/REYNELLA RAB","West"]
[11621,"HEWSON DR","North Rural"]
[33774,"HEWSON ST","Central East"]
[10414,"HEXHAM ST","North Rural"]
[51475,"HEYBRIDGE ST","South West Urban"]
[53842,"HEYBRIDGE ST-WORDSWORTH RD","South West Urban"]
[51476,"HEYFORD CLOSE","South West Urban"]
[54605,"HEYFORD CLOSE LOOP","South West Urban"]
[15529,"HEYFORD CLOSE/MASCOT AVE CYWAY","South West Urban"]
[53248,"HEYINGTON WAY","South East Urban"]
[30616,"HEYWOOD CRES","Central"]
[47099,"HIBERNIAN DR","West"]
[10415,"HIBISCUS AVE","North Rural"]
[11250,"HIBISCUS COAST HIGHWAY (170 - 176)","North Urban East"]
[11247,"HIBISCUS COAST HIGHWAY (178 - 202)","North Urban East"]
[11252,"HIBISCUS COAST HIGHWAY (29 - 41)","North Urban East"]
[11251,"HIBISCUS COAST HIGHWAY (86 - 130)","North Urban East"]
[15053,"HIBISCUS COAST HIGHWAY LINK CYWAY (RP6914)","North Urban East"]
[15038,"HIBISCUS COAST HIGHWAY LINK CYWAY RP(6950)","North Urban East"]
[15022,"HIBISCUS COAST HIGHWAY/ROSARIO CRES CYWAY","North Urban East"]
[80271,"HIBISCUS COAST HWAY","North Urban East"]
[11299,"HIBISCUS COAST HWAY (OREWA - NTHBND)","North Urban East"]
[11302,"HIBISCUS COAST HWAY (SDALE - NTHBND)","North Urban East"]
[24070,"HIBISCUS CRES (PVT)","North Urban West"]
[80206,"HIBISCUS DR","North Urban East"]
[33775,"HIBISCUS PL","Central"]
[40807,"HICKORY AVE","West"]
[33777,"HIGGS RD","Central East"]
[20434,"HIGH RD","North Urban West"]
[30617,"HIGH ST (CITY)","Central"]
[20460,"HIGH ST (DEVONPORT)","North Urban East"]
[33778,"HIGH ST (OTAHUHU)","South West Urban"]
[35071,"HIGH TREES PL (PVT)","Central East"]
[10416,"HIGHAM FERRERS PL","North Urban East"]
[10417,"HIGHAM RD","North Rural"]
[52609,"HIGHBROOK DR","South East Urban"]
[54142,"HIGHBROOK DR (NORTHBOUND/OTARA)","South West Urban"]
[54808,"HIGHBROOK DR (NORTHBOUND/TAMAKI) (SE)","South East Urban"]
[54809,"HIGHBROOK DR (SOUTHBOUND/OTARA) (SW)","South West Urban"]
[54141,"HIGHBROOK DR (SOUTHBOUND/TAMAKI) (SE)","South East Urban"]
[15552,"HIGHBROOK DR NB LINK CYWAY(RP1972)","South East Urban"]
[15549,"HIGHBROOK DR NB LOOP LINK CYWAY (RP960)","South East Urban"]
[80681,"HIGHBROOK DR SE SERVICE LANE (RP 353)","South East Urban"]
[80683,"HIGHBROOK DR SE SERVICE LANE (RP 754)","South East Urban"]
[15548,"HIGHBROOK DR/PUKEKIWIRIKI PL CYWAY","South East Urban"]
[15553,"HIGHBROOK DR/WAIOURU RD CYWAY (RP970)","South East Urban"]
[80684,"HIGHBROOK OFFICE PARK RAB","South East Urban"]
[80685,"HIGHBROOK OFFICE PARK SERVICE LANE","South East Urban"]
[15550,"HIGHBROOK PARK CARPARK LINK CYWAY","South East Urban"]
[54049,"HIGHBROOK/HELLABYS RAB","South West Urban"]
[22086,"HIGHBURY BYPASS","North Urban West"]
[30618,"HIGHBURY ST","West"]
[33779,"HIGHCLIFFE RD","Central"]
[47100,"HIGHFIELDS TCE","West"]
[52765,"HIGHGATE PL","South East Urban"]
[22790,"HIGHGROVE LANE","North Urban West"]
[40806,"HIGHLAND AVE","West"]
[40594,"HIGHLAND AVE LLA (#6 - #22)","West"]
[51477,"HIGHLAND PARK DR (EASTBOUND)","South East Urban"]
[54538,"HIGHLAND PARK DR (WESTBOUND)","South East Urban"]
[33780,"HIGHLAND RD","Central"]
[40805,"HIGHLIGHT PDE","West"]
[51478,"HIGHRIDGE RD (PAPAKURA)","South Rural"]
[51257,"HIGHRIDGE RD EXTENSION #1 (RP855 LHS)","South Rural"]
[51259,"HIGHRIDGE RD EXTENSION #2","South Rural"]
[33781,"HIGHWIC AVE","Central"]
[22330,"HIGHWOOD GR","North Urban East"]
[80363,"HIHI AVE","South West Urban"]
[40804,"HIKURANGI ST","West"]
[54236,"HILBORN RD","South East Urban"]
[51479,"HILDA RD","South West Urban"]
[60128,"HILL CRES (PAPAKURA)","South West Urban"]
[40023,"HILL CRES (WAITAKERE)","West"]
[47172,"HILL CRES EXTN","West"]
[70259,"HILL RD (GLENBROOK BEACH)","South Rural"]
[51481,"HILL RD (MANUREWA)","South West Urban"]
[51482,"HILL RD (PAPATOETOE)","South West Urban"]
[33776,"HILL RD (WAIHEKE)","Hauraki Islands"]
[15559,"HILL RD LINK CYWAY","South West Urban"]
[51480,"HILL RISE","South East Urban"]
[15813,"HILL RISE/MEANDA GARDENS CYWAY","South East Urban"]
[53843,"HILL RISE-HAMISH PL","South East Urban"]
[10418,"HILL ST (LEIGH)","North Rural"]
[34716,"HILL ST (ONEHUNGA)","Central East"]
[10421,"HILL ST 3 (WARKWORTH)","North Rural"]
[54335,"HILL/SCENIC RAB","South West Urban"]
[54332,"HILL/STRATFORD RAB","South West Urban"]
[34993,"HILL/TIRI VIEW RD SLIP (RP1353 RHS)","Hauraki Islands"]
[20113,"HILLARY CRES","North Urban East"]
[15028,"HILLARY CRES LINK CYWAY (RP124)","North Urban East"]
[15029,"HILLARY CRES LINK CYWAY (RP284)","North Urban East"]
[40803,"HILLARY HEIGHTS AVE","West"]
[10422,"HILLARY SQUARE","North Urban East"]
[20567,"HILLCREST AVE","North Urban West"]
[51483,"HILLCREST GR","South West Urban"]
[10423,"HILLCREST RD (OREWA)","North Urban East"]
[51484,"HILLCREST RD (PAPATOETOE)","South West Urban"]
[11269,"HILLCREST RD ACCESSWAY (NO 55)","North Urban East"]
[53844,"HILLCREST RD-STATION RD","South West Urban"]
[40802,"HILLING ST","West"]
[40801,"HILLMAN PL","West"]
[48212,"HILLMAN PL WWAY","West"]
[51485,"HILLS RD","South West Urban"]
[54203,"HILLS RD CARPARK (RP386 LHS)","South West Urban"]
[15611,"HILLS RD/OTARA CREEK RESERVE CYWAY","South West Urban"]
[33783,"HILLSBOROUGH RD (HILLSBOROUGH)","Central"]
[36039,"HILLSBOROUGH RD (LYNFIELD)","Central"]
[15297,"HILLSBOROUGH RD/MELROSE RD EAST CYWAY","Central"]
[33784,"HILLSDALE RD","Central"]
[10424,"HILLSIDE CRES","North Rural"]
[33785,"HILLSIDE CRES NORTH","Central"]
[33786,"HILLSIDE CRES SOUTH","Central"]
[31644,"HILLSIDE CRES SOUTH HAMMERHEAD","Central"]
[33787,"HILLSIDE RD (MT WELLINGTON)","Central East"]
[51486,"HILLSIDE RD (PAPATOETOE)","South West Urban"]
[20050,"HILLSIDE RD (SUNSET NORTH)","North Urban West"]
[34834,"HILLSIDE RD (WAIHEKE)","Hauraki Islands"]
[51487,"HILLTOP RD (MANUKAU HEIGHTS)","South East Urban"]
[70261,"HILLTOP RD (PUKEKOHE)","South Rural"]
[30619,"HILLTOP ST","Central East"]
[30273,"HILLVIEW AVE","West"]
[70262,"HILLVIEW RD","South Rural"]
[41344,"HILLWELL DR","West"]
[15112,"HILLWELL DR LINK CYWAY (RP427)","West"]
[48108,"HILLWELL DRV WWAY","West"]
[33788,"HILSTAN PL","Central East"]
[23007,"HILTON CLOSE","North Urban West"]
[30621,"HILTON PL","Central East"]
[35879,"HILTON/LEYBOURNE WWAY (RP79 LHS)","Central East"]
[33789,"HIMALAYA CRES","Central"]
[51488,"HIMALAYA DR","South East Urban"]
[30622,"HIMIKERA AVE","West"]
[30623,"HINAKI ST","Central East"]
[51489,"HINAU RD (MANGERE)","South West Urban"]
[60004,"HINAU RD (NORTHBOUND)","South West Urban"]
[60404,"HINAU RD (SOUTHBOUND)","South West Urban"]
[10425,"HINAU RD (WAIMAUKU)","North Rural"]
[40090,"HINAU ST","West"]
[60608,"HINAU/FOUNTAIN RAB","South West Urban"]
[53005,"HINCKLEY CRT","South East Urban"]
[10426,"HINDLE RD","North Rural"]
[40800,"HINDMARSH ST","West"]
[48081,"HINDMARSH ST WWAY","West"]
[40132,"HINEKOHU ST","West"]
[10427,"HINEMOA PL","North Rural"]
[22087,"HINEMOA ST","North Urban West"]
[22901,"HINEMOA TCE","North Urban West"]
[40799,"HINERAU ST","West"]
[48082,"HINERAU ST WWAY","West"]
[60414,"HINGAIA RD","South West Urban"]
[51490,"HINTON PL","South West Urban"]
[34866,"HIRA WAY  (PVT)","Central"]
[80374,"HIRIMATE PL","South East Urban"]
[30624,"HIRIRI AVE","Central East"]
[24013,"HITCHCOCK CRES (PVT)","North Urban West"]
[60485,"HITCHCOCK RD","South West Urban"]
[10428,"HIWI CRES","North Urban East"]
[20518,"HIWIHAU PL","North Urban West"]
[71388,"HIWINUI RD","South Rural"]
[30625,"HOANI GL","Central East"]
[31581,"HOANI GL EXTN","Central East"]
[51491,"HOBART CRES","South West Urban"]
[10429,"HOBBS RD","North Urban East"]
[20528,"HOBBY AVE","North Urban West"]
[30626,"HOBDAY PL","Central East"]
[41345,"HOBIE CRT","North Urban West"]
[51492,"HOBILL AVE","South West Urban"]
[51493,"HOBMAN PL","South West Urban"]
[35658,"HOBSON CIRCLE (PVT)","Central East"]
[33791,"HOBSON DR","Central East"]
[31612,"HOBSON DR SHOPPING CENTRE SLIP","Central East"]
[22731,"HOBSON HEIGHTS RD","North Urban West"]
[20639,"HOBSON RD","North Urban West"]
[30627,"HOBSON ST","Central"]
[34853,"HOBSON ST BRIDGE","Central"]
[33792,"HOBSON TCE","Hauraki Islands"]
[80284,"HOBSONVILLE POINT RD (EASTBOUND)","North Urban West"]
[80295,"HOBSONVILLE POINT RD (WESTBOUND)","North Urban West"]
[40798,"HOBSONVILLE RD","North Urban West"]
[47173,"HOBSONVILLE RD LLA (#165 - #159)","North Urban West"]
[53084,"HOCKEN PL","South West Urban"]
[10431,"HODGART RD","North Rural"]
[35659,"HOFFMANS WAY (PVT)","Central"]
[70968,"HOGAN ST","South Rural"]
[20428,"HOGANS RD","North Urban West"]
[41346,"HOGARTH RISE","North Urban West"]
[48240,"HOGARTH RISE WWAY","North Urban West"]
[34717,"HOHERIA RD","Central East"]
[30628,"HOHIPERE ST","Central"]
[51495,"HOKIANGA ST","South West Urban"]
[33793,"HOKONUI RD","South West Urban"]
[80349,"HOKONUI RD - ATKINSON AVE","South West Urban"]
[24051,"HOKOWHITU PL (PVT)","North Urban West"]
[51496,"HOLBORN PL","South West Urban"]
[51497,"HOLBROOK PL","South East Urban"]
[30629,"HOLBROOK ST","West"]
[21034,"HOLDAWAY AVE","North Urban West"]
[51498,"HOLDEN PL","South West Urban"]
[54502,"HOLDEN PL HAMMERHEAD","South West Urban"]
[53845,"HOLDEN PL-CAROLYN ST","South West Urban"]
[51499,"HOLDENS RD (CLEVEDON)","South Rural"]
[40797,"HOLDENS RD (ORATIA)","West"]
[22902,"HOLDER PL","North Urban West"]
[33794,"HOLDSWORTH AVE","Central"]
[40796,"HOLGATE AVE","North Urban West"]
[30630,"HOLGATE RD","Central East"]
[35810,"HOLGATE/KOHIMARAMA WWAY (RP260)","Central East"]
[20197,"HOLIDAY RD (MILFORD)","North Urban East"]
[10432,"HOLIDAY RD (STANMORE BAY)","North Urban East"]
[30631,"HOLLAND AVE","Central East"]
[20274,"HOLLAND RD","North Urban West"]
[70969,"HOLLAND ST","South Rural"]
[35873,"HOLLAND/TRIPOLI WWAY (RP393 END)","Central East"]
[51500,"HOLLINBRIGG PL","South West Urban"]
[34889,"HOLLOWAY PL","Central East"]
[80652,"HOLLOWOUT ST","South West Urban"]
[30632,"HOLLY ST","West"]
[51501,"HOLLY WAY","South East Urban"]
[51502,"HOLLYFORD DR","South West Urban"]
[22331,"HOLLYHOCK PL","North Urban East"]
[33795,"HOLLYWOOD AVE (ROYAL OAK)","Central"]
[40795,"HOLLYWOOD AVE (WAITAKERE)","West"]
[40794,"HOLMAN RD","West"]
[40793,"HOLMES DR","West"]
[40792,"HOLMES DR SOUTH","West"]
[51503,"HOLMES RD","South West Urban"]
[51504,"HOLROYD PL","South West Urban"]
[47335,"HOLSTEN PL","West"]
[22332,"HOLT AVE","North Urban East"]
[22088,"HOLYOAKE PL","North Urban West"]
[33797,"HOMAI RD","Hauraki Islands"]
[30633,"HOMAI ST","Central East"]
[22894,"HOME PL","North Urban West"]
[30634,"HOME ST (EAST)","Central"]
[31539,"HOME ST (WEST)","Central"]
[33798,"HOMESTEAD DR","Central East"]
[10433,"HOMESTEAD RD","North Urban East"]
[11351,"HOMEWARD BOUND DR","North Rural"]
[22089,"HOMEWOOD PL","North Urban West"]
[33799,"HONA AVE","Central"]
[30635,"HONAN PL","West"]
[51505,"HONEY PL","South West Urban"]
[22333,"HONEYSUCKLE LANE","North Urban East"]
[10434,"HOOD ST","North Rural"]
[11378,"HOOD ST SERVICE LANE","North Rural"]
[51506,"HOOKER PL","South West Urban"]
[34835,"HOOKS PL","Hauraki Islands"]
[51507,"HOOKS RD","South West Urban"]
[70970,"HOOPER AVE","South Rural"]
[71258,"HOOPER AVE HAMMERHEAD (NORTH)","South Rural"]
[70071,"HOOPER AVE HAMMERHEAD (SOUTH)","South Rural"]
[80622,"HOOTON DR","North Rural"]
[51508,"HOPE FARM AVE","South East Urban"]
[54126,"HOPE FARM AVE CARPARK (RP23 LHS)","South East Urban"]
[51509,"HOPE PL","South West Urban"]
[30636,"HOPE ST","Central"]
[30637,"HOPETOUN ST","Central"]
[33197,"HOPETOUN ST EXTN","Central"]
[35770,"HOPETOUN/HOWE WWAY (RP275 LHS)","Central"]
[30638,"HOPKINS CRES","Central East"]
[26097,"HORIZON VIEW RD","North Urban West"]
[41176,"HORIZON WAY","North Urban West"]
[51510,"HORLICKS PL","South West Urban"]
[23033,"HORNBILL DR","North Urban West"]
[33800,"HORNES LANE","Central East"]
[47325,"HORNSEY AVE","West"]
[33801,"HOROEKA AVE","Central"]
[33802,"HOROPITO ST","Central"]
[20093,"HORORATA ST","North Urban East"]
[33803,"HOROTUTU RD","Central East"]
[10436,"HORSESHOE BUSH RD","North Rural"]
[35069,"HORSHAM PL","Central East"]
[11112,"HORSMAN RD","West"]
[30639,"HORTON AVE","West"]
[30640,"HORWELL PL","West"]
[70272,"HOSKING PL (CLARKS BEACH)","South Rural"]
[70887,"HOSKING PL (WAIUKU)","South Rural"]
[33804,"HOSKINS AVE","Central"]
[33805,"HOSPITAL RD","South West Urban"]
[51511,"HOSPITAL RD (PVT)","South West Urban"]
[51512,"HOSTEL ACCESS RD","South East Urban"]
[51513,"HOTEO AVE","South West Urban"]
[10437,"HOTEO RIVER RD","North Rural"]
[10438,"HOTEO STATION RD","North Rural"]
[20483,"HOTSPUR PL","North Urban West"]
[33806,"HOTUNUI DR","Central East"]
[51514,"HOTUROA PL","South West Urban"]
[30641,"HOUGHTON ST","Central East"]
[22705,"HOUHERE CLOSE","North Urban West"]
[33807,"HOUPARA ST","Central East"]
[51515,"HOUSE AVE","South West Urban"]
[20480,"HOUSTON PL","North Urban West"]
[30642,"HOWARD HUNTER AVE","Central East"]
[21035,"HOWARD RD (NORTHCOTE)","North Urban West"]
[51516,"HOWARD RD (ORERE POINT)","South Rural"]
[15008,"HOWARD RD/PUAWAI PL CYWAY","North Urban West"]
[53846,"HOWARD RD-BAYS RD","South Rural"]
[70851,"HOWDEN ST","South Rural"]
[30643,"HOWE ST (CITY)","Central"]
[51517,"HOWE ST (HOWICK)","South East Urban"]
[10439,"HOWELEN RD","North Rural"]
[33809,"HOWELL CRES","Central"]
[15642,"HOWICK HISTORIC VILLAGE NORTH LINK CYWAY","South East Urban"]
[15641,"HOWICK HISTORIC VILLAGE SOUTH LINK CYWAY","South East Urban"]
[15739,"HOWICK INTERMEDIATE LOOP CYWAY","South East Urban"]
[53512,"HOWITH ST","South East Urban"]
[30644,"HOWLETT ST","Central"]
[41347,"HOYA CRT","West"]
[51518,"HOYLAKE PL","South West Urban"]
[15655,"HOYLAKE PL LINK CYWAY","South West Urban"]
[33811,"HUAPAI ST","Central East"]
[51519,"HUBER ST","South West Urban"]
[30645,"HUBERT HENDERSON PL","Central East"]
[10440,"HUDSON LANE","North Rural"]
[70274,"HUDSON RD (GRAHAMS BEACH)","South Rural"]
[10441,"HUDSON RD (WARKWORTH)","North Rural"]
[33812,"HUDSON ST","Central East"]
[40791,"HUEGLOW RISE","West"]
[40118,"HUGH BROWN DR","West"]
[80355,"HUGH BROWN DR RAB","West"]
[22749,"HUGH GREEN DR","North Urban West"]
[36054,"HUGH LATIMER DR (PVT)","Central East"]
[80708,"HUGH WILSON ROAD","North Urban West"]
[40790,"HUGHDENE PL","West"]
[40789,"HUGHES TCE","West"]
[80321,"HUGHS WAY","South East Urban"]
[34719,"HUGO JOHNSTON DR","Central East"]
[40788,"HUIA DAM RD","West"]
[41421,"HUIA LOOKOUT RD","West"]
[33813,"HUIA RD (OTAHUHU)","South West Urban"]
[51520,"HUIA RD (PAPATOETOE)","South West Urban"]
[30646,"HUIA RD (PT CHEVALIER)","Central"]
[40787,"HUIA RD (WAITAKERE)","West"]
[36020,"HUIA RD CARPARK (RP57 LHS)","Central"]
[41287,"HUIA RD HLA (#266 - #270)","West"]
[47242,"HUIA RD HLA (#689 - #703)","West"]
[20655,"HUIA ST (DEVONPORT)","North Urban East"]
[33810,"HUIA ST (WAIHEKE)","Hauraki Islands"]
[70874,"HUIA ST (WAIUKU)","South Rural"]
[41205,"HUIA/MINNEHAHA RAB","West"]
[22090,"HUKA RD","North Urban West"]
[30647,"HUKANUI CRES","Central"]
[35774,"HUKANUI/TAWARIKI WWAY (RP231)","Central"]
[33814,"HULL PL","Central East"]
[10442,"HULL RD (DAIRY FLAT)","North Rural"]
[70276,"HULL RD (WAIUKU)","South Rural"]
[47054,"HULME PL","West"]
[33815,"HULSE AVE","Central"]
[30648,"HUMARIRI ST","Central"]
[30649,"HUMBER PL","West"]
[20541,"HUME DR","North Urban West"]
[40786,"HUMPHREY KEMP AVE","West"]
[51521,"HUMPHREYS PL","South West Urban"]
[10443,"HUNGRY CREEK RD","North Rural"]
[47055,"HUNTAWAY LANE","West"]
[70278,"HUNTER RD (PATUMAHOE)","South Rural"]
[10445,"HUNTER RD (WAITAKERE)","North Rural"]
[33816,"HUNTERS PARK DR","Central"]
[34879,"HUNTERVILLE CRT (PVT)","Central East"]
[52966,"HUNTINGTON DR","South East Urban"]
[54533,"HUNTINGTON DR SERVICE LANE (RP77)","South East Urban"]
[23041,"HUNTINGTON PARK DR","North Urban West"]
[54530,"HUNTINGTON/COTTESMORE RAB","South East Urban"]
[54532,"HUNTINGTON/SAIDIA RAB","South East Urban"]
[33817,"HUNTINGTREE AVE","Central"]
[33818,"HUNTLY AVE","Central"]
[22334,"HUNTLY RD","North Urban East"]
[60473,"HUNUA GORGE RD","South Rural"]
[70279,"HUNUA RD (HUNUA)","South Rural"]
[60129,"HUNUA RD (PAPAKURA)","South West Urban"]
[70082,"HUNUA/HEALD SLIP","South Rural"]
[10446,"HURDLOW PL","North Urban East"]
[30651,"HURIARO PL","Central East"]
[35821,"HURIARO/PARITAI WWAY (RP63 END)","Central East"]
[40784,"HURLEY PL","West"]
[20153,"HURON ST","North Urban East"]
[26018,"HURON ST CARPARK DP47560, DP30523","North Urban East"]
[33820,"HURST ST","Central East"]
[51522,"HURSTBOURN PRIORS","South West Urban"]
[20038,"HURSTMERE RD","North Urban East"]
[26028,"HURSTMERE RD CARPARK DP11318","North Urban East"]
[26027,"HURSTMERE RD WILSONS CARPRK DP29554","North Urban East"]
[30652,"HURSTWOOD PL","Central East"]
[35882,"HURSTWOOD/CASTLEDINE WWAY","Central East"]
[33819,"HURUHI RD","Hauraki Islands"]
[40783,"HURUHURU RD","West"]
[48220,"HURUHURU RD WWAY","West"]
[40080,"HUTCHINSON AVE","West"]
[10447,"HUTCHINSON RD","North Rural"]
[51523,"HUTCHINSONS RD","South East Urban"]
[15731,"HUTCHINSONS RD/ANGELO AVE CYWAY","South East Urban"]
[51524,"HUTT RD","South West Urban"]
[33821,"HUTTON ST","South West Urban"]
[30653,"HUXLEY PL","Central East"]
[22335,"HYDE RD (BROWNS BAY)","North Urban East"]
[51525,"HYDE RD (CLEVEDON)","South Rural"]
[24089,"HYDE ST (FORREST HILL) (PVT)","North Urban East"]
[51526,"HYDE ST (MANUREWA)","South West Urban"]
[40151,"HYDRA PL","West"]
[71198,"HYLAND PL","South Rural"]
[51527,"HYPERION DR","South West Urban"]
[22336,"HYTHE TCE","North Urban East"]
[51528,"HYWELL PL","South West Urban"]
[53155,"IAN JONES CRT","South East Urban"]
[22847,"IAN MARWICK PL","North Urban West"]
[30654,"IAN MCKINNON DR","Central"]
[31196,"IAN MCKINNON DR (SOUTHBOUND)","Central"]
[40782,"IAN PL","West"]
[22621,"IAN SAGE AVE","North Urban East"]
[33822,"IBERIA PL","Central"]
[51529,"ICARUS PL","South East Urban"]
[54668,"ICARUS PL HAMMERHEAD","South East Urban"]
[11374,"IDA WAY","North Rural"]
[60338,"IDAHO PL","South West Urban"]
[51530,"IDESIA PL","South West Urban"]
[54153,"IDEWILD AVE SERVICE LANE (RP593)","South West Urban"]
[51531,"IDLEWILD AVE","South West Urban"]
[54169,"IDLEWILD AVE CARPARK (RP596 RHS)","South West Urban"]
[15526,"IDLEWILD AVE/SH 20A CYWAY","South West Urban"]
[53055,"IDRIS CRT","South West Urban"]
[22337,"IDYLL PL","North Urban East"]
[52914,"IFIELD CRT","South East Urban"]
[60130,"IGLOO PL","South West Urban"]
[51532,"IHAKA PL","South West Urban"]
[20035,"IHUMATA RD","North Urban East"]
[51533,"IHUMATAO QUARRY RD","South West Urban"]
[51534,"IHUMATAO RD","South West Urban"]
[23026,"ILAM LANE","North Urban West"]
[51535,"ILEX PL","South West Urban"]
[51536,"ILFORD CRES","South West Urban"]
[54608,"ILFORD CRES CARPARK (RP60 LHS)","South West Urban"]
[51537,"ILIAD PL","South West Urban"]
[40781,"ILLANA PL","West"]
[51538,"IMATRA PL","South East Urban"]
[54724,"IMATRA PL LOOP","South East Urban"]
[53847,"IMATRA PL-THE CREST","South East Urban"]
[40780,"IMELDA RD","West"]
[60587,"IMJIN PL","South West Urban"]
[51539,"IMOGENE WAY","South East Urban"]
[33824,"IMPALA PL","Central"]
[53638,"IMPERIAL PL (FLAT BUSH)","South East Urban"]
[40779,"IMPERIAL PL (HENDERSON)","West"]
[51540,"IMRIE AVE","South West Urban"]
[54172,"IMRIE AVE CARPARK (RP490 LHS)","South West Urban"]
[54151,"IMRIE AVE SERVICE LANE (RP486 LHS)","South West Urban"]
[15527,"IMRIE AVE/CHINGFORD CL CYWAY","South West Urban"]
[71488,"INA VILLE DR","South Rural"]
[53006,"INAGH CLOSE","South East Urban"]
[40778,"INAKA PL","West"]
[11492,"INANGA LANE","North Rural"]
[60131,"INCA PL (RED HILL)","South West Urban"]
[10448,"INCA PL (SNELLS BEACH)","North Rural"]
[51541,"INCHINNAM RD","South East Urban"]
[53654,"INDEX PL","South West Urban"]
[51542,"INDUS PL","South East Urban"]
[33825,"INDUSTRY RD","Central East"]
[22338,"INFIDEL PL HAMMERHEAD","North Urban East"]
[20034,"INGA RD","North Urban East"]
[40777,"INGLEBY PL","West"]
[10449,"INGLETON RD","North Rural"]
[30655,"INGLEWOOD ST","Central East"]
[20526,"INGLIS ST","North Urban West"]
[11350,"INGOT PL (PVT)","North Urban East"]
[51543,"INGRAM CRES","South West Urban"]
[70281,"INGRAM RD (BOMBAY)","South Rural"]
[30656,"INGRAM RD (REMUERA)","Central East"]
[60132,"INGRAM ST","South West Urban"]
[33826,"INKERMAN ST","Central East"]
[22094,"INKSTER ST","North Urban West"]
[10450,"INLAND RD","North Rural"]
[60337,"INLET RD","South West Urban"]
[11471,"INLET VIEWS","North Urban East"]
[80269,"INNES BUSH RD","North Rural"]
[33827,"INNISFREE DR","Central East"]
[51544,"INNISMARA AVE","South West Urban"]
[53434,"INNISOWEN PL","South East Urban"]
[53574,"INTREPID CRES","South Rural"]
[22339,"INTREPID PL","North Urban East"]
[40048,"INVER ST","West"]
[30657,"INVERARY AVE","Central"]
[51545,"INVERELL AVE","South West Urban"]
[54301,"INVERELL AVE CARPARK (RP279 RHS)","South West Urban"]
[33828,"INVERMAY AVE","Central"]
[20873,"INVERNESS / BUTE RD SERVICE LANE","North Urban East"]
[22340,"INVERNESS RD","North Urban East"]
[26072,"INVERNESS RD CARPARK SO47144","North Urban East"]
[33829,"INWOOD ST","Central"]
[20649,"IONA AVE","North Urban West"]
[51546,"IONA PL","South West Urban"]
[34720,"IONA RD","Hauraki Islands"]
[51547,"IORANGI PL","South West Urban"]
[51548,"IOTA PL","South West Urban"]
[30658,"IPSWICH PL","Central East"]
[33830,"IRA ST","Central"]
[40776,"IRELAND PL","West"]
[33831,"IRELAND RD (MT WELLINGTON)","Central East"]
[10451,"IRELAND RD (WAITOKI)","North Rural"]
[31602,"IRELAND RD EXTN (RP718 LHS)","Central East"]
[31545,"IRELAND ST (EAST)","Central"]
[30659,"IRELAND ST (WEST)","Central"]
[33832,"IRENE AVE","Central"]
[33833,"IRIRANGI RD","Central East"]
[51549,"IRIS PL","South West Urban"]
[10452,"IRIS ST","North Rural"]
[24069,"IRIS WATCH (PVT)","North Urban West"]
[80288,"IRONGATE AVE","West"]
[53280,"IRONSTONE PL","South West Urban"]
[24014,"IRVINE PL (PVT)","North Urban West"]
[10453,"IRVINE RD","North Rural"]
[70283,"IRWIN RD","South Rural"]
[53186,"ISAAC PL","South East Urban"]
[71364,"ISABELLA DR","South Rural"]
[70106,"ISABELLA DR LOOP","South Rural"]
[30660,"ISHERWOOD PL","Central East"]
[80707,"ISITT ROAD","North Urban West"]
[22095,"ISLAND BAY RD","North Urban West"]
[22229,"ISLAND BAY RD LLA","North Urban West"]
[51551,"ISLAND RD","South West Urban"]
[11223,"ISLAND VIEW DR","North Urban East"]
[60415,"ISLAND VIEW RD","South West Urban"]
[51552,"ISLAND VIEW TCE","South East Urban"]
[51553,"ISLAY PL","South West Urban"]
[80608,"ISLET RD","North Urban East"]
[40094,"ISLINGTON AVE","West"]
[30661,"ISLINGTON ST","Central"]
[20606,"ISOBEL RD","North Urban West"]
[51554,"ISOLA PL","South West Urban"]
[51555,"ISRAEL AVE","South West Urban"]
[54412,"ISRAEL AVE CARPARK (RP710 LHS)","South West Urban"]
[35283,"ITALIA GR (PVT)","Central East"]
[35558,"IVAN WHALE PL (PVT)","Central"]
[32962,"IVANHOE RD","Central"]
[33198,"IVANHOE RD (SOUTH)","Central"]
[51556,"IVON RD","South West Urban"]
[22096,"IVY PL","North Urban West"]
[80524,"IWINUKU CRES","South West Urban"]
[51557,"IXIA PL","South West Urban"]
[15461,"IXIA PL/GRANITE PL CYWAY","South West Urban"]
[10476,"J FARMER RD","North Rural"]
[10478,"J GREENWOOD RD","North Rural"]
[10601,"J MASON RD","North Rural"]
[10958,"J TOLHOPF RD","North Rural"]
[10976,"J TURNWALD RD","North Rural"]
[70277,"J.HULL RD","South Rural"]
[70285,"J.IRWIN RD","South Rural"]
[70514,"J.RENALL RD","South Rural"]
[20734,"JACANAS PL","North Urban West"]
[22099,"JACARANDA AVE","North Urban West"]
[71357,"JACARANDA CRT","South Rural"]
[71478,"JACARANDA RAB","South Rural"]
[41297,"JACINTA GR","West"]
[41298,"JACINTA GR EXTN","West"]
[11207,"JACK BARRY RD","North Rural"]
[33836,"JACK BROWNE PL","South West Urban"]
[35557,"JACK CHRISTIE DR (PVT)","Central"]
[35648,"JACK CLARK WAY (PVT)","Central"]
[51558,"JACK CONWAY AVE","South West Urban"]
[60133,"JACK FARRELL PL","South West Urban"]
[11432,"JACK HAWKEN LANE","North Urban East"]
[22796,"JACK HINTON DR","North Urban West"]
[15013,"JACK HINTON DR/PAUL MATTHEWS RD CYWAY","North Urban West"]
[53402,"JACK LACHLAN DR","South Rural"]
[60405,"JACK PATERSON RD","South Rural"]
[53559,"JACK PL","South East Urban"]
[41400,"JACK SMYTH CRT (PVT)","West"]
[71451,"JACKIES PL","South Rural"]
[10454,"JACKSON CRES","North Rural"]
[71273,"JACKSON PL","South Rural"]
[33835,"JACKSON ST","Central East"]
[10455,"JACKSON WAY","North Urban East"]
[54134,"JACOBS WAY","South Rural"]
[51560,"JACQUELINE PL","South West Urban"]
[51561,"JADE AVE","South East Urban"]
[22759,"JADE CRT","North Urban West"]
[11615,"JADE RIVER - RURAL VEIW WWAY","North Rural"]
[11598,"JADE RIVER PL","North Rural"]
[47101,"JADEWYNN DR","West"]
[60506,"JADON CLOSE","South West Urban"]
[40775,"JAEMONT AVE","West"]
[15204,"JAGGERS BUSH RESERVE/NOTLEY ST CYWAY","Central"]
[30663,"JAMAICA PL","West"]
[71506,"JAMES BRIGHT LANE","South Rural"]
[35570,"JAMES COOK CRES","Central"]
[21036,"JAMES EVANS DR","North Urban West"]
[51562,"JAMES FLETCHER DR","South West Urban"]
[40774,"JAMES LAURIE ST","West"]
[10458,"JAMES MACKIE RD","North Rural"]
[10459,"JAMES MCLEOD RD","North Rural"]
[11476,"JAMES PAIGE LANE","North Rural"]
[60134,"JAMES PL","South West Urban"]
[33837,"JAMES PRESTON AVE","Central"]
[51563,"JAMES RD","South West Urban"]
[15454,"JAMES RD/RECREATIONAL CENTRE CYWAY","South West Urban"]
[40773,"JAMES SCOTT PL","West"]
[20461,"JAMES ST (GLENFIELD)","North Urban West"]
[51564,"JAMES ST (MANGERE)","South West Urban"]
[10461,"JAMES ST 2 (SANDSPIT)","North Rural"]
[33838,"JAMES TYLER CRES","Central"]
[33839,"JAMES WALTER PL","Central East"]
[80532,"JAMIE LANE","North Rural"]
[10462,"JAMIESON RD","North Rural"]
[11612,"JAMISH DR","North Rural"]
[47364,"JAMMEN DR","West"]
[52843,"JAN HIGGINS PL","South East Urban"]
[51565,"JAN PL","South East Urban"]
[35008,"JANA PL (PVT)","Central"]
[51566,"JANDELL CRES","South East Urban"]
[33840,"JANE COWIE AVE","South West Urban"]
[52861,"JANE EYRE DR","South East Urban"]
[10463,"JANE GIFFORD PL (OMAHA BEACH)","North Rural"]
[51567,"JANE GIFFORD PL (PAKURANGA)","South East Urban"]
[34964,"JANE YORK PL (RAK)","Hauraki Islands"]
[51568,"JANESE PL","South West Urban"]
[40013,"JANET CLEWS PL (PVT)","West"]
[40772,"JANET PL","West"]
[51569,"JANET ST","South East Urban"]
[51570,"JANINE PL","South East Urban"]
[51571,"JANOME PL","South East Urban"]
[53519,"JANWAY AVE","South East Urban"]
[22100,"JAPONICA DR","North Urban West"]
[80712,"JARDIN COURT","North Urban East"]
[33841,"JARMAN RD","Central East"]
[40771,"JARRAH PL","West"]
[53403,"JARVIS WAY","South West Urban"]
[24066,"JASMINE KNOLL (PVT)","North Urban West"]
[30664,"JASMINE PL","West"]
[33842,"JASON AVE","Central"]
[33843,"JASPER AVE","Central"]
[36016,"JASPER RD CARPARK (RP68 LHS)","Central"]
[10464,"JAVELIN CLOSE","North Urban East"]
[40770,"JAVELIN PL","North Urban West"]
[52803,"JAY CRT","South East Urban"]
[71247,"JAYAR HGTS","South Rural"]
[53415,"JAYLO PL","South West Urban"]
[53851,"JAYLO PL-NAYLORS DR","South West Urban"]
[22341,"JAYNE PL","North Urban East"]
[40769,"JAYS RD","West"]
[30665,"JEAN BATTEN PL","Central"]
[11452,"JEAN MACKAY PL","North Rural"]
[11199,"JEAN PL","North Urban East"]
[22342,"JEANETTE PL","North Urban East"]
[51572,"JEFF PL","South East Urban"]
[30666,"JEFFERSON ST","Central East"]
[47305,"JEFFERY REEVE CRES","West"]
[10465,"JEFFS RD (DAIRY FLAT)","North Rural"]
[54140,"JEFFS RD (STANCOMBE - CHATEAU)","South East Urban"]
[54252,"JEFFS RD (VALDERAMA - RAVELLO)","South East Urban"]
[54124,"JEFFS/VALDERAMA RAB","South East Urban"]
[80377,"JELAS DRIVE","North Rural"]
[10466,"JELAS RD","North Urban East"]
[41299,"JELICICH CRT","West"]
[33845,"JELLICOE PDE","Hauraki Islands"]
[22344,"JELLICOE RD (AC.WAY)","North Urban East"]
[51574,"JELLICOE RD (MANUREWA)","South West Urban"]
[33844,"JELLICOE RD (MT WELLINGTON)","Central East"]
[70971,"JELLICOE RD (PUKEKOHE)","South Rural"]
[22343,"JELLICOE RD (ROTHESAY BAY)","North Urban East"]
[30667,"JELLICOE ST (CITY)","Central"]
[33847,"JELLICOE ST (OTAHUHU)","South West Urban"]
[20380,"JENANNE PL","North Urban West"]
[40768,"JENELIN RD","West"]
[70289,"JENKIN RD","South Rural"]
[51575,"JENKINS PL","South West Urban"]
[30668,"JENNER PL","West"]
[51576,"JENNIFER PL","South West Urban"]
[33848,"JENNINGS ST","Central"]
[71392,"JENNY LANE","South Rural"]
[51577,"JERN PL","South East Urban"]
[53517,"JERPOINT DR","South East Urban"]
[33849,"JERRAM ST","Central"]
[54767,"JERRY GREEN ST","South West Urban"]
[33850,"JERSEY AVE","Central"]
[11121,"JERVIS RD","North Urban East"]
[30669,"JERVOIS RD","Central"]
[35776,"JERVOIS/WEST END WWAY (RP1905)","Central"]
[60339,"JESMOND RD","South Rural"]
[33851,"JESMOND TCE","Central"]
[30670,"JESSEL ST","Central"]
[80412,"JESSIE RISE","North Rural"]
[60454,"JESSIKA PL","South West Urban"]
[15419,"JESSIKA PL/DONEGAN PL CYWAY","South West Urban"]
[20284,"JESSMAE PL","North Urban West"]
[33853,"JESSOP ST","Central"]
[35710,"JESSOP/STODDARD WWAY (RP82 LHS)","Central"]
[47336,"JEVER PL","West"]
[47359,"JEZERO DR","West"]
[51578,"JILL PL","South West Urban"]
[40767,"JILLIAN DR","West"]
[51579,"JILLTERESA CRES","South East Urban"]
[60269,"JIM RHIND PL","South West Urban"]
[22709,"JIM TITCHENER PDE","North Urban East"]
[80514,"JOAL-B (PVT)","South East Urban"]
[30671,"JOAN ST","Central"]
[35742,"JOAN STUMBLES WWAY (RP4693 LHS)","West"]
[35782,"JOAN/SHORELINE WWAY (RP80 RHS)","Central"]
[11498,"JOANNA LEE LANE","North Rural"]
[60135,"JOANNE PL","South West Urban"]
[10467,"JOBLIN RD","North Rural"]
[52764,"JODIE PL","South West Urban"]
[35682,"JOE F STANLEY PL","South West Urban"]
[11609,"JOHN ANDREW DR","North Rural"]
[22201,"JOHN BRACKEN WAY","North Urban West"]
[11479,"JOHN BRIAN DR","North Urban East"]
[54768,"JOHN BROAD PL","South East Urban"]
[15681,"JOHN BROOK CRES LINK CYWAY","South East Urban"]
[53183,"JOHN BROOKE CRES","South East Urban"]
[22101,"JOHN COURT ST","North Urban West"]
[33854,"JOHN DAVIS RD","Central"]
[10468,"JOHN DEE CRES","North Urban East"]
[22345,"JOHN DOWNS DR","North Urban East"]
[40046,"JOHN F KENNEDY PL","West"]
[51580,"JOHN GILL RD","South East Urban"]
[22776,"JOHN GLENN AVE","North Urban West"]
[53683,"JOHN GOULTER DR (AIRPORT)","South West Urban"]
[70293,"JOHN HILL RD","South Rural"]
[71300,"JOHN HINDMARSH RD","South Rural"]
[22828,"JOHN JENNINGS DR","North Urban West"]
[52858,"JOHN LISTER CLOSE","South East Urban"]
[15299,"JOHN MOORE RESERVE CYWAY","Central"]
[15300,"JOHN MOORE RESERVE EAST CYWAY","Central"]
[10469,"JOHN RD","North Urban East"]
[80731,"JOHN ROBEY ROAD","North Urban East"]
[35054,"JOHN RYMER PL","Central East"]
[31551,"JOHN RYMER PL LOOP","Central East"]
[30673,"JOHN SHAW DR","Central East"]
[35796,"JOHN SHAW/COTTON WWAY (RP142)","Central East"]
[11473,"JOHN SINCLAIR AVE","North Rural"]
[51581,"JOHN ST (MANGERE)","South West Urban"]
[34721,"JOHN ST (OTAHUHU) (PVT)","South West Urban"]
[70292,"JOHN ST (PATUMAHOE)","South Rural"]
[30672,"JOHN ST (PONSONBY)","Central"]
[70972,"JOHN ST (PUKEKOHE)","South Rural"]
[35571,"JOHN STOKES TCE (PVT)","Central"]
[51582,"JOHN WALKER DR","South West Urban"]
[15453,"JOHN WALKER DR/HOTUROA PL CYWAY (RP761)","South West Urban"]
[15448,"JOHN WALKER DR/SELAGO PL CYWAY (RP237)","South West Urban"]
[53853,"JOHN WALKER DR-POUTINI PL","South West Urban"]
[40012,"JOHN WEBSTER PL","West"]
[51583,"JOHNS LANE","South East Urban"]
[54723,"JOHNS LANE CARPARK (RP61 LHS)","South East Urban"]
[54156,"JOHNS LANE SERVICE LANE (RP100 LHS)","South East Urban"]
[35664,"JOHNSON BAY RD","Hauraki Islands"]
[33855,"JOHNSTON RD","Central East"]
[30674,"JOHNSTONE ST","Central"]
[51584,"JOHNSTONES RD","South West Urban"]
[54197,"JOHNSTONES RD CARPARK (RP379 RHS)","South West Urban"]
[52921,"JOHNSTONES RD SERVICE LANE (RP392)","South West Urban"]
[54837,"JOHNSTONES RD-FRANKLYNE RD","South West Urban"]
[33857,"JOLSON RD","Central East"]
[51585,"JOLYN PL","South East Urban"]
[80051,"JOMAC PL","West"]
[22998,"JOMARD TCE","North Urban West"]
[20340,"JONATHAN PL","North Urban East"]
[70295,"JONES RD (HUNUA)","South Rural"]
[10471,"JONES RD (OMAHA FLATS)","North Rural"]
[60406,"JONES RD (RED HILL)","South Rural"]
[11113,"JONKERS RD","West"]
[51587,"JONTUE PL","South West Urban"]
[35058,"JOPARD PL","Central East"]
[33858,"JORDAN AVE","Central East"]
[10473,"JORDAN RD (MAKARAU)","North Rural"]
[51588,"JORDAN RD (MANGERE)","South West Urban"]
[35690,"JORDAN/WADE WWAY (RP225 LHS)","Central East"]
[35569,"JOSEPH BANKS TCE (PVT)","Central"]
[11430,"JOSEPH DUNSTAN DR","North Rural"]
[53681,"JOSEPH HAMMOND PL (AIRPORT)","South West Urban"]
[54790,"JOSEPH ST","South East Urban"]
[80688,"JOSH ROAD","North Rural"]
[51589,"JOSHUA PL","South West Urban"]
[54240,"JOSIE LANE (PVT)","South West Urban"]
[10474,"JOURNEYS END","North Rural"]
[51590,"JOVAL PL","South West Urban"]
[11334,"JOWSEY ACCESS RD","North Rural"]
[22924,"JOY ST","North Urban West"]
[11208,"JOYCE ADAMS PL","North Rural"]
[60136,"JOYCE ST","South West Urban"]
[60545,"JOYCE ST EXTN","South West Urban"]
[10475,"JOYDEN PL","North Urban East"]
[11277,"JOYDEN PL 2 - 8","North Urban East"]
[41348,"JUBAEA PL","West"]
[22067,"JUBILEE AVE (DEVONPORT)","North Urban East"]
[33859,"JUBILEE AVE (ONEHUNGA)","Central East"]
[11180,"JUDD PL","North Urban East"]
[60603,"JUDGE RICHARDSON DR","South Rural"]
[30675,"JUDGE ST","Central"]
[30676,"JUDGES BAY RD","Central"]
[70018,"JUDITH ANNE DR","South Rural"]
[40766,"JUDITH PL","West"]
[51592,"JUDKINS CRES","South East Urban"]
[51593,"JUKES PL","South West Urban"]
[20381,"JULIA PL","North Urban West"]
[51594,"JULIA WAY  (PVT)","South Rural"]
[51595,"JULIAN PL","South West Urban"]
[53854,"JULIAN PL-GILBERT RD","South West Urban"]
[30677,"JULIAN ST","Central"]
[47174,"JULIANA WAY","West"]
[51596,"JULIET AVE","South East Urban"]
[54674,"JULIET AVE CARPARK (RP469 RHS)","South East Urban"]
[20333,"JULIET PL","North Urban East"]
[20735,"JUMENTO PL","North Urban West"]
[33860,"JUNCTION RD","Hauraki Islands"]
[22346,"JUNE PL","North Urban East"]
[40765,"JUNEAU PL","West"]
[20344,"JUNIPER RD","North Urban East"]
[60137,"JUPITER ST","South West Urban"]
[60680,"JUPITER ST CARPARK (RP382 RHS)","South West Urban"]
[80024,"JURA LANDING","North Urban East"]
[51597,"JURY PL","South West Urban"]
[51598,"JUSTAMERE PL","South West Urban"]
[40764,"JUSTIN PL","West"]
[20120,"JUTLAND RD (HAURAKI)","North Urban East"]
[51599,"JUTLAND RD (MANUREWA)","South West Urban"]
[70041,"JUTLAND RD (NORTH)","South Rural"]
[70973,"JUTLAND RD (SOUTH)","South Rural"]
[26030,"JUTLAND RD CARPARK","North Urban East"]
[20823,"JUTLAND RD SERVICE LANE","North Urban East"]
[22347,"JUTLAND ST","North Urban East"]
[51600,"JUVENA PL","South West Urban"]
[10477,"JV GRANT RD","North Rural"]
[51601,"KAANAPALI PL","South West Urban"]
[15652,"KAANAPALI PL LINK CYWAY","South West Urban"]
[80501,"KABARDIN ST","South West Urban"]
[51602,"KADINA PL","South East Urban"]
[41349,"KAHALA PL","North Urban West"]
[48231,"KAHALA PL WWAY","North Urban West"]
[80515,"KAHAWAIRAHI DR","South Rural"]
[80629,"KAHIKA GR","North Rural"]
[22104,"KAHIKA RD","North Urban West"]
[10479,"KAHIKATEA FLAT RD","North Rural"]
[40763,"KAHIKATEA PL","West"]
[48204,"KAHIKATEA PL WWAY","West"]
[33861,"KAHU RD","Central East"]
[51603,"KAHU ST","South West Urban"]
[51604,"KAHURANGI PL (MANUREWA)","South West Urban"]
[10480,"KAHURANGI PL (SNELLS BEACH)","North Rural"]
[53855,"KAHURANGI PL-LAWRENCE CRES","South West Urban"]
[33862,"KAIARAARA BAY RD","Hauraki Islands"]
[80700,"KAIAWA ST","South Rural"]
[70300,"KAIHAU RD","South Rural"]
[21037,"KAIHU ST","North Urban West"]
[40762,"KAIKOURA ST","West"]
[20395,"KAIMAHI RD","North Urban West"]
[80657,"KAIMANAWA RD","South West Urban"]
[30678,"KAIMATA ST","Central East"]
[53065,"KAIMOANA ST","South West Urban"]
[80478,"KAIMOANA ST RAB","South West Urban"]
[33864,"KAIN ST","Central"]
[11196,"KAIPARA COAST HIGHWAY (RS47)","North Rural"]
[11150,"KAIPARA COAST HIGHWAY (RS69)","North Rural"]
[11151,"KAIPARA COAST HIGHWAY (RS82)","North Rural"]
[11152,"KAIPARA COAST HIGHWAY (RS92)","North Rural"]
[10481,"KAIPARA CRES","North Rural"]
[10482,"KAIPARA FLATS RD","North Rural"]
[10483,"KAIPARA HILLS RD","North Rural"]
[11575,"KAIPARA LAKE RD","North Rural"]
[10484,"KAIPARA PORTAGE RD","North Rural"]
[60138,"KAIPARA RD","South West Urban"]
[11449,"KAIPARA VIEW RD","North Rural"]
[20045,"KAIPATIKI RD","North Urban West"]
[80497,"KAIPIHO LANE","North Urban West"]
[80669,"KAIPUKE CRESCENT","North Urban East"]
[80555,"KAIPUKE RISE","North Urban East"]
[51605,"KAIRANGA ST","South West Urban"]
[41420,"KAITARAKIHI BEACH ACCESS RD (PVT)","West"]
[51606,"KAITAWA ST","South West Urban"]
[54648,"KAITAWA ST HAMMERHEAD","South West Urban"]
[33865,"KAITOKE LANE","Hauraki Islands"]
[36110,"KAITOKE LANE SCHOOL LOOP","Hauraki Islands"]
[35665,"KAITOKE STREAM ACCESS RD","Hauraki Islands"]
[10485,"KAITOTO RD","North Rural"]
[54036,"KAITUNE DR","South East Urban"]
[70850,"KAIWAKA RD","South Rural"]
[51607,"KAKA ST (MANGERE)","South West Urban"]
[21038,"KAKA ST (NORTHCOTE)","North Urban West"]
[33867,"KAKA ST (OTAHUHU)","South West Urban"]
[51608,"KAKAPO PL","South West Urban"]
[10486,"KAKARAEA RD","North Rural"]
[33868,"KAKARIKI AVE","Central"]
[10487,"KAKARIKI VIEWS","North Urban East"]
[80367,"KAKI LANE","South West Urban"]
[53324,"KALBERRY PL","South East Urban"]
[52973,"KALGAN PL","South East Urban"]
[51609,"KALLAROO PL","South East Urban"]
[22348,"KALLISTA PL","North Urban East"]
[33869,"KALLU CRES","Central"]
[33870,"KALMIA ST","Central East"]
[53533,"KALMORE PL","South East Urban"]
[20358,"KAMA PL","North Urban East"]
[33871,"KAMAHI ST","Central"]
[51610,"KAMAKA RD","South West Urban"]
[54135,"KAMAKA RD-CORONATION RD","South West Urban"]
[80579,"KAMANA ST","South East Urban"]
[40165,"KAMARA RD","West"]
[48040,"KAMARA RD - ROSIER RD WWAY","West"]
[48041,"KAMARA RD - SOLAR RD #64A WWAY","West"]
[51611,"KAMBALDA ST","South West Urban"]
[60342,"KAMULLA CRT","South West Urban"]
[51612,"KANIERE PL","South East Urban"]
[10488,"KANOHI RD","North Rural"]
[51613,"KANOHI TCE","South West Urban"]
[53334,"KANTURK CLOSE","South East Urban"]
[70302,"KANUKA RD (PAPARATA)","South Rural"]
[10489,"KANUKA RD (SANDSPIT)","North Rural"]
[80429,"KANUKA ROAD","North Urban West"]
[30679,"KANUKA ST","Central"]
[22610,"KANUKA WAY","North Urban West"]
[22226,"KAPAI RD","North Urban East"]
[10490,"KAPANUI ST","North Rural"]
[80653,"KAPIA DR","South West Urban"]
[20356,"KAPITI PL","North Urban East"]
[40022,"KAPONGA CRES","West"]
[11627,"KAPONGA LANE","North Rural"]
[30680,"KAPUA ST","Central East"]
[51614,"KAPUKA RD","South West Urban"]
[33872,"KAPUNI RD","Central East"]
[11464,"KARAHU LANE","North Rural"]
[33874,"KARAKA BAY RD","Hauraki Islands"]
[70303,"KARAKA NORTH RD","South Rural"]
[30681,"KARAKA PARK PL","Central East"]
[40761,"KARAKA RD","North Urban West"]
[51616,"KARAKA RD (BEACHLANDS)","South Rural"]
[51615,"KARAKA RD (KAWAKAWA BAY)","South Rural"]
[33873,"KARAKA RD (WAIHEKE)","Hauraki Islands"]
[11142,"KARAKA ST (HELENSVILLE)","North Rural"]
[30682,"KARAKA ST (NEWTON)","Central"]
[20169,"KARAKA ST (TAKAPUNA)","North Urban East"]
[40130,"KARAKA ST (WAITAKERE)","West"]
[40760,"KARAMU ST","West"]
[30683,"KARANGAHAPE RD","Central"]
[51617,"KARAPIRO ST (PVT)","South West Urban"]
[40759,"KARAPITI PL","West"]
[51618,"KARAWA PL","South Rural"]
[40758,"KAREKARE RD","West"]
[47310,"KAREMOANA DR","West"]
[15157,"KAREMOANA DR LINK CYWAY (RP362)","West"]
[15156,"KAREMOANA DR LINK CYWAY (RP385)","West"]
[48185,"KAREMOANA DRV WWAY 2","West"]
[40757,"KAREN RD","West"]
[10492,"KAREPIRO DR","North Urban East"]
[40756,"KAREPO CRES","West"]
[33875,"KARETU RD","Central"]
[30684,"KARI ST","Central"]
[47362,"KARIKA PL","West"]
[40163,"KARINA PL","West"]
[70305,"KARIOTAHI RD","South Rural"]
[40755,"KARO PL","West"]
[48131,"KARO PL WWAY","West"]
[30685,"KARORI CRES","Central East"]
[51619,"KARORO CRT","South West Urban"]
[53409,"KARSON PL","South East Urban"]
[33876,"KARU ST","Hauraki Islands"]
[53401,"KASENG PL","South East Urban"]
[53857,"KASENG PL-CHAPEL RD","South East Urban"]
[40754,"KASHMIR RD","West"]
[47056,"KASIA CLOSE","West"]
[10493,"KASPAR ST","North Rural"]
[11391,"KASSA RISE","North Rural"]
[33877,"KATAVICH PL","Central"]
[30001,"KATAVICH PL HAMMERHEAD","Central"]
[22693,"KATE SHEPPARD AVE","North Urban East"]
[10494,"KATENE PL","North Rural"]
[60471,"KATH HENRY LANE","South Rural"]
[11238,"KATH HOPPER DR","North Urban East"]
[71450,"KATHLEEN REECE PL","South Rural"]
[20389,"KATHLEEN ST","North Urban West"]
[33878,"KATHRYN AVE","Central"]
[10495,"KATHY TCE","North Urban East"]
[30686,"KATOA ST","Central"]
[51620,"KATOTE CLOSE","South West Urban"]
[40753,"KATRINA PL","West"]
[20207,"KATUI ST","North Urban East"]
[40752,"KAUMATUA PL","West"]
[10496,"KAURI CRES (EAST)","North Rural"]
[11129,"KAURI CRES (WEST)","North Rural"]
[10497,"KAURI CRES 2 (SNELLS)","North Rural"]
[60632,"KAURI DR (PAPAKURA)","South West Urban"]
[10498,"KAURI DR (SANDSPIT)","North Rural"]
[70879,"KAURI DR (WAIUKU)","South Rural"]
[21039,"KAURI GLEN RD","North Urban West"]
[80645,"KAURI HEART AVE","South West Urban"]
[40566,"KAURI LOOP RD","West"]
[40199,"KAURI POINT RD","West"]
[70307,"KAURI RD (AWHITU)","South Rural"]
[22105,"KAURI RD (BIRKENHEAD)","North Urban West"]
[70308,"KAURI RD (PUKEKOHE)","South Rural"]
[10499,"KAURI RD (STANMORE BAY)","North Urban East"]
[40751,"KAURI RD (WHENUAPAI)","North Urban West"]
[60467,"KAURI VIEW RD","South Rural"]
[31704,"KAURIKI TCE","Central East"]
[40750,"KAURILANDS RD","West"]
[40749,"KAURIMU RISE","West"]
[51621,"KAUTAMI AVE","South West Urban"]
[54622,"KAUTAMI/SEYMOUR RAB","South West Urban"]
[60139,"KAVANAGH PL","South West Urban"]
[33880,"KAWA RD","Hauraki Islands"]
[47057,"KAWAI RISE","West"]
[33879,"KAWAKA ST (MT EDEN)","Central"]
[40748,"KAWAKA ST (WAITAKERE)","West"]
[51622,"KAWAKAWA BAY COAST RD","South Rural"]
[51623,"KAWAKAWA-ORERE RD","South Rural"]
[21040,"KAWANA ST","North Urban West"]
[10500,"KAWAU ISLAND AVE","North Urban East"]
[34722,"KAWAU RD","Central East"]
[10501,"KAWAU VIEW RD","North Rural"]
[40068,"KAWEKA ST","West"]
[22202,"KAWERAU AVE","North Urban East"]
[30688,"KAWITI AVE","Central East"]
[35874,"KAWITI/ERIMA WWAY (RP425 RHS)","Central East"]
[41235,"KAY CRES (PVT)","North Urban West"]
[30687,"KAY DR","West"]
[51624,"KAY RD (MANUREWA)","South West Urban"]
[33881,"KAY RD (PANMURE)","Central East"]
[40747,"KAY RD (WAITAKERE)","West"]
[51625,"KAYELEEN PL","South East Urban"]
[70978,"KAYES RD","South Rural"]
[40746,"KAYLE GLEN","West"]
[48275,"KAYLE GLEN - MOIRE #114 WWAY","West"]
[48276,"KAYLE GLEN WWAY","West"]
[51626,"KEA PL","South West Urban"]
[33882,"KEALY RD","Central East"]
[51627,"KEANES RD","South Rural"]
[71351,"KEANEY RD","South Rural"]
[40745,"KEARNEY PL","West"]
[48314,"KEARNEY PL WWAY","West"]
[33883,"KEATE PL","Central East"]
[22996,"KEATING RISE","North Urban West"]
[30689,"KEATS PL","West"]
[40744,"KEEGAN DR","West"]
[41166,"KEEGAN DR EXTN","West"]
[40182,"KEELING RD","West"]
[53034,"KEENAGH RISE","South East Urban"]
[60140,"KEENEY CRT","South West Urban"]
[60547,"KEENEY CRT LOOP","South West Urban"]
[11564,"KEEPERS DR","North Urban East"]
[22349,"KEGWORTH PL","North Urban East"]
[30690,"KEITH AVE","Central East"]
[53495,"KEITH HAY DR (PVT)","South West Urban"]
[15294,"KEITH HAY PARK CARPARK LINK CYWAY","Central"]
[15293,"KEITH HAY PARK WESTERN CYWAY","Central"]
[11427,"KEITH MORRIS LANE","North Urban East"]
[70979,"KEITH PL","South Rural"]
[10503,"KEITH RD","North Rural"]
[22106,"KEITH SMITH AVE","North Urban West"]
[51628,"KELBURN LANE","South West Urban"]
[20308,"KELDALE PL","North Urban East"]
[10504,"KELGARY PL","North Rural"]
[40743,"KELKIRK ST","West"]
[24019,"KELL DR (PVT)","North Urban West"]
[70309,"KELLAND RD","South Rural"]
[53331,"KELLAWAY DR","South East Urban"]
[15476,"KELLAWAY DR LINK CYWAY","South East Urban"]
[15678,"KELLAWAY RESERVE SOUTH CYWAY","South East Urban"]
[40742,"KELLETT RD","West"]
[52835,"KELLIHER LANE","South West Urban"]
[51630,"KELLOW PL","South West Urban"]
[51631,"KELLS PL","South East Urban"]
[80336,"KELLY GREENS (EASTBOUND)","North Urban East"]
[80337,"KELLY GREENS (WESTBOUND)","North Urban East"]
[51632,"KELLY PL","South East Urban"]
[80413,"KELLY ROAD","North Rural"]
[33884,"KELLY ST","Central"]
[31641,"KELLY ST EXTN (RP83 LHS)","Central"]
[40741,"KELLYS RD (ORATIA)","West"]
[51633,"KELLYS RD (WHITFORD)","South Rural"]
[40740,"KELMAN RD","West"]
[48059,"KELMAN RD WWAY","West"]
[48060,"KELMAN RD WWAY FORK","West"]
[30691,"KELMARNA AVE","Central"]
[22965,"KELMORE PL","North Urban West"]
[51634,"KELPIE LANE","South West Urban"]
[33885,"KELSEY CRES","Central"]
[60516,"KELSO CRT","South West Urban"]
[40138,"KELSTON ST","West"]
[40738,"KELVIN CRES","West"]
[48176,"KELVIN CRES WWAY","West"]
[53318,"KELVIN HART DR","South East Urban"]
[53319,"KELVIN HART/FRANSHELL RAB","South East Urban"]
[60141,"KELVIN RD (PAPAKURA)","South West Urban"]
[30692,"KELVIN RD (REMUERA)","Central East"]
[60661,"KELVIN RD CARPARK (RP562 LHS)","South West Urban"]
[30693,"KELVINSIDE TCE","West"]
[51635,"KELVYN GR","South West Urban"]
[40737,"KELWYN RD","West"]
[47112,"KEMBERLEY MEWS (PVT)","West"]
[51636,"KEMBLE CLOSE","South West Urban"]
[70312,"KEMP RD (AWHITU)","South Rural"]
[40736,"KEMP RD (WAITAKERE)","West"]
[30694,"KEMPTHORNE CRES","Central East"]
[10505,"KENDALE DR","North Rural"]
[51637,"KENDALL CRT","South West Urban"]
[71454,"KENDALLVALE DR","South Rural"]
[35601,"KENDERDINE LANE (PVT)","Central"]
[51638,"KENDERDINE RD","South West Urban"]
[30695,"KENDRICK PL","West"]
[54017,"KENLEY HGTS","South East Urban"]
[30697,"KENLEY PL","West"]
[20224,"KENMURE AVE","North Urban East"]
[10506,"KENNAWAY RD","North Rural"]
[22522,"KENNEDY AVE","North Urban East"]
[20321,"KENNEDY AVE LOWER","North Urban East"]
[22521,"KENNEDY AVE UPPER","North Urban East"]
[33887,"KENNEDY POINT RD","Hauraki Islands"]
[34988,"KENNEDY POINT RD EXTN (RP219)","Hauraki Islands"]
[10507,"KENNEDY RD (DAIRY FLAT)","North Rural"]
[33886,"KENNEDY RD (WAIHEKE)","Hauraki Islands"]
[40735,"KENNEDYS RD","North Urban West"]
[70980,"KENNELLY CRES","South Rural"]
[33888,"KENNETH AVE","Central"]
[10508,"KENNETH HOPPER PL","North Urban East"]
[36055,"KENNETH MYERS DR (PVT)","Central"]
[35643,"KENNETH SMALL CRES (PVT)","Central"]
[33889,"KENNETH SMALL PL","Central East"]
[35737,"KENNETH SMALL PL WWAY (RP318)","Central East"]
[51639,"KENNINGTON DR","South West Urban"]
[30696,"KENNY RD","Central East"]
[33890,"KENSINGTON AVE","Central"]
[80130,"KENSINGTON DR","North Urban East"]
[11339,"KENSINGTON TCE","North Urban East"]
[53518,"KENSWAY DR","South East Urban"]
[51640,"KENT RD","South West Urban"]
[34724,"KENT ST (NEWMARKET)","Central"]
[30698,"KENT ST (PONSONBY)","Central"]
[70857,"KENT ST (WAIUKU)","South Rural"]
[10509,"KENT ST RIVERHEAD","North Rural"]
[10510,"KENT TCE","North Rural"]
[52982,"KENTIA WAY (PVT)","South East Urban"]
[24065,"KENTIA WAY (UPPER HARBOUR)","North Urban West"]
[15628,"KENTIGEN CL/PAKURANGA RD CYWAY","South East Urban"]
[15578,"KENTIGERN CL LINK CYWAY","South East Urban"]
[51641,"KENTIGERN CLOSE","South East Urban"]
[54720,"KENTIGERN CLOSE HAMMERHEAD (EAST)","South East Urban"]
[54721,"KENTIGERN CLOSE HAMMERHEAD (WEST)","South East Urban"]
[51642,"KENTON LANE","South West Urban"]
[33891,"KENTUCKY ST","Central East"]
[51643,"KENTVILLE PL","South East Urban"]
[52780,"KENWICK PL","South East Urban"]
[30699,"KENWYN ST","Central"]
[33892,"KENYON AVE","Central"]
[70313,"KEOGH RD","South Rural"]
[30701,"KEPA RD","Central East"]
[31548,"KEPA/KUPE SLIP","Central East"]
[51644,"KEPLER PL","South West Urban"]
[30702,"KEPPELL ST","Central"]
[52919,"KEPPOCH CRT","South East Urban"]
[54549,"KEPPOCH CRT HAMMERHEAD (NORTH)","South East Urban"]
[54548,"KEPPOCH CRT HAMMERHEAD (SOUTH)","South East Urban"]
[54550,"KEPPOCH HAMMERHEAD RAB","South East Urban"]
[23003,"KEREMA WAY","North Urban West"]
[20731,"KERERU GR","North Urban West"]
[20161,"KERERU GR LOWER","North Urban West"]
[20162,"KERERU GR UPPER","North Urban West"]
[80627,"KERERU LANE","North Urban West"]
[51645,"KERERU PL","South East Urban"]
[60590,"KERERU RISE","South West Urban"]
[40734,"KERERU ST","West"]
[30703,"KERETENE PL","Central East"]
[51646,"KERI ANNE PL","South West Urban"]
[60548,"KERI VISTA RISE","South West Urban"]
[41237,"KERLIN CRES","North Urban West"]
[51647,"KERN PL","South West Urban"]
[70314,"KERN RD","South Rural"]
[20594,"KERR ST (DEVONPORT)","North Urban East"]
[33893,"KERR ST (SANDRINGHAM)","Central"]
[33894,"KERR TAYLOR AVE","Central"]
[35728,"KERR/FERGUSSON WWAY","Central"]
[20350,"KERRIA PL","North Urban East"]
[52945,"KERRIDGE CLOSE","South East Urban"]
[51648,"KERRS RD","South West Urban"]
[51649,"KERRY DELL","South East Urban"]
[60142,"KERRY PL","South West Urban"]
[51650,"KERRYDALE RD","South West Urban"]
[54218,"KERRYKEEL DR","South East Urban"]
[54770,"KERRYKEEL/ARRANMORE RAB","South East Urban"]
[54769,"KERRYKEEL/KILLARNEY RAB","South East Urban"]
[20283,"KERRYMARIA PL","North Urban West"]
[51651,"KERSWILL PL","South East Urban"]
[40733,"KERU PL","West"]
[40732,"KERVIL AVE","West"]
[48150,"KERVIL AVE WWAY","West"]
[51652,"KERWYN AVE","South East Urban"]
[54393,"KERWYN/PUKEKIWIRIKI RAB","South East Urban"]
[60143,"KERYN PL","South West Urban"]
[53520,"KESTEV DR","South East Urban"]
[30704,"KESTEVEN AVE","Central East"]
[10511,"KESTREL HEIGHTS","North Urban East"]
[30705,"KESTREL PL","Central East"]
[52935,"KESWICK CLOSE","South East Urban"]
[30706,"KETTLE ST","Central"]
[80023,"KETTLEWELL DR","North Urban East"]
[53464,"KEVALE PL","South West Urban"]
[70315,"KEVEN RD","South Rural"]
[51653,"KEW LANE","South West Urban"]
[54647,"KEW LANE CARPARK","South West Urban"]
[20667,"KEWA RD","North Urban West"]
[11491,"KEWAI ST","North Rural"]
[20110,"KEYS ST","North Urban East"]
[30707,"KEYS TCE (EAST)","Central East"]
[31570,"KEYS TCE (WEST)","Central East"]
[33895,"KEYSTONE AVE","Central"]
[16501,"KEYSTONE AVE CARPARK LINK CYWAY","Central"]
[60430,"KEYWELLA DR","South West Urban"]
[40731,"KHALEEL PL","West"]
[15107,"KHALEEL PL LINK CYWAY","West"]
[30708,"KHANDALLAH PL","West"]
[30709,"KHARTOUM PL","Central"]
[30710,"KHYBER PASS RD","Central"]
[22107,"KIA ORA RD","North Urban West"]
[22520,"KIA ORA RD LLA","North Urban West"]
[30711,"KIANO PL","Central East"]
[80516,"KIBBLEWHITE AVE","South Rural"]
[70318,"KIDD RD (KARAKA)","South Rural"]
[51654,"KIEKIE RD","South West Urban"]
[40730,"KIERNAN PL","West"]
[53332,"KILBAHA CLOSE","South East Urban"]
[40729,"KILCAR PL","West"]
[30712,"KILDARE AVE","Central East"]
[54772,"KILDARE RD","South East Urban"]
[22350,"KILDUFF PL","North Urban East"]
[22938,"KILEAR CLOSE","North Urban West"]
[23028,"KILEAR CLOSE (ALBANY)","North Urban West"]
[40728,"KILGOUR TCE","West"]
[21041,"KILHAM AVE","North Urban West"]
[20843,"KILHAM AVE SERVICE LANE","North Urban West"]
[51655,"KILIMANJARO DR","South East Urban"]
[54474,"KILIMANJARO DR CARPARK (RP663 LHS)","South East Urban"]
[22942,"KILKELLY AVE","North Urban West"]
[52852,"KILKENNY DR","South East Urban"]
[54427,"KILKENNY/DANNEMORA RAB","South East Urban"]
[22351,"KILLARNEY AVE","North Urban East"]
[54771,"KILLARNEY DR","South East Urban"]
[20040,"KILLARNEY ST","North Urban East"]
[26034,"KILLARNEY ST CARPARK","North Urban East"]
[53092,"KILLEEN PL","South East Urban"]
[51656,"KILLINGTON CRES","South West Urban"]
[22932,"KILLYBEGS DR","North Urban West"]
[47058,"KILLYGORDON PL","West"]
[48306,"KILLYGORDON PL WWAY","West"]
[48305,"KILLYGORDON PL WWAY - GARTON DR #15 W","West"]
[48304,"KILLYGORDON PL WWAY - SHERPA PL WWAY","West"]
[80427,"KILMACRENNAN DR","South West Urban"]
[47059,"KILMARNOCK AVE","West"]
[53260,"KILSYTH WAY","South East Urban"]
[51271,"KILTOLE DR","South East Urban"]
[33896,"KIMBER HALL AVE","Central"]
[30713,"KIMBERLEY RD","Central"]
[22722,"KIMBERLY GR","North Urban West"]
[51657,"KIMDALE PL","South West Urban"]
[51658,"KIMPTON RD","South West Urban"]
[54176,"KIMPTON RD CARPARK (RP18 RHS)","South West Urban"]
[15468,"KIMPTON RD/CORNWALL RD CYWAY","South West Urban"]
[53268,"KIMPTONFIELDS CRT","South West Urban"]
[51659,"KIMPTONS RD","South Rural"]
[54588,"KIMPTONS RD EXTN","South Rural"]
[80466,"KIN WAY","North Urban East"]
[51660,"KINCRAIG PL","South East Urban"]
[30714,"KINDER PL","Central East"]
[60341,"KINDERGARTEN DR","South West Urban"]
[60549,"KINDERGARTEN DR LOOP","South West Urban"]
[30716,"KING EDWARD AVE (EPSOM)","Central"]
[60144,"KING EDWARD AVE (PAPAKURA)","South West Urban"]
[22027,"KING EDWARD PDE","North Urban East"]
[15003,"KING EDWARD PDE/MARINE SQ CYWAY","North Urban East"]
[33900,"KING EDWARD ST","Central"]
[30030,"KING EDWARD ST EXTN","Central"]
[30717,"KING GEORGE AVE","Central"]
[22352,"KING RICHARD PL","North Urban East"]
[30715,"KING ST (GREY LYNN)","Central"]
[33897,"KING ST (KINGSLAND)","Central"]
[21042,"KING ST (NORTHCOTE)","North Urban West"]
[33898,"KING ST (OTAHUHU)","South West Urban"]
[60145,"KING ST (PAPAKURA)","South West Urban"]
[51661,"KING ST (PAPATOETOE)","South West Urban"]
[70984,"KING ST (PUKEKOHE)","South Rural"]
[10512,"KING ST (RIVERHEAD)","North Rural"]
[70839,"KING ST (WAIUKU)","South Rural"]
[71563,"KING ST CARPARK (RP393 LHS)","South Rural"]
[71439,"KING/EDINBURGH RAB","South Rural"]
[71438,"KING/WEST RAB","South Rural"]
[40727,"KINGDALE RD","West"]
[47176,"KINGDALE RD EXTN (PVT)","West"]
[31606,"KINGDON ST (NORTH)","Central"]
[33902,"KINGDON ST (SOUTH)","Central"]
[20620,"KINGFISHER GR","North Urban West"]
[22581,"KINGFISHER GR SIDE RD (NORTH)","North Urban West"]
[22580,"KINGFISHER GR SIDE RD (SOUTH)","North Urban West"]
[51662,"KINGFISHER PL","South West Urban"]
[80469,"KINGFISHER RD","North Urban East"]
[24037,"KINGS LANE (PVT)","North Urban West"]
[33905,"KINGS RD (PANMURE)","Central East"]
[33904,"KINGS RD (THREE KINGS)","Central"]
[35947,"KINGS RD CARPARK (RP83 RHS/PANMURE)","Central East"]
[51663,"KINGSCLERE PL","South West Urban"]
[71280,"KINGSEAT LOOP RD","South Rural"]
[70321,"KINGSEAT RD","South Rural"]
[70163,"KINGSEAT/MCKENZIE RAB","South Rural"]
[51664,"KINGSFORD PL","South West Urban"]
[33907,"KINGSFORD RD","Central"]
[51665,"KINGSFORD SMITH PL","South West Urban"]
[53194,"KINGSGATE PL","South East Urban"]
[33908,"KINGSHAVEN CLOSE","Central"]
[33909,"KINGSLAND AVE","Central"]
[15311,"KINGSLAND AVE/MOTORWAY LINK CYWAY","Central"]
[33910,"KINGSLAND TCE","Central"]
[30718,"KINGSLEY ST","Central"]
[15210,"KINGSLEY ST/PARAWAI CRES CYWAY","Central"]
[30719,"KINGSTON ST","Central"]
[33906,"KINGSVIEW RD","Central"]
[33911,"KINGSWAY","Central"]
[33912,"KINGSWAY AVE","Central"]
[40726,"KINGSWAY RD","North Urban West"]
[51666,"KINGSWOOD RD","South West Urban"]
[11523,"KINGTIDE PL","North Urban East"]
[51667,"KINGUSSIE PL","South East Urban"]
[22806,"KINLEITH WAY","North Urban West"]
[33914,"KINLOCH AVE (MT ROSKILL)","Central"]
[53349,"KINMONT RISE","South East Urban"]
[53289,"KINNARD LANE (PVT)","South East Urban"]
[30721,"KINROSS ST","West"]
[30722,"KINSALE AVE","Central East"]
[35790,"KINSALE/EVESHAM WWAY (RP113 RHS)","Central East"]
[40725,"KINTARA DR","West"]
[40202,"KINVIG PL","West"]
[80604,"KIOKIO ST","North Urban East"]
[34906,"KIOSK RD","Central"]
[30723,"KIPLING AVE","Central"]
[53333,"KIPPURE CLOSE","South East Urban"]
[40724,"KIRBY ST","West"]
[22353,"KIRI PL","North Urban East"]
[60591,"KIRIKIRI DR","South West Urban"]
[53348,"KIRIKIRI LANE","South East Urban"]
[30724,"KIRITOA ST","West"]
[31540,"KIRK ST (GREY LYNN/MIDDLE)","Central"]
[30725,"KIRK ST (GREY LYNN/NORTH)","Central"]
[31538,"KIRK ST (GREY LYNN/SOUTH)","Central"]
[70858,"KIRK ST (WAIUKU)","South Rural"]
[80525,"KIRKALDY ST","South West Urban"]
[51668,"KIRKBRIDE RD","South West Urban"]
[80599,"KIRKBRIDE RD - DESFORD PL","South West Urban"]
[15568,"KIRKBRIDE RD LINK CYWAY (RP689)","South West Urban"]
[54616,"KIRKBRIDE/MOUNTAIN RAB","South West Urban"]
[22354,"KIRKDALE PL","North Urban East"]
[51669,"KIRKELLA CRES","South West Urban"]
[51670,"KIRKLOW PL","South West Urban"]
[30726,"KIRKMAY PL","Central East"]
[30727,"KIRKWOOD PL","West"]
[60340,"KIRRAMA PL","South West Urban"]
[40723,"KIRRIE AVE","West"]
[51671,"KIRTON CRES","South West Urban"]
[30728,"KISSLING PL","Central East"]
[35807,"KISSLING/COLLEGE WWAY (RP155)","Central East"]
[51672,"KITA RD","South West Urban"]
[20193,"KITCHENER RD (DEVONPORT)","North Urban East"]
[70322,"KITCHENER RD (PUKEKOHE)","South Rural"]
[33916,"KITCHENER RD (SANDRINGHAM)","Central"]
[70837,"KITCHENER RD (WAIUKU)","South Rural"]
[35941,"KITCHENER RD CARPARK (RP27 LHS)","Central"]
[26029,"KITCHENER RD CARPARK DP 900","North Urban East"]
[20821,"KITCHENER RD SERVICE LANE","North Urban East"]
[20820,"KITCHENER RD SERVICE LANE (141-163)","North Urban East"]
[70240,"KITCHENER RD SERVICE LANE (RP522 RHS)","South Rural"]
[30729,"KITCHENER ST","Central"]
[71473,"KITCHENER/QUEEN RAB","South Rural"]
[20819,"KITCHNER / OMANA SERVICE LANE","North Urban East"]
[30730,"KITEMOANA ST","Central East"]
[33917,"KITENUI AVE","Central"]
[22355,"KITEROA TCE","North Urban East"]
[40722,"KITEWAHO RD","West"]
[21043,"KITEWAO ST","North Urban West"]
[30731,"KITIRAWA RD","Central East"]
[33918,"KITSON PL","Central East"]
[22958,"KITTIWAKE DR","North Urban West"]
[10514,"KITTY FRAZER LANE","North Rural"]
[41441,"KITTYHAWK LANE","North Urban West"]
[51673,"KIVELL CLOSE","South West Urban"]
[54573,"KIVELL CLOSE LOOP","South West Urban"]
[54574,"KIVELL CLOSE LOOP EXTN","South West Urban"]
[51674,"KIWI ESP","South West Urban"]
[70985,"KIWI PL","South Rural"]
[20653,"KIWI RD (DEVONPORT)","North Urban East"]
[30732,"KIWI RD (PT CHEVALIER)","Central"]
[70324,"KIWI RD (WAIUKU)","South Rural"]
[51675,"KIWI ST (OTAHUHU)","South West Urban"]
[33919,"KIWI ST (WAIHEKE ISLAND)","Hauraki Islands"]
[53685,"KIWI TAMAKI RD","South West Urban"]
[10515,"KIWITAHI RD","North Rural"]
[33920,"KIWITEA ST","Central"]
[70325,"KLIPSCH RD","South Rural"]
[33921,"KNIGHT AVE","Central"]
[21031,"KNIGHT RD - ALBANY","North Urban West"]
[10516,"KNIGHT RIDGE RD","North Rural"]
[24003,"KNIGHTS CLOSE (PVT)","North Urban East"]
[51676,"KNIGHTS DR","South West Urban"]
[22356,"KNIGHTS RD - ROTHESAY BAY","North Urban East"]
[20307,"KNIGHTSBRIDGE DR","North Urban East"]
[80476,"KNOLL RISE","South Rural"]
[11403,"KNOTT RD","North Urban East"]
[51677,"KNOX RD (MANUREWA)","South West Urban"]
[40721,"KNOX RD (SWANSON)","West"]
[48121,"KNOX RD WWAY","West"]
[21044,"KO ST","North Urban West"]
[30733,"KOA ST","Central East"]
[35853,"KOA/MEADOWBANK WWAY (RP58 END)","Central East"]
[30734,"KOANGI ST","Central East"]
[51678,"KOHANGA RD","South West Urban"]
[48055,"KOHEHOKE ST WWAY","West"]
[33922,"KOHEKOHE ST (MT EDEN)","Central"]
[40129,"KOHEKOHE ST (WAITAKERE)","West"]
[70326,"KOHEKOHE-KARIOITAHI RD","South Rural"]
[80428,"KOHI KAI PL","South West Urban"]
[30735,"KOHIA TCE","Central"]
[80485,"KOHIA WAY","North Rural"]
[30736,"KOHIMARAMA RD","Central East"]
[33130,"KOHIMARAMA RD HLA (#48 - #74)","Central East"]
[33078,"KOHIMARAMA/HAMPTON LOOP","Central East"]
[51679,"KOHINOOR AVE","South West Urban"]
[51680,"KOHIWI RD","South West Urban"]
[40720,"KOHU RD","West"]
[10517,"KOHU ST","North Urban East"]
[80666,"KOHUHU LN","West"]
[41381,"KOKAKO GR (PVT)","West"]
[60586,"KOKAKO RISE","South West Urban"]
[20622,"KOKI RD","North Urban West"]
[11617,"KOKIHI LANE","North Rural"]
[40719,"KOKIRI ST","West"]
[11490,"KOKOPU ST","North Rural"]
[51681,"KOLMAR RD","South West Urban"]
[15467,"KOLMAR RD/RANGITOTO RD CYWAY","South West Urban"]
[54512,"KOLMAR/OMAGH RAB","South West Urban"]
[51682,"KOMAKO PL","South West Urban"]
[30737,"KOMARU ST","Central East"]
[10518,"KOMOKORIKI HILL RD","North Rural"]
[11204,"KOMOKORIKI UN-NAMED RD","North Rural"]
[47175,"KONA CRES","West"]
[51683,"KONINI AVE","South West Urban"]
[52838,"KONINI AVE SERVICE LANE (RP66 LHS)","South West Urban"]
[33924,"KONINI RD (GREENLANE)","Central East"]
[40718,"KONINI RD (WAITAKERE)","West"]
[10519,"KOOKABURRA DR","North Rural"]
[51684,"KOOKABURRA PL","South East Urban"]
[15713,"KOOKABURRA PL CARPARK CYWAY","South East Urban"]
[15712,"KOOKABURRA PL EAST LINK CYWAY","South East Urban"]
[15711,"KOOKABURRA PL LINK CYWAY","South East Urban"]
[15696,"KOOKABURRA PL/KALLAROO PL CYWAY","South East Urban"]
[51685,"KOPARA PL","South West Urban"]
[15722,"KOPARA PL LINK CYWAY","South West Urban"]
[40717,"KOPI PL","West"]
[48221,"KOPI PL WWAY","West"]
[40716,"KOPIKO RD","West"]
[51686,"KOPU PL","South West Urban"]
[15723,"KOPU PL LINK CYWAY","South West Urban"]
[47304,"KORA AVE","West"]
[10520,"KORAHA RD","North Rural"]
[30738,"KORAHA ST","Central East"]
[80678,"KORAKO DRIVE","North Rural"]
[30739,"KORARI ST","Central"]
[33926,"KORAU RD","Central"]
[30740,"KORCULA PL","West"]
[53149,"KORDEL PL","South West Urban"]
[31696,"KORERE TCE","Central East"]
[80397,"KORIHI DR","West"]
[51687,"KORIMAKO AVE","South West Urban"]
[33927,"KORMA LANE","Central East"]
[31619,"KORMA LANE EXTN (RP75 LHS)","Central East"]
[33928,"KORMA RD","Central"]
[33929,"KOROKINO RD","Central East"]
[70897,"KOROMIKO PL","South Rural"]
[40139,"KOROMIKO ST","West"]
[34987,"KORORA RD","Hauraki Islands"]
[21045,"KORORO ST","North Urban West"]
[22357,"KOROTAHA TCE","North Urban East"]
[51688,"KORU ST","South West Urban"]
[30741,"KOTAE RD","Central East"]
[33930,"KOTAHI RD","Central East"]
[10521,"KOTANUI AVE","North Urban East"]
[30742,"KOTARE AVE","Central"]
[10522,"KOTARE PL","North Rural"]
[40001,"KOTINGA AVE","West"]
[30743,"KOTIRI ST","Central East"]
[80577,"KOTUKU CRES","South West Urban"]
[80578,"KOTUKU CRES (NORTHBOUND)","South West Urban"]
[80432,"KOTUKU LANE","North Urban West"]
[10523,"KOTUKU PL","North Rural"]
[40715,"KOTUKU ST","West"]
[54038,"KOURAS PL","South East Urban"]
[10524,"KOURATAKI RD","North Rural"]
[51689,"KOWHAI AVE (MANGERE)","South West Urban"]
[10525,"KOWHAI AVE (POINT WELLS)","North Rural"]
[35587,"KOWHAI LANE (PVT)","Central"]
[70987,"KOWHAI PL (PUKEKOHE)","South Rural"]
[70900,"KOWHAI PL (WAIUKU)","South Rural"]
[22359,"KOWHAI RD - CAMPBELLS BAY","North Urban East"]
[20166,"KOWHAI RD - TAKAPUNA","North Urban East"]
[10526,"KOWHAI RD (WAINUI)","North Rural"]
[40714,"KOWHAI RD (WHENUAPAI)","North Urban West"]
[11133,"KOWHAI ST (HELENSVILLE)","North Rural"]
[34725,"KOWHAI ST (KINGSLAND)","Central"]
[10527,"KOWHAI TCE","North Rural"]
[11500,"KOWHAI TCE (NORTH)","North Rural"]
[11551,"KOWHAI VIEW","North Rural"]
[33931,"KOWHATU RD","Central East"]
[10528,"KRAACK RD","North Rural"]
[10529,"KRIPPNER RD","North Rural"]
[22810,"KRISTIN LANE","North Urban West"]
[53193,"KSENIA DR","South East Urban"]
[60638,"KUAKA DR","South West Urban"]
[40136,"KUAKA PL","West"]
[33932,"KUAKA RD","Hauraki Islands"]
[80680,"KUAWA DRIVE","North Rural"]
[51690,"KUDU RD","South West Urban"]
[80502,"KUHANUI DR","South West Urban"]
[41427,"KUKUPA RD","West"]
[53207,"KUMAR PL","South West Urban"]
[22990,"KUNZEA PL","North Urban West"]
[20575,"KUPARI PL","North Urban West"]
[80480,"KUPARU ST","South West Urban"]
[30744,"KUPE ST","Central East"]
[22620,"KURA PL","North Urban East"]
[30745,"KURAHAUPO ST","Central East"]
[31550,"KURAHAUPO/RUKUTAI RAB","Central East"]
[35845,"KURAHAUPO/RUKUTAI WWAY (RP655 RHS)","Central East"]
[31549,"KURAHAUPO/TOKOMARU RAB","Central East"]
[33933,"KURANUI PL","South West Urban"]
[51691,"KURIPAKA CRES","South West Urban"]
[53860,"KURIPAKA CRES-PERETAO RISE","South West Urban"]
[51692,"KURNELL DR","South East Urban"]
[51693,"KURT LANE","South West Urban"]
[11463,"KUTAI LANE","North Rural"]
[51694,"KYEEMAGH ST","South East Urban"]
[15624,"KYEEMAGH ST/WHITFORD RD CYWAY","South East Urban"]
[20631,"KYLE RD (EAST)","North Urban West"]
[20758,"KYLE RD (WEST)","North Urban West"]
[10530,"KYLE ST","North Rural"]
[53043,"KYLIE CRT","South East Urban"]
[10739,"L PHILLIPS RD","North Rural"]
[51695,"LA PEROUSE ST","South East Urban"]
[21046,"LA ROCHE PL","North Urban West"]
[40713,"LA ROSA ST","West"]
[51696,"LA TROBE ST","South East Urban"]
[54726,"LA TROBE ST CARPARK (RP372 RHS)","South East Urban"]
[41178,"LA TROBE TRACK","West"]
[33934,"LA VETA AVE","Central"]
[30746,"LABURNUM RD","West"]
[40712,"LACEBARK CRT","West"]
[51697,"LACHLAN PL","South West Urban"]
[33936,"LADD RD","Hauraki Islands"]
[30747,"LADIES MILE (REMUERA)","Central East"]
[10531,"LADIES MILE (WHANGAPARAOA)","North Urban East"]
[33131,"LADIES MILE LLA (#82 - #86)","Central East"]
[11248,"LADIES MILE WGP SCHOOL ACCESS","North Urban East"]
[54402,"LADY FISHER PL","South East Urban"]
[51698,"LADY MARIE DR (PVT)","South East Urban"]
[51699,"LADY RUBY DR","South East Urban"]
[80718,"LAGONDA RISE","North Urban West"]
[33937,"LAGOON DR","Central East"]
[35953,"LAGOON DR CARPARK (RP31 RHS)","Central East"]
[34843,"LAGOON DR LLA (RP274 RHS)","Central East"]
[11364,"LAGOON VIEW DR","North Urban East"]
[48243,"LAGOON WAY - BERNLEIGH TC WWAY","North Urban West"]
[11330,"LAGOON WAY (OMAHA)","North Rural"]
[40711,"LAGOON WAY (WAITAKERE)","North Urban West"]
[48244,"LAGOON WAY WWAY","North Urban West"]
[11469,"LAGUNA PL","North Urban East"]
[53156,"LAIDLAW WAY","South West Urban"]
[10532,"LAIKA AVE","North Rural"]
[70332,"LAING RD","South Rural"]
[40710,"LAINGFIELD TCE","West"]
[41208,"LAINGHOLM DR","West"]
[41300,"LAINGRANGE PL","West"]
[51700,"LAINGS RD","South East Urban"]
[15666,"LAINGS RD/HALF MOON BAY MARINA CYWAY","South West Urban"]
[60621,"LAKE DR","South West Urban"]
[45004,"LAKE PANORAMA DR","West"]
[48114,"LAKE PANORAMA DRV WWAY 1","West"]
[48115,"LAKE PANORAMA DRV WWAY 2","West"]
[48116,"LAKE PANORAMA DRV WWAY 3","West"]
[40034,"LAKE PANORAMA/BIBURY RAB","West"]
[40065,"LAKE PANORAMA/WYCHWOOD RAB","West"]
[20041,"LAKE PUPUKE DR","North Urban East"]
[20002,"LAKE RD - DEVONPORT","North Urban East"]
[21047,"LAKE RD - ONEWA","North Urban West"]
[22900,"LAKE RD - ONEWA ACCESSWAY (41-47)","North Urban West"]
[20801,"LAKE RD (DEVONPORT) SERVICE LANE","North Urban East"]
[10533,"LAKE RD (TE ARAI)","North Rural"]
[20816,"LAKE RD / ANZAC ST SERVICE LANE","North Urban East"]
[15001,"LAKE RD/ABBOTSFORD TCE CYWAY","North Urban East"]
[20167,"LAKE VIEW RD","North Urban East"]
[22997,"LAKERIDGE CLOSE","North Urban West"]
[11122,"LAKESIDE DR (OREWA)","North Urban East"]
[60146,"LAKESIDE DR (PAPAKURA)","South West Urban"]
[15045,"LAKESIDE DR LINK CYWAY","North Urban East"]
[51701,"LAKEWOOD CRT","South West Urban"]
[54388,"LAKEWOOD CRT EXTN","South West Urban"]
[80504,"LALY HADDON DRIVE","North Rural"]
[80546,"LAM TERRACE","North Rural"]
[53340,"LAMBERG CLOSE","South East Urban"]
[53861,"LAMBERG CLOSE-ADRIGOLE PL","South East Urban"]
[33938,"LAMBETH RD","Central"]
[51702,"LAMBIE DR (NORTHBOUND)","South West Urban"]
[54496,"LAMBIE DR (SOUTHBOUND)","South West Urban"]
[54498,"LAMBIE/RONWOOD RAB","South West Urban"]
[23036,"LAMBIR PL","North Urban West"]
[20394,"LAMBROWN DR","North Urban West"]
[53063,"LAMIA PL","South West Urban"]
[30748,"LAMMERMOOR DR","Central East"]
[30749,"LANARK PL","Central East"]
[20262,"LANARK ST","North Urban East"]
[22110,"LANCASTER RD","North Urban West"]
[20502,"LANCELOT PL","North Urban West"]
[24113,"LANCELOT PL LLA","North Urban West"]
[10534,"LANCELOT RD","North Urban East"]
[40708,"LANCEWOOD AVE","West"]
[33940,"LANCING RD","Central"]
[51703,"LANDETTE RD","South West Urban"]
[22717,"LANDING DR (ALBANY)","North Urban West"]
[54638,"LANDING DR (MANGERE)","South West Urban"]
[22716,"LANDING DR ENTRANCE","North Urban West"]
[40707,"LANDING RD","West"]
[54639,"LANDING/AIRPARK RAB","South West Urban"]
[47060,"LANDMARK DR","West"]
[80207,"LANDMARK TCE","North Urban East"]
[51704,"LANDON AVE","South West Urban"]
[71356,"LANDON PL","South Rural"]
[51705,"LANDOP TCE","South East Urban"]
[40706,"LANDOW PL","West"]
[20675,"LANDSBERG WAY","North Urban West"]
[30750,"LANDSCAPE RD (MT EDEN)","Central"]
[51707,"LANDSCAPE RD (PAPATOETOE)","South West Urban"]
[70988,"LANDSCAPE RD (PUKEKOHE)","South Rural"]
[31650,"LANDSCAPE RD HLA (#64 - #72)","Central"]
[33132,"LANDSCAPE RD LLA (ST ANDREWS - #11)","Central"]
[70016,"LANDSCAPE RD LOOP","South Rural"]
[40705,"LANDSDALE PL","West"]
[48281,"LANDSDALE PL WWAY","West"]
[33941,"LANDSEER PL","Central"]
[22950,"LANDVALE CRT","North Urban East"]
[54811,"LANE CAMERON PL","South East Urban"]
[51708,"LANE RD","South West Urban"]
[22360,"LANGANA AVE (NORTH)","North Urban East"]
[22361,"LANGANA AVE (SOUTH)","North Urban East"]
[53228,"LANGIOLA DR","South West Urban"]
[51709,"LANGLEY RD","South West Urban"]
[22111,"LANGSTONE PL","North Urban West"]
[10535,"LANGTON RD","North Urban East"]
[11278,"LANGTON RD 43 - 49","North Urban East"]
[41294,"LANHAM LANE","West"]
[41279,"LANIER PL","West"]
[22112,"LANIGAN ST","North Urban West"]
[33942,"LANNAN RD","Hauraki Islands"]
[51710,"LANSDOWN AVE","South West Urban"]
[60147,"LANSDOWN PL","South West Urban"]
[20068,"LANSDOWNE ST","North Urban East"]
[22542,"LANSDOWNE ST (EAST)","North Urban East"]
[22541,"LANSDOWNE ST (WEST)","North Urban East"]
[53221,"LANSELL DR","South East Urban"]
[30751,"LANSFORD CRES","West"]
[35739,"LANSFORD CRES WWAY (RP247 RHS)","West"]
[40704,"LANTANA RD","West"]
[48011,"LANTANA RD WWAY","West"]
[47216,"LANTERN CRT","West"]
[51711,"LAPPINGTON RD","South West Urban"]
[54650,"LAPPINGTON RD LOOP","South East Urban"]
[80567,"LAQUINTA PL","South East Urban"]
[30752,"LARCH ST","West"]
[30753,"LARCHWOOD AVE","Central"]
[53672,"LARGO LANE","South West Urban"]
[40703,"LARISSA AVE","West"]
[52876,"LARKIN PL","South East Urban"]
[51713,"LARKSPUR CRT","South West Urban"]
[80489,"LARMER DR","North Rural"]
[51714,"LARNE AVE","South East Urban"]
[40702,"LARNOCH RD","West"]
[33943,"LARSEN RD","Central East"]
[51715,"LARSEN ST","South West Urban"]
[11164,"LASCELLES DR","North Rural"]
[20493,"LASER PL","North Urban West"]
[41428,"LASQUE PL","West"]
[51716,"LASTEL PL","South East Urban"]
[51717,"LATHAM AVE","South East Urban"]
[54745,"LATHAM AVE EXTN","South East Urban"]
[15820,"LATHAM AVE/PAUL PL CYWAY","South East Urban"]
[54008,"LATHAM AVE-DILLIMORE AVE","South East Urban"]
[10536,"LATHROPE RD","North Rural"]
[33944,"LAUCHLAN AVE","Central"]
[33945,"LAUD AVE","Central East"]
[33946,"LAUDER RD (PVT)","Central"]
[22113,"LAUDERDALE RD","North Urban West"]
[80026,"LAURA JANE DR","North Urban East"]
[40701,"LAURA ST","West"]
[23004,"LAUREL OAK DR","North Urban West"]
[34726,"LAUREL ST","Central"]
[51719,"LAURELIA PL","South West Urban"]
[54304,"LAURELIA PL CARPARK (RP109 RHS)","South West Urban"]
[52745,"LAURELIA PL EXTN (RP59 LHS)","South West Urban"]
[53864,"LAURELIA PL-FELICIA PL","South West Urban"]
[70989,"LAURELWOOD AVE","South Rural"]
[60518,"LAUREN GR","South West Urban"]
[10537,"LAURENCE ST","North Urban East"]
[53356,"LAURENCE STEVENS DR (PVT)","South West Urban"]
[51720,"LAURESTON AVE","South West Urban"]
[30754,"LAURIE AVE (NEWMARKET)","Central"]
[60148,"LAURIE AVE (PAPAKURA)","South West Urban"]
[60651,"LAURIE AVE CARPARK (RP17 LHS)","South West Urban"]
[60478,"LAURIE DR","South Rural"]
[10538,"LAURIE SOUTHWICK PDE","North Urban East"]
[10539,"LAURIE ST","North Urban East"]
[20352,"LAURINA RD","North Urban East"]
[20534,"LAURIS PL","North Urban West"]
[30755,"LAURISTON AVE","Central"]
[33948,"LAVAS PL","Central East"]
[40177,"LAVELLE RD","West"]
[24062,"LAVENDER CLOSE (PVT)","North Urban West"]
[35566,"LAVENDER CRT","Central East"]
[22992,"LAVENDER GARDEN LANE","North Urban West"]
[20342,"LAVERY PL","North Urban East"]
[51721,"LAVINIA CRES","South West Urban"]
[22362,"LAW ST","North Urban East"]
[51722,"LAWFORD PL","South West Urban"]
[30771,"LAWNDALE PL","Central East"]
[80475,"LAWRENCE CARTER DR","South Rural"]
[51723,"LAWRENCE CRES","South West Urban"]
[53865,"LAWRENCE CRES-DAVID AVE","South West Urban"]
[51724,"LAWRENCE PL","South West Urban"]
[30772,"LAWRENCE ST","Central"]
[70990,"LAWRIE AVE","South Rural"]
[10540,"LAWRIE RD","North Rural"]
[33949,"LAWRY ST","Central East"]
[51725,"LAWSON WAY (PVT)","South West Urban"]
[11477,"LAX CRES","North Rural"]
[51726,"LAXON AVE","South West Urban"]
[53866,"LAXON AVE-KINGSFORD PL","South West Urban"]
[33950,"LAXON TCE","Central"]
[30773,"LAYARD ST","West"]
[80357,"LAYLIN PL","South Rural"]
[10541,"LAYTON RD","North Urban East"]
[47178,"LAZURITE DR","West"]
[60343,"LE HAVRE PL","South West Urban"]
[33956,"LE ROY RD","Hauraki Islands"]
[10542,"LEA PL","North Urban East"]
[80389,"LEADERSHIP CRES","South West Urban"]
[47330,"LEAFIELD CRES","West"]
[48117,"LEAFIELD CRES WWAY","West"]
[15223,"LEAGUE CLUB/VICTORIA PARK LOOP LINK CYWAY","Central"]
[10543,"LEAL PL","North Urban East"]
[70334,"LEAMING PL","South Rural"]
[33951,"LEAMINGTON RD","Central"]
[20078,"LEANDER ST","North Urban East"]
[22115,"LEARMONTH AVE","North Urban West"]
[30774,"LEASIDE LANE","Central East"]
[60149,"LEATHAM CRES","South West Urban"]
[51727,"LEAVER PL","South West Urban"]
[54020,"LEBURN CRES","South East Urban"]
[30775,"LEE ST","Central"]
[33952,"LEEK ST","Central"]
[70335,"LEES GULLY RD","South Rural"]
[51728,"LEESON PL","South West Urban"]
[53867,"LEESON PL-WAYNE DR","South West Urban"]
[51729,"LEEWOOD PL","South East Urban"]
[47179,"LEGACY DR","West"]
[51730,"LEICESTER PDE","South East Urban"]
[20576,"LEIDEN PL","North Urban West"]
[15618,"LEIGH AUTON RESERVE EASTERN LOOP CYWAY","South Rural"]
[15617,"LEIGH AUTON RESERVE WESTERN LOOP CYWAY","South Rural"]
[10544,"LEIGH RD (LEIGH)","North Rural"]
[20469,"LEIGH TCE","North Urban West"]
[30776,"LEIGHTON ST","Central"]
[51731,"LEILA PL","South West Urban"]
[60150,"LEILANI PL","South West Urban"]
[30777,"LEINSTER ST","West"]
[51732,"LEITH CRT","South West Urban"]
[53868,"LEITH CRT-LAMBIE DR","South West Urban"]
[24114,"LEITH WAY (PVT)","North Urban East"]
[53663,"LEIXLEP LANE","South East Urban"]
[51733,"LEMA PL","South West Urban"]
[30778,"LEMINGTON RD","Central"]
[40700,"LEMNOS PL","West"]
[48018,"LEMNOS PL WWAY","West"]
[22988,"LEMON GROVE LANE","North Urban West"]
[10546,"LEMON TREE BAY RD","North Rural"]
[51734,"LEMONWOOD PL","South West Urban"]
[70991,"LEN BROWN PL","South Rural"]
[60270,"LEN GARLICK PL","South West Urban"]
[51735,"LENDENFELD DR","South West Urban"]
[40699,"LENDIC AVE","West"]
[53345,"LENEFORD DR","South East Urban"]
[21048,"LENIHAN ST","North Urban West"]
[10547,"LENNON ACCESS RD","North Urban East"]
[24041,"LENNOX LANE (PVT)","North Urban West"]
[52871,"LENORE RD","South West Urban"]
[10548,"LENZEN RD","North Rural"]
[40150,"LEO ST","West"]
[34854,"LEON LEICESTER AVE","Central East"]
[54241,"LEONARD ISITT DR (PVT)","South West Urban"]
[51736,"LEONARD PL","South West Urban"]
[53869,"LEONARD PL-HAMILL RD","South West Urban"]
[33954,"LEONARD RD","Central East"]
[70906,"LEONARD ST","South Rural"]
[33955,"LEONE TCE","Central"]
[22114,"LEROY TCE","North Urban West"]
[71410,"LES FISHER PL","South Rural"]
[71400,"LES MARSTON PL","South Rural"]
[40033,"LESA ANNIS PL","West"]
[48172,"LESA ANNIS PL WWAY","West"]
[33957,"LESLIE AVE","Central"]
[51737,"LESLIE PL","South West Urban"]
[51738,"LESTER LANE","South West Urban"]
[54468,"LESTER LANE HAMMERHEAD","South West Urban"]
[47376,"LESTER ST","North Urban West"]
[10549,"LETT RD","North Rural"]
[30779,"LETTERKENNY PL","West"]
[35748,"LETTERKENNY PL WWAY (RP220 LHS)","West"]
[51739,"LEVAUT PL","South East Urban"]
[20726,"LEVELOFF RD","North Urban West"]
[51740,"LEVEN LANE","South West Urban"]
[35929,"LEVENE PL","Central East"]
[22116,"LEVESQUE ST","North Urban West"]
[10550,"LEVET RD","North Rural"]
[33958,"LEVONIA ST","Central"]
[40157,"LEVY RD","West"]
[33959,"LEWIN RD","Central"]
[11357,"LEWIS LANE","North Rural"]
[70337,"LEWIS RD (KARAKA)","South Rural"]
[51741,"LEWIS RD (PAKURANGA)","South East Urban"]
[30780,"LEWIS ST","West"]
[51742,"LEWISHAM ST","South East Urban"]
[40698,"LEX AVE","West"]
[51743,"LEXINGTON DR","South East Urban"]
[30781,"LEYBOURNE CIRCLE","Central East"]
[30782,"LEYS CRES","Central East"]
[31658,"LEYS CRES (UPPER)","Central East"]
[51744,"LEYTON WAY (PVT )","South West Urban"]
[51745,"LIAM PL","South East Urban"]
[80386,"LIBERATION RD","South West Urban"]
[53612,"LIBERTY CRES","South Rural"]
[15786,"LIBERTY CRES LINK CYWAY","South Rural"]
[15788,"LIBERTY CRES/TE PURU PARK CYWAY","South Rural"]
[54554,"LIBERTY/WEATHERLY RAB","South Rural"]
[53042,"LIBNAI AVE","South East Urban"]
[40697,"LIBRA ST","West"]
[22831,"LIBRARY LANE","North Urban West"]
[30783,"LICHFIELD RD","Central"]
[30784,"LIDCOMBE PL","West"]
[21049,"LIDDELL ST","North Urban West"]
[60517,"LIDDESDALE PL","South West Urban"]
[60151,"LIDDY PL","South West Urban"]
[53354,"LIFFEY DR","South East Urban"]
[33960,"LIFFORD PL","Central"]
[33961,"LILAC GR","Central"]
[40696,"LILBURN CRES","West"]
[48310,"LILBURN CRES WWAY","West"]
[10551,"LILBURN ST","North Rural"]
[30785,"LILEY PL","Central East"]
[51746,"LILFORD PL","South East Urban"]
[54048,"LILI CHEN WAY","South West Urban"]
[51747,"LILIAN PL","South East Urban"]
[10552,"LILLIAN PL","North Urban East"]
[30786,"LILLINGTON RD","Central East"]
[53460,"LILYBANK CRES","South East Urban"]
[15479,"LILYBANK CRES/GUYS RD CYWAY","South East Urban"]
[60502,"LIME CRES","South West Urban"]
[41198,"LIMEBURNERS CLOSE (PVT)","North Urban West"]
[53035,"LIMERICK PL","South East Urban"]
[22364,"LIMMER PL","North Urban East"]
[51748,"LIMOND ST","South West Urban"]
[70871,"LINA PL","South Rural"]
[22852,"LINCOLN CLOSE","North Urban East"]
[47348,"LINCOLN GARDEN CLOSE","West"]
[40695,"LINCOLN PARK AVE","West"]
[40694,"LINCOLN RD (HENDERSON)","West"]
[51749,"LINCOLN RD (MANUREWA)","South West Urban"]
[30787,"LINCOLN ST","Central"]
[51750,"LINDA PL","South West Urban"]
[33962,"LINDEN ST","Central"]
[51752,"LINDIS PL","South West Urban"]
[15534,"LINDIS PL/AMBURY RD CYWAY","South West Urban"]
[33964,"LINDSAY PL","Central"]
[30788,"LINE RD","Central East"]
[30789,"LINGARTH ST","Central East"]
[20438,"LINGFIELD ST","North Urban West"]
[22365,"LINGHAM CRES","North Urban East"]
[52899,"LINICRO PL","South West Urban"]
[10554,"LINK CRES","North Urban East"]
[20396,"LINK DR","North Urban West"]
[80044,"LINK LANE","Central"]
[40021,"LINKS RD","West"]
[20544,"LINLEY PL","North Urban West"]
[52789,"LINNET PL","South West Urban"]
[30790,"LINTAINE PL","Central East"]
[35886,"LINTAINE/ST HELIERS WWAY (RP133)","Central East"]
[30791,"LINTHORPE CRES","Central East"]
[10555,"LINTON RD","North Rural"]
[20329,"LINWOOD AVE (GLENFIELD)","North Urban East"]
[34758,"LINWOOD AVE (MT ALBERT)","Central"]
[70340,"LINWOOD RD","South Rural"]
[30792,"LION PL","Central"]
[70992,"LIONEL SHARP PL","South Rural"]
[33965,"LIPPIATT RD","South West Urban"]
[51753,"LIPSCOMBE AVE","South West Urban"]
[60152,"LIPTON GR","South West Urban"]
[80439,"LIQUIDAMBAR DRIVE","North Urban West"]
[51754,"LISA RISE","South East Urban"]
[53558,"LISA-MARIE CRT","South East Urban"]
[30793,"LISBURN AVE","Central East"]
[53437,"LISCOOLY PL","South East Urban"]
[51755,"LISMORE PL","South West Urban"]
[22993,"LISMORE WAY","North Urban West"]
[33966,"LISNOE AVE","Central"]
[53344,"LISSLETON DR","South East Urban"]
[54217,"LISTACK DR","South East Urban"]
[30794,"LISTER ST","Central"]
[51756,"LISTON CRES","South East Urban"]
[21050,"LISTON ST","North Urban West"]
[70342,"LITCHFIELD PL","South Rural"]
[51757,"LITTEN RD (HOWICK)","South East Urban"]
[10556,"LITTIN RD (TAUHOA)","North Rural"]
[10557,"LITTLE BARRIER AVE","North Urban East"]
[34901,"LITTLE GEORGE ST","Central"]
[35666,"LITTLE GOAT RD","Hauraki Islands"]
[22366,"LITTLE KNIGHTS RD","North Urban East"]
[33967,"LITTLEJOHN ST","Central"]
[30795,"LIVERPOOL ST (CITY)","Central"]
[60153,"LIVERPOOL ST (PAPAKURA)","South West Urban"]
[33968,"LIVERPOOL ST (ROYAL OAK)","Central"]
[80356,"LIVERPOOL ST EXTN","South West Urban"]
[22927,"LIVING STREAM AVE","North Urban West"]
[30796,"LIVINGSTONE ST (GREY LYNN)","Central"]
[20261,"LIVINGSTONE ST (TAKAPUNA)","North Urban East"]
[53044,"LIZZIE LANE","South East Urban"]
[51759,"LLOYD AVE","South West Urban"]
[34881,"LLOYD AVE (EAST)","Central"]
[33969,"LLOYD AVE (WEST)","Central"]
[54839,"LLOYD AVE-WILMSHURST AVE","South West Urban"]
[11458,"LLOYD DR","North Rural"]
[10558,"LLOYD RD","North Rural"]
[52890,"LOBELIA RISE","South West Urban"]
[33970,"LOCARNO AVE","Central"]
[15336,"LOCARNO AVE/FERGUSSON RESERVE LINK CYWAY","Central"]
[30797,"LOCH ST","Central East"]
[52743,"LOCHEND PL","South East Urban"]
[15636,"LOCHEND PL EAST LINK CYWAY","South East Urban"]
[15634,"LOCHEND PL LINK CYWAY","South East Urban"]
[30798,"LOCHIEL RD","Central East"]
[51760,"LOCHINVER RD","South West Urban"]
[70993,"LOCHVIEW TCE","South Rural"]
[33971,"LOCKE AVE","Central"]
[20420,"LOCKET RD","North Urban West"]
[35057,"LOCKHART PL","Central East"]
[80672,"LOCKHEED STREET","North Urban West"]
[47180,"LOCKINGTON AVE","West"]
[70343,"LOCKWOOD RD","South Rural"]
[80457,"LOCKYER ROAD","North Rural"]
[53682,"LODGE LANE (PVT)","South East Urban"]
[11483,"LOFT PL","North Rural"]
[40692,"LOG RACE RD","West"]
[15686,"LOGAN CARR RESERVE LAKE NORTH CYWAY","South East Urban"]
[15685,"LOGAN CARR RESERVE NORTH (EAST - WEST) CYWAY","South East Urban"]
[15682,"LOGAN CARR RESERVE WEST CYWAY","South East Urban"]
[70344,"LOGAN DR","South Rural"]
[71182,"LOGAN PL","South Rural"]
[70345,"LOGAN RD (BUCKLAND)","South Rural"]
[30799,"LOGAN TCE","Central"]
[53258,"LOLIM PL","South West Urban"]
[51761,"LOLOMA DR","South East Urban"]
[51762,"LOMAS PL","South West Urban"]
[22984,"LOMAS WAY","North Urban West"]
[30800,"LOMBARD ST","Central East"]
[35825,"LOMBARD/POLYGON WWAY (RP79 END)","Central East"]
[60616,"LOMBARDIA WAY","South West Urban"]
[36056,"LOMBARDY GREEN (PVT)","Central East"]
[51763,"LOMEER WAY  (PVT)","South Rural"]
[20156,"LOMOND ST","North Urban East"]
[30801,"LONDON ST (PONSONBY)","Central"]
[70995,"LONDON ST (PUKEKOHE)","South Rural"]
[40691,"LONDON ST (WAITAKERE)","West"]
[70024,"LONDON ST EXTN","South Rural"]
[40690,"LONE KAURI RD","West"]
[47061,"LONE TREE AVE","West"]
[20664,"LONELY TRACK RD (ALBANY)","North Urban West"]
[11146,"LONELY TRACK RD (GLENVAR)","North Urban West"]
[20745,"LONG BAY DR","North Urban East"]
[23090,"LONG BAY DR LLA (#9 - #11)","North Urban East"]
[30802,"LONG DR","Central East"]
[40689,"LONG RD","West"]
[22368,"LONG ST","North Urban East"]
[40688,"LONGBILL PL","West"]
[40686,"LONGBILL PL HAMMERHEAD","West"]
[48124,"LONGBILL PL HAMMERHEAD WWAY","West"]
[40685,"LONGBURN RD","West"]
[48194,"LONGBURN RD WWAY","West"]
[48195,"LONGBURN RD WWAY FORK","West"]
[47182,"LONGBUSH RD","West"]
[40684,"LONGFELLOW PDE","West"]
[60494,"LONGFORD PARK DR","South West Urban"]
[15403,"LONGFORD PARK DR CYWAY (RP380)","South West Urban"]
[60550,"LONGFORD PARK RAB","South West Urban"]
[33972,"LONGFORD ST","Central East"]
[11582,"LONGMORE LANE","North Urban East"]
[15021,"LONGMORE LN/ARRAN DR CYWAY","North Urban East"]
[40683,"LONGREACH DR","West"]
[47183,"LONGVIEW RISE","West"]
[20319,"LONGWOOD PL","North Urban East"]
[33973,"LONSDALE ST","Central East"]
[40682,"LOOKOUT DR","West"]
[10560,"LOOP RD","North Urban East"]
[60154,"LORELEI PL","South West Urban"]
[40681,"LORENA PL","West"]
[54813,"LORENZO WAY","South East Urban"]
[35003,"LORETO HGTS (PVT)","Central East"]
[41295,"LORI PL","West"]
[51764,"LORIEN PL","South East Urban"]
[22732,"LORIKEET PL","North Urban West"]
[60523,"LORIS PL","South West Urban"]
[30803,"LORNE ST (NORTH)","Central"]
[30868,"LORNE ST (SOUTH)","Central"]
[33974,"LORRAINE AVE","Central"]
[52981,"LOTHIAN BRAE","South West Urban"]
[54318,"LOTHIAN BRAE EXTN","South West Urban"]
[51765,"LOTUS LANE  (PVT)","South West Urban"]
[71442,"LOUGH BOURNE DR","South Rural"]
[70186,"LOUGH BOURNE DR (NORTHBOUND)","South Rural"]
[22968,"LOUGH DERG PL","North Urban West"]
[41239,"LOUGHANURE PL","West"]
[53132,"LOUGHINISLAND PL","South West Urban"]
[22939,"LOUGHROS PL","North Urban West"]
[23029,"LOUGHROS PL (ALBANY)","North Urban West"]
[54189,"LOUIS BRAILLE LANE","South East Urban"]
[22369,"LOUISE PL (ALBANY)","North Urban East"]
[40680,"LOUISE PL (WAITAKERE)","West"]
[48270,"LOUISE PL WWAY","West"]
[48269,"LOUISE PL WWAY - HOBSONVILLE #93A WWAY","West"]
[33975,"LOUVAIN AVE","Central"]
[22949,"LOUVAIN PL","North Urban West"]
[51766,"LOVEGROVE CRES","South West Urban"]
[15608,"LOVEGROVE CRES LINK CYWAY","South West Urban"]
[22777,"LOVELL CRT","North Urban West"]
[33976,"LOVELOCK AVE","Central"]
[33006,"LOVERS LANE (PARNELL)","Central"]
[11331,"LOVERS LANE (WELLSFORD)","North Rural"]
[51767,"LOWBURN PL","South East Urban"]
[20112,"LOWE ST","North Urban East"]
[40679,"LOWELL PL","West"]
[30804,"LOWER ALBERT ST","Central"]
[30376,"LOWER DOMAIN DR","Central"]
[34910,"LOWER DOMAIN/BOWLING CLUB ACCESS","Central"]
[30806,"LOWER HOBSON ST (EAST)","Central"]
[34842,"LOWER HOBSON ST (WEST)","Central"]
[10561,"LOWER JEFFS RD","North Rural"]
[33977,"LOWER MUNICIPAL PL","Central East"]
[10562,"LOWER SILVER HILL RD","North Rural"]
[33979,"LOWERY AVE","Central"]
[70347,"LOWRY RD","South Rural"]
[71261,"LOWRY RD EXTN (RP1360 LHS)","South Rural"]
[40678,"LOWTHERHURST RD","West"]
[51768,"LUANA WAY (PVT)","South East Urban"]
[40677,"LUANDA DR","West"]
[48205,"LUANDA DRV WWAY 1","West"]
[48206,"LUANDA DRV WWAY 2","West"]
[48207,"LUANDA DRV WWAY 2 FORK","West"]
[34855,"LUCAS LANE (PVT)","Central East"]
[51769,"LUCAS PL","South West Urban"]
[24008,"LUCAS POINT (PVT)","North Urban West"]
[22718,"LUCAS WAY","North Urban West"]
[54221,"LUCCA CRES","South East Urban"]
[30807,"LUCERNE RD","Central East"]
[15323,"LUCERNE RD/MEADOWBANK RD CYWAY (RP1354)","Central East"]
[15324,"LUCERNE RD/ORAKEI BASIN CARPARK CYWAY (RP1326)","Central East"]
[31562,"LUCERNE/BENSON RAB","Central East"]
[35560,"LUCIA GL","Central East"]
[41429,"LUCIENNE DR","West"]
[40160,"LUCINDA PL","West"]
[48044,"LUCINDA PL WWAY","West"]
[35588,"LUCK CRES (PVT)","Central"]
[40676,"LUCKENS RD","North Urban West"]
[48256,"LUCKENS RD - PATTI #36 WWAY","West"]
[48257,"LUCKENS RD WWAY","North Urban West"]
[15162,"LUCKENS RESERVE EAST - WEST CYWAY","North Urban West"]
[30808,"LUCKNOW PL","West"]
[10563,"LUCY FOSTER LANE","North Urban East"]
[35258,"LUCY LANE","Central"]
[71484,"LUDLOW PL","South Rural"]
[20388,"LUDLOW TCE","North Urban West"]
[51771,"LUKE PL (EASTERN BEACH)","South East Urban"]
[51770,"LUKE PL (OTARA)","South West Urban"]
[33980,"LUKE ST","South West Urban"]
[34727,"LUKE ST EAST","South West Urban"]
[47299,"LUMINO LANE","West"]
[71314,"LUMS ACCESS RD","South Rural"]
[47287,"LUNA PL","West"]
[33982,"LUNN AVE","Central East"]
[41425,"LUPETTI RISE","North Urban West"]
[51772,"LUPLAU CRES","South East Urban"]
[51773,"LUPTON RD","South West Urban"]
[53355,"LURGAN DR","South East Urban"]
[30809,"LURLINE AVE","Central"]
[30810,"LUSH AVE","Central East"]
[52968,"LUSHINGTON PL","South East Urban"]
[52912,"LUTANA PL","South East Urban"]
[51774,"LUTON AVE","South East Urban"]
[40675,"LUXOR PL","West"]
[40674,"LYDFORD PL","West"]
[20559,"LYDIA AVE","North Urban West"]
[80517,"LYDIARD PL","South Rural"]
[51775,"LYELL CRT","South East Urban"]
[20339,"LYFORD CRES","North Urban East"]
[51776,"LYMPNE LANE","South West Urban"]
[30811,"LYNBROOKE AVE","West"]
[35749,"LYNBROOKE AVE WWAY (RP877 RHS)","West"]
[30812,"LYNCH ST","Central"]
[51777,"LYNCROFT ST","South West Urban"]
[71244,"LYND RD","South Rural"]
[30813,"LYNDALE PL","Central East"]
[35880,"LYNDALE/GUILDFORD WWAY (RP158)","Central East"]
[21051,"LYNDEN AVE","North Urban West"]
[40673,"LYNDHURST RD","West"]
[30814,"LYNDHURST ST","Central East"]
[30815,"LYNDOCK ST","Central"]
[51778,"LYNDON PL","South West Urban"]
[51779,"LYNETTE PL","South West Urban"]
[34856,"LYNFIELD PL (PVT)","Central"]
[21052,"LYNGATE PL","North Urban West"]
[51780,"LYNLEY PL","South East Urban"]
[70996,"LYNLEY TCE","South Rural"]
[51781,"LYNMORE DR","South West Urban"]
[51782,"LYNN PL","South West Urban"]
[20047,"LYNN RD","North Urban West"]
[11457,"LYNTON MASTERS LANE","North Rural"]
[51783,"LYNTON RD (BUCKLANDS BEACH)","South East Urban"]
[33984,"LYNTON RD (MT WELLINGTON)","Central East"]
[40141,"LYNWOOD RD","West"]
[33985,"LYON AVE","Central"]
[20582,"LYONS AVE","North Urban East"]
[51784,"LYREN PL","South East Urban"]
[22117,"LYSANDER CRES","North Urban West"]
[20842,"LYSANDER CRES SERVICE LANE","North Urban West"]
[10564,"LYSNAR RD (MATAKANA)","North Rural"]
[10565,"LYSNAR RD 2 (WAINUI)","North Rural"]
[51785,"LYTHAM LANE","South West Urban"]
[11401,"LYTTLE LANE","North Rural"]
[20315,"LYTTLETON AVE","North Urban East"]
[20589,"LYTTON ST","North Urban East"]
[10629,"M GREENWOOD RD","North Rural"]
[60588,"MAADI PL","South West Urban"]
[30816,"MAAKA PL","Central East"]
[35049,"MABEY RD","Hauraki Islands"]
[11347,"MABLY CRT","North Urban East"]
[53048,"MACADAMIA CLOSE","South West Urban"]
[30818,"MACAULAY ST","Central"]
[60155,"MACK PL","South West Urban"]
[80371,"MACKAY DR","North Urban West"]
[30821,"MACKELVIE ST","Central"]
[40672,"MACKENZIE ST","West"]
[22878,"MACKWELL RD","North Urban West"]
[22121,"MACKWOOD PL","North Urban West"]
[51786,"MACKY AVE (MANGERE)","South West Urban"]
[20754,"MACKY AVE (NORTH HEAD)","North Urban East"]
[10566,"MACKY RD","North Rural"]
[30822,"MACLAURIN ST","West"]
[15827,"MACLEANS PARK/THE ESPLANADE LINK CYWAY","South East Urban"]
[51787,"MACLEANS RD","South East Urban"]
[15830,"MACLEANS RD/CHARLES DICKENS DR CYWAY","South East Urban"]
[15826,"MACLEANS RD/OLIVER RD CYWAY","South East Urban"]
[54654,"MACLEANS/MURVALE RAB","South East Urban"]
[54655,"MACLEANS/PRIESTLEY RAB","South East Urban"]
[34009,"MACMILLAN RD","Hauraki Islands"]
[30823,"MACMURRAY RD","Central East"]
[22370,"MACNAY WAY","North Urban East"]
[53188,"MACNEAN DR","South East Urban"]
[30824,"MACPHERSON ST","Central East"]
[35856,"MACPHERSON/WAIATARUA WWAY (RP184)","Central East"]
[40671,"MACROCARPA PL","West"]
[60466,"MACWHINNEY DR","South Rural"]
[70375,"MADDAFORD RD","South Rural"]
[80456,"MADDEN AVENUE","North Rural"]
[30825,"MADDEN ST","Central"]
[80262,"MADDIES RD","North Rural"]
[30827,"MADEIRA LANE","Central"]
[30828,"MADEIRA PL","Central"]
[40670,"MADIGAN PL","West"]
[48125,"MADIGAN PL WWAY","West"]
[20328,"MADISON PL","North Urban East"]
[80265,"MADISON TCE","North Urban East"]
[51788,"MADRONA PL","South East Urban"]
[10567,"MAENEENE RD","North Rural"]
[40669,"MAGDALEN PL","West"]
[48279,"MAGDALEN PL WWAY","West"]
[53100,"MAGEE PL","South East Urban"]
[51789,"MAGELLAN PL","South West Urban"]
[53096,"MAGHERA DR","South East Urban"]
[53074,"MAGIC WAY","South West Urban"]
[54336,"MAGIC/SKELTON RAB","South East Urban"]
[53097,"MAGILLIGAN CLOSE","South East Urban"]
[35961,"MAGMA CRES","Central East"]
[60156,"MAGNOLIA AVE","South West Urban"]
[70905,"MAGNOLIA DR","South Rural"]
[53586,"MAGNOLIA PL","South East Urban"]
[10568,"MAHANA RD","North Rural"]
[22122,"MAHARA AVE","North Urban West"]
[30829,"MAHEKE ST","Central East"]
[70376,"MAHER RD","South Rural"]
[51790,"MAHIA RD","South West Urban"]
[54356,"MAHIA/COXHEAD RAB","South West Urban"]
[47102,"MAHINA PL","West"]
[30830,"MAHOE AVE","Central East"]
[71531,"MAHOE GL","South Rural"]
[71541,"MAHOE GL EXTN","South Rural"]
[40668,"MAHOE RD","West"]
[10569,"MAHOENUI VALLEY RD","North Rural"]
[51792,"MAHON PL","South West Urban"]
[22823,"MAHONEY DR","North Urban West"]
[35290,"MAHUHU CRES","Central"]
[51793,"MAHUNGA DR","South West Urban"]
[10570,"MAHURANGI EAST RD","North Rural"]
[10571,"MAHURANGI ST","North Rural"]
[10572,"MAHURANGI WEST RD","North Rural"]
[30832,"MAHURU ST","Central"]
[21053,"MAHUTA GR","North Urban West"]
[80702,"MAHUTONGA AVE","South Rural"]
[51794,"MAICH RD","South West Urban"]
[54081,"MAICH RD CARPARK (RP38 RHS)","South West Urban"]
[54389,"MAICH RD CARPARK (RP50 LHS)","South East Urban"]
[54773,"MAICH RD SERVICE LANE (RP51 RHS)","South West Urban"]
[54774,"MAICH/NORTHCREST RAB","South West Urban"]
[51795,"MAIDA VALE","South West Urban"]
[53872,"MAIDA VALE-PRIMROSE PL","South West Urban"]
[22867,"MAIDSTONE PL","North Urban West"]
[30833,"MAIDSTONE ST","Central"]
[51796,"MAIL AVE","South West Urban"]
[34011,"MAIN HIGHWAY (EAST)","Central East"]
[34890,"MAIN HIGHWAY (WEST)","Central East"]
[31599,"MAIN HIGHWAY BUS LOOP (RP695 LHS)","Central East"]
[31680,"MAIN HIGHWAY EXTN","Central East"]
[70377,"MAIN RD","South Rural"]
[10578,"MAIN RD (SH16 HUAPAI)","North Rural"]
[11587,"MAIN ST (EAST BOUND)","North Urban East"]
[11588,"MAIN ST (WEST BOUND)","North Urban East"]
[10579,"MAINLAND RD","North Rural"]
[30834,"MAINSTON RD","Central East"]
[30835,"MAIORO ST","West"]
[80257,"MAIORO ST EXTN NTHBND","Central"]
[15290,"MAIORO ST EXTN SB/MELROSE RD CYWAY (RP183)","Central"]
[80256,"MAIORO ST EXTN STHBND","Central"]
[15255,"MAIORO ST/DICKEY ST CYWAY (RP494)","West"]
[26078,"MAIRANGI BAY ARTS CENTRE CARPARK","North Urban East"]
[10580,"MAIRE RD","North Urban East"]
[30836,"MAIRE ST","West"]
[10581,"MAIRETAHI RD","North Rural"]
[51798,"MAITLAND PL","South West Urban"]
[51799,"MAJESTY PL","South East Urban"]
[80227,"MAJOR HENRY GREENS (NORTHBOUND)","North Urban East"]
[80226,"MAJOR HENRY GREENS (SOUTH BOUND)","North Urban East"]
[10582,"MAKARAU RD","North Rural"]
[22123,"MAKEPIECE PL","North Urban West"]
[60407,"MAKETU RD","South Rural"]
[80584,"MAKI ST","West"]
[11134,"MAKIRI ST","North Rural"]
[41180,"MAKO ST (HOBSONVILLE)","North Urban West"]
[34014,"MAKO ST (WAIHEKE)","Hauraki Islands"]
[48229,"MAKO ST WWAY","North Urban West"]
[34985,"MAKO/CHURCH BAY SLIP","Hauraki Islands"]
[35912,"MAKO/KUAKA WWAY (RP420 LHS)","Hauraki Islands"]
[34013,"MAKORA AVE","Hauraki Islands"]
[40667,"MAKORA RD","West"]
[80605,"MAKURA RD","North Urban East"]
[34015,"MALABAR DR","Central East"]
[53551,"MALAHIDE DR","South East Urban"]
[53873,"MALAHIDE DR-FRIAR CLOSE","South East Urban"]
[54765,"MALAHIDE/DARION RAB","South East Urban"]
[54451,"MALAHIDE/JERPOINT RAB #1","South East Urban"]
[54766,"MALAHIDE/JERPOINT RAB #2","South East Urban"]
[40036,"MALAM ST","West"]
[51800,"MALASPINA PL","South West Urban"]
[80537,"MALBEC PL","North Rural"]
[51801,"MALCOLM PL","South West Urban"]
[30837,"MALCOLM ST","Central"]
[52965,"MALDON CRT","South East Urban"]
[20102,"MALEME AVE","North Urban East"]
[20494,"MALIBU GR","North Urban West"]
[22936,"MALIN PL","North Urban West"]
[22622,"MALLARD PL","North Urban West"]
[51802,"MALLOY PL","South East Urban"]
[51803,"MALMO PL (MANUREWA)","South West Urban"]
[40666,"MALMO PL (MASSEY)","West"]
[34017,"MALONE RD","Central East"]
[30838,"MALORY ST","West"]
[51804,"MALTE BRUN PL","South West Urban"]
[22371,"MALTERS PL","North Urban East"]
[30839,"MALVERN RD (MORNINGSIDE)","Central"]
[34019,"MALVERN RD (TE PAPAPA)","Central East"]
[51805,"MALVINA PL","South East Urban"]
[30840,"MAMAKU ST","Central East"]
[31565,"MAMAKU ST LOOP","Central East"]
[47217,"MAMARI RD (NORTH)","North Urban West"]
[40665,"MAMARI RD (SOUTH)","North Urban West"]
[30841,"MAMIE ST","Central"]
[34997,"MAN O WAR BAY RD (NORTH)","Hauraki Islands"]
[34998,"MAN O WAR BAY RD (SOUTH)","Hauraki Islands"]
[23040,"MANA LANE","North Urban West"]
[51806,"MANA PL","South West Urban"]
[22372,"MANAIA PL","North Urban East"]
[30842,"MANAPAU ST","Central East"]
[51807,"MANAPOURI PL","South East Urban"]
[54747,"MANAPOURI PL CARPARK (RP15 LHS)","South East Urban"]
[53189,"MANARA PL","South West Urban"]
[34020,"MANATU ST","Central"]
[30843,"MANAWA RD","Central East"]
[80699,"MANAWATERE WAY","South East Urban"]
[53623,"MANCHESTER DR","South East Urban"]
[71414,"MANDALAY PL","South Rural"]
[71470,"MANDALAY PL EXTN","South Rural"]
[51808,"MANDARIN PL","South East Urban"]
[15732,"MANDARIN PL/TANGELO PL CYWAY","South East Urban"]
[51809,"MANDER PL","South East Urban"]
[22701,"MANDEVILLE PL","North Urban West"]
[22684,"MANDICA PL","North Urban East"]
[53619,"MANDIVAL AVE","South East Urban"]
[80522,"MANENE ST","South West Urban"]
[10583,"MANGA RD","North Urban East"]
[10584,"MANGAKURA RD","North Rural"]
[51810,"MANGARATA AVE","South West Urban"]
[11466,"MANGATAWHIRI RD","North Rural"]
[10585,"MANGAWHAI RD","North Rural"]
[54162,"MANGERE BRIDGE TOWN CENTRE CARPARK","South West Urban"]
[34021,"MANGERE RD","South West Urban"]
[18004,"MANGERE TOWN CENTRE EAST CARPARK","South West Urban"]
[18005,"MANGERE TOWN CENTRE NORTHEAST CARPARK","South West Urban"]
[18001,"MANGERE TOWN CENTRE SERVICE LANE","South West Urban"]
[53346,"MANGERTON LANE (PVT)","South East Urban"]
[24061,"MANGOLIA TCE (PVT)","North Urban West"]
[51813,"MANGOS PL","South East Urban"]
[40664,"MANHATTAN HGTS","West"]
[11388,"MANHATTAN RISE","North Urban East"]
[22373,"MANLY ESPLANADE","North Urban East"]
[11533,"MANLY HEIGHTS","North Urban East"]
[10586,"MANLY PARK AVE","North Urban East"]
[20553,"MANNERING PL","North Urban West"]
[22734,"MANNIKIN PL","North Urban West"]
[53640,"MANNING RISE","South East Urban"]
[20625,"MANON CRES","North Urban West"]
[51814,"MANOR PARK","South East Urban"]
[15572,"MANOR PARK LINK CYWAY","South East Urban"]
[30844,"MANOR PL","Central"]
[53351,"MANRESA CLOSE (PVT)","South West Urban"]
[60157,"MANSE RD","South West Urban"]
[11624,"MANSEL DR","North Rural"]
[30845,"MANSFIELD ST","Central East"]
[41351,"MANSION CRT","North Urban West"]
[51815,"MANSTON RD","South West Urban"]
[47363,"MANTRA RD","West"]
[22625,"MANU PL","North Urban West"]
[51816,"MANU ST","South West Urban"]
[53688,"MANU TAPU DR (AIRPORT)","South West Urban"]
[10587,"MANUEL RD","North Urban East"]
[80632,"MANUEL/KINGFISHER RAB","North Urban East"]
[40663,"MANUI PL","West"]
[60344,"MANUIA RD","South West Urban"]
[60684,"MANUIA RD CARPARK (RP36 RHS)","South West Urban"]
[11558,"MANUKA GR","North Rural"]
[48053,"MANUKA PARK WWAY FORK","West"]
[48052,"MANUKA PARK WWAY MAIN","West"]
[20479,"MANUKA RD (GLENFIELD)","North Urban West"]
[41210,"MANUKA RD (TITIRANGI)","West"]
[34023,"MANUKA RD (WAIHEKE)","Hauraki Islands"]
[22591,"MANUKA RD LLA (#159 - #165)","North Urban West"]
[10588,"MANUKA ST","North Urban East"]
[70383,"MANUKAU HEADS RD","South Rural"]
[51817,"MANUKAU PLAZA (PVT)","South West Urban"]
[30846,"MANUKAU RD (CWC)","Central"]
[80313,"MANUKAU RD (CWCE)","Central East"]
[71372,"MANUKAU RD (PUKEKOHE)","South Rural"]
[35957,"MANUKAU RD CARPARK (RP4016 LHS)","Central East"]
[31707,"MANUKAU RD CARPARK/CAMPBELL SLIP","Central East"]
[31706,"MANUKAU RD CARPARK/TURAMA SLIP","Central East"]
[54780,"MANUKAU STATION RD (EASTBOUND)","South West Urban"]
[54781,"MANUKAU STATION RD (WESTBOUND)","South West Urban"]
[34961,"MANUKAU TAVERN RD","Central East"]
[35830,"MANUKAU/MT ALBERT RAB","Central East"]
[71539,"MANUKAU/NELSON RAB","South Rural"]
[71373,"MANUKAU/STADIUM RAB","South Rural"]
[71540,"MANUKAU/WRIGHTSON RAB","South Rural"]
[20163,"MANURERE AVE","North Urban East"]
[15456,"MANUREWA TRAIN STATION BRIDGE CYWAY","South West Urban"]
[60345,"MANUROA RD","South West Urban"]
[60683,"MANUROA RD CARPARK (RP428 RHS)","South West Urban"]
[20298,"MANUTARA AVE","North Urban East"]
[71193,"MANUWAI LANE","South Rural"]
[22374,"MANUWAI RD","North Urban East"]
[10589,"MAORI HUT RD","North Urban East"]
[15035,"MAORI HUT RD LINK CYWAY (RP171)","North Urban East"]
[15052,"MAORI HUT RD LINK CYWAY (RP325)","North Urban East"]
[15036,"MAORI HUT RD/POHUTUKAWA AVE LOOP CYWAY","North Urban East"]
[30847,"MAPAU RD","Central"]
[30848,"MAPIU ST","Central East"]
[11549,"MAPLE LANE","North Rural"]
[30849,"MAPLE ST","West"]
[51818,"MAPLESDEN DR","South West Urban"]
[53876,"MAPLESDEN DR-DUNGARVON PL","South West Urban"]
[80433,"MAPOU ROAD","North Urban West"]
[22124,"MAPPIN PL","North Urban West"]
[30850,"MARA ST","Central East"]
[35854,"MARA/TAHAPA WWAY (RP80 END)","Central East"]
[70384,"MARAE O REHIA RD","South Rural"]
[20619,"MARAE RD","North Urban West"]
[51819,"MARAETAI COAST RD","South Rural"]
[54520,"MARAETAI COAST RD CARPARK (RP192)","South Rural"]
[54519,"MARAETAI COAST RD CARPARK (RP262)","South Rural"]
[54778,"MARAETAI COAST RD CARPARK (RP30)","South Rural"]
[54779,"MARAETAI COAST RD CARPARK (RP4 RHS)","South Rural"]
[54518,"MARAETAI COAST RD CARPARK (RP982)","South Rural"]
[51820,"MARAETAI DR","South Rural"]
[80601,"MARAETAI DR - CRAIG RD","South Rural"]
[54776,"MARAETAI DR CARPARK (RP2482 LHS)","South Rural"]
[54777,"MARAETAI DR CARPARK (RP2647 LHS)","South Rural"]
[51821,"MARAETAI HEIGHTS RD","South Rural"]
[51822,"MARAETAI SCHOOL RD","South Rural"]
[54526,"MARAETAI SCHOOL RD CARPARK (RP35)","South Rural"]
[54525,"MARAETAI SCHOOL RD HLA (#34 - #54)","South Rural"]
[54524,"MARAETAI SCHOOL/TE PURU RAB","South Rural"]
[54775,"MARAETAI/REWA RAB","South Rural"]
[30851,"MARAMA AVE (EPSOM)","Central"]
[34024,"MARAMA AVE (WAIHEKE)","Hauraki Islands"]
[20206,"MARAMA ST - CASTOR BAY","North Urban East"]
[22376,"MARAMA ST - TORBAY","North Urban East"]
[35916,"MARAMA/HAMILTON WWAY (RP196 RHS)","Hauraki Islands"]
[30852,"MARANUI AVE","Central"]
[30853,"MARAU CRES","Central East"]
[35809,"MARAU CRES WWAY (RP102 LHS)","Central East"]
[22962,"MARBELLA CRES","North Urban West"]
[47103,"MARBELLA DR","West"]
[51823,"MARBETH CRT","South East Urban"]
[15691,"MARBETH CRT LINK CYWAY","South East Urban"]
[51824,"MARBLE PL","South West Urban"]
[54056,"MARBLE PL CARPARK","South West Urban"]
[71389,"MARBLEWOOD GR","South Rural"]
[53160,"MARC ELLIS PL","South East Urban"]
[20417,"MARCEL PL","North Urban West"]
[51825,"MARCO PL","South East Urban"]
[34025,"MARCO POLO AVE","Central"]
[30854,"MARCONI PL","West"]
[34026,"MAREI RD","Central East"]
[10590,"MARELLEN DR","North Urban East"]
[11183,"MARELLEN DR 16 - 24","North Urban East"]
[51826,"MARENDELLAS DR","South East Urban"]
[60581,"MARENGO PARKWAY","South West Urban"]
[70386,"MARERETU AVE","South Rural"]
[34027,"MARETH ST","Central East"]
[30855,"MAREWA RD","Central"]
[40661,"MAREWA ST","West"]
[40095,"MARGAN AVE (NEW LYNN)","West"]
[51827,"MARGAN AVE (PAPATOETOE)","South West Urban"]
[48027,"MARGAN AVE WWAY","West"]
[60158,"MARGAN PL","South West Urban"]
[41322,"MARGAN/RANKIN RAB","West"]
[40307,"MARGAN/SEABROOK SLIP","West"]
[30856,"MARGARET AVE","Central"]
[22789,"MARGARET HENRY CRES","North Urban West"]
[10591,"MARGARET PL (ARKLES BAY)","North Urban East"]
[71532,"MARGARET PL (WAIUKU)","South Rural"]
[20257,"MARGARET PL (WESTLAKE)","North Urban East"]
[51828,"MARGARET RD","South West Urban"]
[35575,"MARGARET REEVE LANE","Hauraki Islands"]
[60159,"MARGARET ST (PAPAKURA)","South West Urban"]
[30857,"MARGARET ST (PONSONBY)","Central"]
[35949,"MARGARET ST CARPARK (RP95 RHS)","Central"]
[60160,"MARGARET WILLIAMS DR","South West Urban"]
[71381,"MARGARITA RISE","South Rural"]
[30858,"MARGATE RD","West"]
[33133,"MARGATE RD HLA (#46 - #54)","West"]
[32970,"MARGOT ST","Central"]
[40660,"MARGUERITA PL","North Urban West"]
[48235,"MARGUERITA PL WWAY","North Urban West"]
[34029,"MARIA ST","Central East"]
[40659,"MARIANA PL","West"]
[34030,"MARIE AVE (HILLSBOROUGH)","Central"]
[10592,"MARIE AVE (RED BEACH)","North Urban East"]
[40658,"MARIE CRES","West"]
[35896,"MARIE/WARREN WWAY (RP191 LHS)","Central"]
[22377,"MARIGOLD PL","North Urban East"]
[15801,"MARINA HEIGHTS/KANIERE PL CYWAY","South East Urban"]
[51829,"MARINA HGTS","South East Urban"]
[22378,"MARINA RD","North Urban East"]
[40196,"MARINA VIEW DR","North Urban West"]
[15119,"MARINA VIEW DR LINK CYWAY (RP 765)","North Urban West"]
[15165,"MARINA VIEW DR LINK CYWAY (RP1014)","North Urban West"]
[48237,"MARINA VIEW DR WWAY - MARINA VIEW DR","North Urban West"]
[15164,"MARINA VIEW DR/LUCKENS RESERVE CYWAY (RP1077)","North Urban West"]
[15163,"MARINA VIEW DR/WISELY RD CYWAY (RP1095)","North Urban West"]
[34033,"MARINE LANE","Central East"]
[34967,"MARINE PARK AVE (RAK)","Hauraki Islands"]
[51830,"MARINE PDE (COCKLE BAY)","South East Urban"]
[30859,"MARINE PDE (HERNE BAY)","Central"]
[11412,"MARINE PDE NORTH (OREWA)","North Urban East"]
[40657,"MARINE PDE NORTH (PIHA)","West"]
[10593,"MARINE PDE SOUTH (OREWA)","North Urban East"]
[40656,"MARINE PDE SOUTH (PIHA)","West"]
[20067,"MARINE TCE","North Urban East"]
[11563,"MARINE VIEW","North Urban East"]
[34032,"MARINE VIEW RD","Hauraki Islands"]
[10594,"MARINER DR","North Urban East"]
[53541,"MARINER LANE","South Rural"]
[51831,"MARINER ST","South West Urban"]
[10595,"MARINERS GR","North Rural"]
[22897,"MARINERS VIEW RD","North Urban West"]
[40655,"MARINICH DR","West"]
[47301,"MARINICH DR (SOUTH)","West"]
[30860,"MARINO PL","Central East"]
[34034,"MARION AVE","Central"]
[30861,"MARION PL","Central East"]
[34035,"MARIPOSA AVE","Central"]
[35697,"MARIPOSA AVE WWAY (RP211 RHS)","Central"]
[22125,"MARIPOSA CRES","North Urban West"]
[22538,"MARIPOSA-PALMERSTON LINK","North Urban West"]
[34038,"MARIRI RD","Central East"]
[22126,"MARITIME TCE","North Urban West"]
[34039,"MARJORIE JAYNE CRES","South West Urban"]
[53157,"MARK CARTER PL","South East Urban"]
[53275,"MARK EDGAR PL","South West Urban"]
[51832,"MARK EDWARD DR","South East Urban"]
[34040,"MARK RD","Central"]
[52939,"MARK WILLIAMS PL","South Rural"]
[60161,"MARKEDO PL","South West Urban"]
[20404,"MARKEN PL","North Urban West"]
[33012,"MARKET LANE (PVT)","Central"]
[30862,"MARKET PL","Central"]
[15234,"MARKET PL CYWAY","Central"]
[80314,"MARKET RD (REMUERA) (CWC)","Central"]
[30863,"MARKET RD (REMUERA) (CWCE)","Central East"]
[51833,"MARKHAM PL","South East Urban"]
[70388,"MARKHAM RD","South Rural"]
[20435,"MARLBOROUGH AVE","North Urban West"]
[20857,"MARLBOROUGH PARK SERVICE LANE","North Urban West"]
[34042,"MARLBOROUGH ST (KINGSLAND)","Central"]
[40654,"MARLENE AVE","West"]
[40653,"MARLIN ST","North Urban West"]
[53252,"MARLON LANE","South East Urban"]
[30864,"MARLOWE RD","West"]
[30865,"MARMION ST","Central"]
[60162,"MARNE RD (PAPAKURA)","South West Urban"]
[34043,"MARNE RD (SANDRINGHAM)","Central"]
[34044,"MAROA RD","Central East"]
[51834,"MAROUBRA PL","South East Urban"]
[60592,"MARPHONA CRES","South West Urban"]
[22861,"MARQUETTE AVE","North Urban West"]
[51835,"MARR RD","South West Urban"]
[51836,"MARRIOTT RD","South East Urban"]
[54009,"MARRIOTT RD-CARDIFF RD","South East Urban"]
[34045,"MARS AVE","Central"]
[34046,"MARSDEN AVE","Central"]
[20119,"MARSDEN ST","North Urban East"]
[20220,"MARSH AVE","North Urban East"]
[10597,"MARSH RD","North Rural"]
[34047,"MARSHALL LAING AVE","Central"]
[70390,"MARSHALL RD (GRAHAMS BEACH)","South Rural"]
[30866,"MARSTON ST","Central"]
[51837,"MARTHA LANE","South West Urban"]
[10598,"MARTIN ACCESS RD","North Rural"]
[34048,"MARTIN AVE (MT ALBERT)","Central"]
[30867,"MARTIN AVE (REMUERA)","Central East"]
[21054,"MARTIN CRESENT","North Urban West"]
[41352,"MARTIN JUGUM LANE","West"]
[48199,"MARTIN JUGUM LANE WWAY","West"]
[34049,"MARTIN PL (MT WELLINGTON)","Central East"]
[36075,"MARTIN PL (PVT)","Central East"]
[40652,"MARTIN PL (WAITAKERE)","West"]
[70391,"MARTIN RD (AWHITU)","South Rural"]
[51838,"MARTIN RD (MANUREWA)","South West Urban"]
[10599,"MARTIN RD (RAINBOWS END)","North Rural"]
[70551,"MARTINGALE DR","South Rural"]
[10600,"MARTINS BAY RD","North Rural"]
[70846,"MARTYN ST","South Rural"]
[70392,"MARTYN WRIGHT RD","South Rural"]
[70125,"MARTYN WRIGHT RD HAMMERHEAD","South Rural"]
[60350,"MARU RD","South West Urban"]
[34051,"MARUA RD (ELLERSLIE)","Central East"]
[80069,"MARUA WAY","North Rural"]
[51839,"MARVON DOWNS AVE","South East Urban"]
[15774,"MARVON DOWNS/ELM PARK SCHOOL CYWAY","South East Urban"]
[54130,"MARWAN CRES","South West Urban"]
[15557,"MARWAN CRES LINK CYWAY (RP47)","South West Urban"]
[15562,"MARWAN CRES LINK CYWAY (RP6)","South West Urban"]
[30869,"MARY DREAVER ST","West"]
[22976,"MARY FORGHAM DR","North Urban West"]
[10491,"MARY KEANE LANE","North Rural"]
[51840,"MARY PL","South West Urban"]
[20174,"MARY POYNTON CRES","North Urban East"]
[34052,"MARY ST","Central"]
[22905,"MARYANN PL","North Urban West"]
[60163,"MARYBETH PL","South West Urban"]
[34053,"MARYDALE DR","Central"]
[30870,"MARYLAND ST","Central"]
[20269,"MARYWILL CRES","North Urban West"]
[51841,"MASCOT AVE","South West Urban"]
[15528,"MASCOT AVE/PERSHORE PL CYWAY","South West Urban"]
[53879,"MASCOT AVE-FORBURY PL","South West Urban"]
[53880,"MASCOT AVE-NEVIS PL","South West Urban"]
[35589,"MASEFIELD AVE (PVT)","Central"]
[51842,"MASEFIELD ST","South East Urban"]
[30871,"MASKELL ST","Central East"]
[48015,"MASON  ST - SHERIDAN DR WWAY","West"]
[34054,"MASON AVE (OTAHUHU)","South West Urban"]
[71000,"MASON AVE (PUKEKOHE)","South Rural"]
[11210,"MASON HEIGHTS","North Rural"]
[34055,"MASON RD","Hauraki Islands"]
[23066,"MASON RD EXTN","North Urban West"]
[40086,"MASON ST","West"]
[48014,"MASON ST - HEPPER ST WWAY","West"]
[35890,"MASON/NIKAU WWAY (RP300 LHS)","South West Urban"]
[30872,"MASONS AVE","Central"]
[20670,"MASONS RD (ALBANY)","North Urban West"]
[51843,"MASONS RD (EAST TAMAKI HEIGHTS)","South East Urban"]
[34752,"MASSEY AVE (GREENLANE)","Central East"]
[71001,"MASSEY AVE (PUKEKOHE)","South Rural"]
[71434,"MASSEY AVE CARPARK (RP89 RHS)","South Rural"]
[52773,"MASSEY RD","South West Urban"]
[54170,"MASSEY RD CARPARK (RP1426 RHS)","South West Urban"]
[54599,"MASSEY RD CARPARK (RP1461 RHS)","South West Urban"]
[54207,"MASSEY RD CARPARK (RP2235 RHS)","South West Urban"]
[54163,"MASSEY RD CARPARK (RP4497 RHS)","South West Urban"]
[54600,"MASSEY RD CARPARK (RP4520 RHS)","South West Urban"]
[53881,"MASSEY RD-WINDRUSH CLOSE","South West Urban"]
[52924,"MASSEY SERVICE LANE (RP176 RHS)","South West Urban"]
[51845,"MASSINE PL","South West Urban"]
[51846,"MASTERS PL","South West Urban"]
[22379,"MASTERTON RD","North Urban East"]
[22056,"MATAI RD (CHELTENHAM)","North Urban East"]
[32968,"MATAI RD (GREENLANE)","Central"]
[10602,"MATAI RD (STANMORE BAY)","North Urban East"]
[34837,"MATAI RD (WAIHEKE)","Hauraki Islands"]
[11281,"MATAI RD 21 - 27","North Urban East"]
[70863,"MATAI ST","South Rural"]
[10603,"MATAKANA RD","North Rural"]
[10604,"MATAKANA VALLEY RD","North Rural"]
[10605,"MATAKANA WHARF RD","North Rural"]
[10606,"MATAKATIA PDE","North Urban East"]
[70396,"MATAKAWAU RD","South Rural"]
[80628,"MATAKU WAY","North Urban West"]
[40189,"MATAMA RD","West"]
[51847,"MATAMATA PL","South West Urban"]
[54469,"MATAMATA PL HAMMERHEAD","South West Urban"]
[34056,"MATANGI RD","Central East"]
[10607,"MATANGI TCE","North Rural"]
[21055,"MATANUI ST","North Urban West"]
[34058,"MATAPAN RD","Central East"]
[34057,"MATAPANA RD","Hauraki Islands"]
[51848,"MATAPOURI RD","South West Urban"]
[53343,"MATARANGI RD","South East Urban"]
[11554,"MATARIKI ST","North Rural"]
[34831,"MATAROA RD","Central East"]
[60698,"MATATA DR","South West Urban"]
[30873,"MATATA ST","West"]
[71002,"MATATEA AVE","South Rural"]
[10608,"MATATEA RD","North Rural"]
[30874,"MATATUA ST","Central East"]
[47254,"MATAU RISE","West"]
[40520,"MATAU RISE LOOP","West"]
[51849,"MATAURA PL","South East Urban"]
[53882,"MATAURA PL-ASPIRING AVE","South East Urban"]
[60440,"MATAWALU PL","South West Urban"]
[51850,"MATCHETT WAY (PVT)","South West Urban"]
[10609,"MATHESON BAY RD","North Rural"]
[11501,"MATHESON BUSH RD","North Rural"]
[70397,"MATHESON RD (PAPARIMU)","South Rural"]
[10610,"MATHESON RD (RED BEACH)","North Urban East"]
[10611,"MATHESON RD 2 (WELLSFORD)","North Rural"]
[60461,"MATHESON ST","South West Urban"]
[70398,"MATHIS RD","South Rural"]
[34059,"MATIERE RD","Central East"]
[10612,"MATIJA PL","North Urban East"]
[52949,"MATILDA PL","South West Urban"]
[22381,"MATIPO RD (AC.WAY)","North Urban East"]
[22380,"MATIPO RD (TAKAPUNA)","North Urban East"]
[40651,"MATIPO RD (TE ATATU)","West"]
[34060,"MATIPO ST","Central"]
[40650,"MATISSE DR","North Urban West"]
[53198,"MATTALIE PL","South West Urban"]
[51852,"MATTERHORN CRES","South East Urban"]
[10613,"MATTHEW RD","North Rural"]
[71452,"MATTHEW WHITFORD DR","South Rural"]
[51853,"MATTHEWS RD","South East Urban"]
[51854,"MATTSON RD","South East Urban"]
[51855,"MATUA PL","South West Urban"]
[10614,"MATUA RD","North Rural"]
[53539,"MATUHI GR","South West Urban"]
[40649,"MATUHI RISE","West"]
[51856,"MATUKU PL","South West Urban"]
[10615,"MAUDE ST","North Rural"]
[51857,"MAUGHAM DR","South East Urban"]
[35053,"MAUI GR (PVT)","Central"]
[30875,"MAUI POMARE ST","West"]
[40096,"MAUI ST","West"]
[80372,"MAUKU LANE","North Urban West"]
[70399,"MAUKU RD","South Rural"]
[40128,"MAUNDER PL","West"]
[34061,"MAUNGAKIEKIE AVE","Central"]
[22127,"MAUNGANUI RD","North Urban West"]
[35923,"MAUNGAREI MEMORIAL DR (PVT)","Central East"]
[30876,"MAUNGAREI RD","Central East"]
[31564,"MAUNGAREI RD EXTN (RP434 RHS)","Central East"]
[35012,"MAUNGATAWHIRI RD (GBI)","Hauraki Islands"]
[30877,"MAUNGAWHAU RD","Central"]
[30878,"MAUNSELL RD","Central"]
[34908,"MAUNSELL RD EXTN","Central"]
[51858,"MAUNU RD","South West Urban"]
[30879,"MAURANUI AVE","Central"]
[34063,"MAURETANIA PL","Central"]
[41296,"MAURICE BORICH PL","West"]
[40170,"MAURICE BORICH PL HAMMERHEAD","West"]
[41395,"MAURICE BORICH/WELCOME RAB","West"]
[53255,"MAURICE PAYKEL PL","South East Urban"]
[54480,"MAURICE PAYKEL RAB","South East Urban"]
[34753,"MAURICE RD (PENROSE)","Central East"]
[60164,"MAURICE ST","South West Urban"]
[22128,"MAVIS PL","North Urban West"]
[51859,"MAWKES LANE","South West Urban"]
[40648,"MAWNEY RD","West"]
[22383,"MAWSON AVE","North Urban East"]
[71405,"MAX SHORT DR","South Rural"]
[34064,"MAXFIELD PL","Central"]
[30880,"MAXINE PL","Central East"]
[70401,"MAXTED RD","South Rural"]
[30881,"MAXWELL AVE (GREY LYNN)","Central"]
[51860,"MAXWELL AVE (PAPATOETOE)","South West Urban"]
[22382,"MAXWELTON DR","North Urban East"]
[40647,"MAY AVE","West"]
[34065,"MAY RD (MT ROSKILL)","Central"]
[51861,"MAY RD (PAPATOETOE)","South West Urban"]
[15280,"MAY RD/RICHARDSON RD CYWAY","Central"]
[11289,"MAY WAY","North Rural"]
[22129,"MAYALL AVE","North Urban West"]
[34066,"MAYBECK RD","Central"]
[40646,"MAYBELLE PL","West"]
[53312,"MAYBOLE DR","South East Urban"]
[40645,"MAYBURN RD","West"]
[30882,"MAYBURY ST","Central East"]
[31589,"MAYBURY/DALTON RAB","Central East"]
[35871,"MAYBURY/PT ENGLAND WWAY (RP600)","Central East"]
[40644,"MAYER PL","West"]
[22384,"MAYFAIR CRES","North Urban East"]
[24077,"MAYFAIR DR (ALBANY) (PVT)","North Urban East"]
[24090,"MAYFAIR DR (TAKAPUNA) (PVT)","North Urban East"]
[30883,"MAYFAIR PL (GLEN INNES)","Central East"]
[41301,"MAYFAIR PL (WAITAKERE)","West"]
[20457,"MAYFIELD RD","North Urban West"]
[51862,"MAYFLOWER CLOSE","South West Urban"]
[53883,"MAYFLOWER CLOSE-HENWOOD RD","South West Urban"]
[10616,"MAYGROVE DR","North Urban East"]
[15042,"MAYGROVE DR LINK CYWAY (RP273)","North Urban East"]
[15043,"MAYGROVE DR LINK CYWAY (RP353)","North Urban East"]
[15044,"MAYGROVE DR LINK CYWAY (RP483)","North Urban East"]
[70402,"MAYHEAD RD","South Rural"]
[11570,"MAYLEE CRESENT","North Urban East"]
[34067,"MAYN AVE","Central"]
[51863,"MAYNARD PL","South West Urban"]
[10617,"MAYNE PL","North Rural"]
[51864,"MAYO RD","South West Urban"]
[30884,"MAYORAL DR","Central"]
[30478,"MAYORAL DR SLIP (RP197 LHS)","Central"]
[34975,"MAYORAL/ST PAUL WWAY (RP689 RHS)","Central"]
[30479,"MAYORAL/VINCENT SLIP","Central"]
[53588,"MAYPARK CRES","South East Urban"]
[34069,"MAYS RD","Central East"]
[22504,"MAYS ST","North Urban East"]
[51865,"MAYTIME ST","South West Urban"]
[40091,"MAYVILLE AVE","West"]
[40643,"MAYWOOD CRES","West"]
[53644,"MAZURAN PL","South East Urban"]
[11494,"MC CALLUM DR","North Rural"]
[11235,"MC GOWAN PL","North Urban East"]
[35062,"MCALISTER PL (PVT)","Central"]
[51866,"MCANNALLEY ST","South West Urban"]
[54069,"MCANNALLEY ST CARPARK (RP20 LHS)","South West Urban"]
[30817,"MCARTHUR AVE","Central East"]
[35824,"MCARTHUR/SYLVIA WWAY (RP301 LHS)","Central East"]
[21056,"MCBREEN AVE","North Urban West"]
[22513,"MCBREEN AVE SIDE RD","North Urban West"]
[51867,"MCBURNEY PL","South West Urban"]
[51868,"MCCAHILL VIEWS","South East Urban"]
[54686,"MCCAHILL VIEWS HAMMERHEAD","South East Urban"]
[53884,"MCCAHILL VIEWS-ANURE PL","South East Urban"]
[47379,"MCCAHON PL","West"]
[11211,"MCCAHON RD","North Rural"]
[70901,"MCCALL DR","South Rural"]
[60165,"MCCALL PL","South West Urban"]
[54823,"MCCATHIE DR","South East Urban"]
[10661,"MCCATHIE RD","North Rural"]
[51869,"MCCAULEY LANE","South West Urban"]
[40642,"MCCLINTOCK RD","West"]
[48301,"MCCLINTOCK RD - TRIANGLE #16 WWAY","West"]
[48300,"MCCLINTOCK RD - TRIANGLE #26 WWAY","West"]
[20671,"MCCLYMONTS RD","North Urban West"]
[33986,"MCCOLL ST","Central"]
[40641,"MCCORMICK RD","West"]
[48158,"MCCORMICK RD WWAY","West"]
[80331,"MCCORQUINDALE LANE","West"]
[33988,"MCCRACKEN RD","Central East"]
[41264,"MCCRAE WAY","West"]
[51870,"MCCRYSTAL AVE","South East Urban"]
[35722,"MCCULLOCH AVE WWAY (RP373 LHS)","Central East"]
[33989,"MCCULLOCH RD","Central East"]
[51871,"MCCULLOUGH AVE (OTARA)","South West Urban"]
[33990,"MCCULLOUGH AVE (THREE KINGS)","Central"]
[51872,"MCDIVITT ST","South West Urban"]
[54351,"MCDIVITT ST CARPARK (RP20 LHS)","South West Urban"]
[33991,"MCDONALD CRES","Central East"]
[33992,"MCDONALD PL","South West Urban"]
[51873,"MCDONALD RD","South West Urban"]
[33993,"MCDONALD ST","Central"]
[51874,"MCDOUGALL ST","South West Urban"]
[20448,"MCDOWELL CRES","North Urban West"]
[40640,"MCELDOWNEY RD","West"]
[70354,"MCELDOWNIE RD","South Rural"]
[70355,"MCENTEE RD (HUNUA)","South Rural"]
[40639,"MCENTEE RD (WAITAKERE)","West"]
[60166,"MCENTEE ST","South West Urban"]
[80725,"MCEWAN STREET","North Urban West"]
[30819,"MCFADZEAN DR","West"]
[30820,"MCFARLAND ST","Central East"]
[22614,"MCFETRIDGE PL","North Urban West"]
[33994,"MCGEE ST","South West Urban"]
[15286,"MCGEHAN CL HMRHD/UNDERWOOD PARK LINK CYWAY","Central"]
[30400,"MCGEHAN CLOSE HAMMERHEAD","Central"]
[10662,"MCGILLIVRAY RD","North Rural"]
[60635,"MCGINTY ST","South West Urban"]
[11160,"MCGIVEN PL","North Rural"]
[22130,"MCGLASHEN PL","North Urban West"]
[70357,"MCGOWAN RD","South Rural"]
[33996,"MCGOWAN ST","Central"]
[51875,"MCGREAL PL","South West Urban"]
[51876,"MCGREGOR RD","South Rural"]
[33998,"MCGREGOR ST","Central"]
[20401,"MCHARDY PL","North Urban West"]
[34000,"MCILROY AVE","Central"]
[51877,"MCINNES RD","South West Urban"]
[33999,"MCINTOSH RD","Hauraki Islands"]
[35914,"MCINTOSH/LITTLE ONEROA BEACH WWAY","Hauraki Islands"]
[51878,"MCINTYRE RD","South West Urban"]
[40638,"MCKAY PL","West"]
[51879,"MCKEAN AVE","South West Urban"]
[40637,"MCKEAN RD","North Urban West"]
[10663,"MCKENZIE AVE","North Urban East"]
[70360,"MCKENZIE RD (KINGSEAT)","South Rural"]
[51880,"MCKENZIE RD (MANGERE)","South West Urban"]
[54617,"MCKENZIE RD CARPARK (RP880 RHS)","South West Urban"]
[53885,"MCKENZIE RD-KORIMAKO AVE","South West Urban"]
[54632,"MCKENZIE/CORONATION RAB","South West Urban"]
[40636,"MCKINLEY RD","West"]
[70361,"MCKINNEY RD (GLENBROOK)","South Rural"]
[10664,"MCKINNEY RD (WARKWORTH)","North Rural"]
[71332,"MCKINNON RD","South Rural"]
[34001,"MCKINNON ST","Central"]
[51881,"MCKINSTRY AVE","South West Urban"]
[53886,"MCKINSTRY AVE- COTTINGHAM CRES","South West Urban"]
[53158,"MCKITTRICK AVE","South East Urban"]
[10665,"MCLACHLAN RD","North Rural"]
[70363,"MCLARIN RD","South Rural"]
[51882,"MCLAUGHLINS RD","South West Urban"]
[15660,"MCLAUGHLINS RD CYWAY","South West Urban"]
[54821,"MCLAUGHLINS/HARBOUR RIDGE RAB","South West Urban"]
[51883,"MCLEAN AVE","South West Urban"]
[34002,"MCLEAN ST","Central"]
[15825,"MCLEANS COLLEGE/MACLEANS PARK CYWAY","South East Urban"]
[34003,"MCLENNAN RD","Central East"]
[51884,"MCLEOD RD (MANUREWA)","South West Urban"]
[40635,"MCLEOD RD (TE ATATU)","West"]
[10666,"MCLEOD RD (WAIONEKE)","North Rural"]
[11144,"MCLEOD ST","North Rural"]
[34004,"MCMANUS PL","South West Urban"]
[23062,"MCMENAMIN PL","North Urban West"]
[70365,"MCMIKEN RD","South Rural"]
[51885,"MCMILLAN PL","South East Urban"]
[53887,"MCMILLAN PL-CHERITON RD","South East Urban"]
[34005,"MCMILLAN RD (WAIHEKE)","Hauraki Islands"]
[11512,"MCMURDO RD","North Rural"]
[70367,"MCMURRAY RD","South Rural"]
[34006,"MCNAB ST","Central East"]
[70997,"MCNALLY RD","South Rural"]
[70370,"MCNAUGHTEN RD","South Rural"]
[51886,"MCNAUGHTON AVE","South West Urban"]
[40003,"MCNAUGHTON WAY","West"]
[51887,"MCNICOL RD","South Rural"]
[22131,"MCPHAIL ST","North Urban West"]
[60472,"MCPHERSON RD (DRURY)","South Rural"]
[71365,"MCPHERSON RD (RUNCIMAN)","South Rural"]
[80394,"MCPHERSON WAY","North Rural"]
[70373,"MCPIKE RD (AWHITU)","South Rural"]
[10667,"MCPIKE RD (WOODHILL)","North Rural"]
[51888,"MCQUARRIE AVE","South West Urban"]
[54072,"MCQUARRIE AVE CARPARK (RP11 RHS)","South West Urban"]
[20499,"MCQUOID PL","North Urban West"]
[51889,"MCQUOIDS RD","South East Urban"]
[54433,"MCQUOIDS RD EXTN (RP449 RHS)","South East Urban"]
[34007,"MCRAE RD","Central East"]
[70374,"MCROBBIE RD","South Rural"]
[71417,"MCROBBIE RD EXTN","South Rural"]
[70998,"MCSHANE ST","South Rural"]
[51890,"MCVILLY RD","South West Urban"]
[41193,"MCWHIRTER PL","West"]
[47369,"MCWHIRTERS FARM LANE","West"]
[70868,"MEACHEN TCE","South Rural"]
[30886,"MEAD ST","West"]
[40634,"MEADOW CRES","West"]
[34070,"MEADOW ST","Central East"]
[15506,"MEADOW ST/PORTAGE RD CYWAY","South West Urban"]
[30885,"MEADOWBANK RD","Central East"]
[51891,"MEADOWCOURT DR","South West Urban"]
[47062,"MEADOWCROFT WAY","West"]
[51892,"MEADOWLAND DR","South East Urban"]
[53888,"MEADOWLAND DR-SHARPLES PL","South East Urban"]
[20688,"MEADOWOOD DR","North Urban West"]
[20296,"MEADOWVALE AVE","North Urban East"]
[22554,"MEADOWVALE AVE (NORTH)","North Urban East"]
[22553,"MEADOWVALE AVE (SOUTH)","North Urban East"]
[40633,"MEADOWVALE RISE","West"]
[51893,"MEADWAY","South East Urban"]
[53890,"MEADWAY-PAKURANGA RD","South East Urban"]
[51894,"MEANDA GARDENS","South East Urban"]
[34071,"MEARS PL","Central"]
[54019,"MEBIS WAY","South East Urban"]
[22919,"MEDALLION DR","North Urban West"]
[71270,"MEDHURST RD (NORTH)","South Rural"]
[70403,"MEDHURST RD (SOUTH)","South Rural"]
[51895,"MEDINA PL","South East Urban"]
[53891,"MEDINA PL-BLANCHE WAY","South East Urban"]
[53082,"MEDITERRANEAN WAY","South West Urban"]
[35037,"MEDLAND RD","Hauraki Islands"]
[52995,"MEDVALE AVE","South East Urban"]
[54440,"MEDVALE/FARMDALE RAB","South East Urban"]
[54437,"MEDVALE/NUNEATON RAB","South East Urban"]
[54439,"MEDVALE/WHETSTONE RAB","South East Urban"]
[24083,"MEDWAY RD (PVT)","North Urban West"]
[80530,"MEDWAY RD (SOUTH) (PVT)","North Urban West"]
[51896,"MEGAN AVE","South East Urban"]
[53894,"MEGAN AVE-BELDON PL","South East Urban"]
[22881,"MEHARG PL","North Urban West"]
[10618,"MEIKLE RD","North Rural"]
[10619,"MEIKLEJOHN WAY","North Rural"]
[40040,"MEILLAND PL","West"]
[10620,"MELANDRA RD","North Urban East"]
[30887,"MELANESIA RD","Central East"]
[30888,"MELANESIA RD HLA (RP235 LHS)","Central East"]
[35793,"MELANESIA/EDMUND WWAY (RP225)","Central East"]
[10621,"MELANIE PL","North Urban East"]
[22132,"MELBA ST","North Urban West"]
[30889,"MELFORD ST","Central"]
[51897,"MELIA GR","South West Urban"]
[10622,"MELIA PL","North Urban East"]
[32952,"MELIORA PL","West"]
[51898,"MELISSA PL","South East Urban"]
[53101,"MELLEFONT CLOSE","South East Urban"]
[51899,"MELLERAY PL","South West Urban"]
[52905,"MELLICK PL","South East Urban"]
[30890,"MELLING ST","Central East"]
[51900,"MELLONS BAY RD","South East Urban"]
[54682,"MELLONS BAY RD CARPARK (RP1267 RHS)","South East Urban"]
[54816,"MELLONS BAY RD CARPARK (RP1382)","South East Urban"]
[70854,"MELLSOP AVE","South Rural"]
[22941,"MELMORE PL","North Urban West"]
[54037,"MELNESS PL","South East Urban"]
[34072,"MELODY LANE","South West Urban"]
[34073,"MELROSE RD","Central"]
[31660,"MELROSE RD EAST","Central"]
[34074,"MELROSE ST","Central"]
[35695,"MELROSE/FICKLING WWAY (RP531)","Central"]
[34075,"MELTON RD","Central East"]
[47104,"MELVIEW PL (PVT)","West"]
[34076,"MELVILLE PL","Central East"]
[10623,"MELWOOD DR","North Rural"]
[34077,"MEMORIAL AVE","Central"]
[47063,"MEMORIAL DR","West"]
[80481,"MEMORIAL LANE","North Rural"]
[41003,"MEMORIAL PARK LANE","North Urban West"]
[60167,"MENARY ST","South West Urban"]
[20540,"MENEAR LANE","North Urban West"]
[52979,"MENEN PL","South West Urban"]
[24017,"MENZIES PL (PVT)","North Urban West"]
[30891,"MEOLA RD","Central"]
[15207,"MEOLA RD SEDDON FIELDS CYWAY","Central"]
[15201,"MEOLA RD/OLD MILL RD CYWAY (RP203)","Central"]
[15200,"MEOLA RD/OLD MILL RD CYWAY (RP353)","Central"]
[51901,"MEPAL PL","South West Urban"]
[10624,"MERA RD","North Rural"]
[20753,"MERANI ST","North Urban East"]
[22833,"MERCARI WAY","North Urban West"]
[60349,"MERCER ST","South Rural"]
[40632,"MERCHANT AVE","West"]
[33061,"MERCURY LANE (NEWTON)","Central"]
[20683,"MERCURY LANE (TAKAPUNA)","North Urban East"]
[31720,"MERCURY/EAST SLIP","Central"]
[30892,"MEREDITH ST","West"]
[10625,"MEREHAI PL","North Rural"]
[20651,"MEREWHIRA RD","North Urban West"]
[30893,"MERFIELD ST","Central East"]
[20702,"MERIDA PL","North Urban West"]
[22920,"MERIDIAN CRT","North Urban West"]
[51902,"MERINO AVE","South East Urban"]
[30894,"MERIVALE AVE","Central"]
[11190,"MERLOT HEIGHTS","North Rural"]
[71503,"MERLOT LANE","South Rural"]
[47351,"MERLOT WAY","West"]
[11526,"MERMAID MEWS","North Urban East"]
[15033,"MERMAID MEWS LINK CYWAY","North Urban East"]
[20316,"MERRIEFIELD AVE","North Urban East"]
[20536,"MERRILL PL","North Urban West"]
[30895,"MERSEY PL","West"]
[20399,"MERTON AVE","North Urban West"]
[30896,"MERTON RD (ST JOHNS)","Central East"]
[31566,"MERTON/MORRIN RAB","Central East"]
[51904,"MERVAN ST","South West Urban"]
[40631,"MERVILLE AVE","West"]
[48143,"MERVILLE AVE WWAY","West"]
[23052,"MERWOOD LANE","North Urban East"]
[10627,"MERYL AVE","North Rural"]
[40630,"MESCAL ST","West"]
[10628,"MESSENGER RD","North Urban East"]
[40236,"METCALFE RD","West"]
[40709,"METCALFE/MUNROE RAB","West"]
[80296,"METEOR DR","North Urban West"]
[22957,"METEOR PL","North Urban West"]
[41442,"METEOR RD","North Urban West"]
[30897,"METHUEN RD","West"]
[40629,"METRIC PL","West"]
[80646,"METTAM DRIVE","West"]
[34078,"MEWBURN AVE","Central"]
[41291,"MEYNELL CRT","West"]
[41308,"MEYNELL CRT LOOP","West"]
[30898,"MEYRICK PL","Central East"]
[34010,"MIAMI AVE","Hauraki Islands"]
[34079,"MIAMI PDE","Central East"]
[15275,"MIAMI PDE LINK CYWAY","Central East"]
[51905,"MIAMI ST","South West Urban"]
[51906,"MICAWBER PL","South East Urban"]
[53133,"MICHAEL BOSHER WAY","South East Urban"]
[53085,"MICHAEL JONES DR","South East Urban"]
[53616,"MICHAEL JONES/FUSION RAB","South East Urban"]
[54112,"MICHAEL RICHARD PL","South East Urban"]
[34080,"MICHAELS AVE","Central East"]
[34891,"MICHAELS AVE HLA","Central East"]
[51907,"MICHELLE PL","South West Urban"]
[11474,"MICK DILLON RD","North Rural"]
[40628,"MICKLE ST","West"]
[48160,"MICKLE ST WWAY","West"]
[30899,"MIDDLE ST","Central"]
[53263,"MIDDLEFIELD DR","South East Urban"]
[53444,"MIDDLEFIELD/BRONWYLIAN RAB","South East Urban"]
[53443,"MIDDLEFIELD/CYRIL FRENCH RAB #1","South East Urban"]
[53445,"MIDDLEFIELD/CYRIL FRENCH RAB #2","South East Urban"]
[53422,"MIDDLEFIELD/GRACECHURCH RAB","South East Urban"]
[53387,"MIDDLEFIELD/RIALTO RAB","South East Urban"]
[51908,"MIDDLEMORE CRES","South West Urban"]
[34081,"MIDDLEMORE RD","South West Urban"]
[30900,"MIDDLESEX RD","Central"]
[70406,"MIDDLETON RD (HUNUA)","South Rural"]
[70407,"MIDDLETON RD (PUKEKOHE)","South Rural"]
[30901,"MIDDLETON RD (REMUERA)","Central"]
[31578,"MIDDLETON RD HLA (#53 - #63)","Central"]
[31666,"MIDDLETON RD HLA (#69 - #67)","Central"]
[33134,"MIDDLETON RD HLA (ADA - #33)","Central"]
[40627,"MIDGLEY RD","West"]
[48267,"MIDGLEY RD- TRENGROVE #10 WWAY","West"]
[48268,"MIDGLEY RD WWAY","West"]
[47132,"MIDHURST AVE","West"]
[11535,"MIDSHIPMAN CRT","North Urban East"]
[52781,"MIDVALE PL","South East Urban"]
[20208,"MIDWAY AVE","North Urban East"]
[40626,"MIHA RD","West"]
[48065,"MIHA RD WWAY","West"]
[51909,"MIHAKA RD","South Rural"]
[40625,"MIHINI RD","West"]
[53171,"MIKA CRT","South East Urban"]
[51910,"MIKASA PL","South West Urban"]
[41310,"MILAN DR","West"]
[48071,"MILAN DRV WWAY","West"]
[51911,"MILAN RD","South West Urban"]
[60613,"MILANO BLVD","South West Urban"]
[15665,"MILANO BLVD LINK CYWAY (RP185)","South West Urban"]
[15662,"MILANO BLVD LINK CYWAY (RP457)","South West Urban"]
[60002,"MILANO BLVD LOOP","South West Urban"]
[40624,"MILDMAY RD","West"]
[11109,"MILDON RD","West"]
[40623,"MILE PL","West"]
[70408,"MILE RD","South Rural"]
[51912,"MILES AVE","South West Urban"]
[20818,"MILFORD / KITCHENER SERVICE LANE","North Urban East"]
[20196,"MILFORD PARK PL","North Urban East"]
[20036,"MILFORD RD","North Urban East"]
[47312,"MILI WAY","West"]
[40622,"MILICH TCE","West"]
[60168,"MILL END","South West Urban"]
[10631,"MILL FLAT RD","North Rural"]
[80424,"MILL GROVE","North Rural"]
[10632,"MILL LANE","North Rural"]
[60429,"MILL RD (ARDMORE)","South West Urban"]
[70409,"MILL RD (BOMBAY)","South Rural"]
[51913,"MILL RD (MANUREWA)","South West Urban"]
[11135,"MILL RD (SH16 HVILLE)","North Rural"]
[60555,"MILL/AIRFIELD RAB","South West Urban"]
[60554,"MILL/ALFRISTON RAB","South West Urban"]
[71315,"MILL/GREAT SOUTH RAB","South Rural"]
[30902,"MILLAIS ST","Central"]
[34082,"MILLARD ST","Central"]
[71453,"MILLBROOK DR","South Rural"]
[15143,"MILLBROOK DR/RAIL BRIDGE LOOP CYWAY","West"]
[40197,"MILLBROOK RD","West"]
[9102,"MILLBROOK RD CYWAY","West"]
[15141,"MILLBROOK RD/RAIL BRIDGE CYWAY (RP760)","West"]
[47264,"MILLCROFT LANE","West"]
[51914,"MILLEN AVE","South East Urban"]
[70410,"MILLEN PL","South Rural"]
[53266,"MILLENIUM PL (PVT)","South West Urban"]
[11499,"MILLENNIAL WAY","North Urban East"]
[51915,"MILLER RD","South West Urban"]
[80402,"MILLER RISE","North Urban East"]
[30903,"MILLER ST","Central"]
[10633,"MILLER WAY","North Rural"]
[10634,"MILLETT RD","North Rural"]
[51916,"MILLHOUSE DR","South East Urban"]
[53895,"MILLHOUSE DR-CARRIAGE CLOSE","South East Urban"]
[34083,"MILLIKEN AVE","Central"]
[35894,"MILLIKEN/BREMNER WWAY (RP235)","Central"]
[35893,"MILLIKEN/MT ALBERT WWAY (RP93)","Central"]
[52984,"MILLINGTON PL","South East Urban"]
[15481,"MILLINGTON PL/HUNTINGTON DR CYWAY","South East Urban"]
[15591,"MILLINGTON PL/MATARANGI RD CYWAY","South East Urban"]
[53098,"MILLISLE PL","South East Urban"]
[20672,"MILLS LANE (ALBANY)","North Urban West"]
[30904,"MILLS LANE (CITY)","Central"]
[34976,"MILLS/QUEEN WWAY (RP173 LHS)","Central"]
[47246,"MILLSTONE LANE","West"]
[41354,"MILLSTREAM DR","West"]
[15131,"MILLSTREAM DR/RESERVE CARPARK CYWAY","West"]
[10635,"MILLSTREAM PL","North Rural"]
[11573,"MILLWATER PARKWAY","North Urban East"]
[80017,"MILNER AVE [NTHBND]","North Urban East"]
[80687,"MILNER AVE [STHBND]","North Urban East"]
[60524,"MILSON DR","South West Urban"]
[34085,"MILTON RD (MT EDEN)","Central"]
[21057,"MILTON RD (NORTHCOTE)","North Urban West"]
[10636,"MILTON RD (OREWA)","North Urban East"]
[51917,"MILTON RD (PAPATOETOE)","South West Urban"]
[40621,"MILTONIA AVE","West"]
[48167,"MILTONIA AVE WWAY","West"]
[40620,"MILWAUKEE PL","West"]
[48133,"MILWAUKEE PL WWAY","West"]
[51918,"MIMOSA PL","South East Urban"]
[51919,"MINARET DR","South East Urban"]
[51920,"MINERVA TCE","South East Urban"]
[54699,"MINERVA/PAPAROA RAB","South East Urban"]
[30905,"MINIVER ST","Central East"]
[20180,"MINNEHAHA AVE (TAKAPUNA)","North Urban East"]
[40619,"MINNEHAHA AVE (WOODLANDS)","West"]
[30906,"MINNIE ST","Central"]
[30907,"MINTO RD","Central East"]
[51921,"MINTON PL","South West Urban"]
[15443,"MINTON PL/HELMS PL NB CYWAY","South West Urban"]
[53458,"MINTWOOD PL","South East Urban"]
[22545,"MIRA PL","North Urban East"]
[30908,"MIRA ST","Central"]
[51922,"MIRABELL PL (GOLFLANDS)","South East Urban"]
[71548,"MIRABELL PL (PATUMAHOE)","South Rural"]
[22133,"MIRAGE PL","North Urban West"]
[22134,"MIRAKA PL","North Urban West"]
[51923,"MIRAMAR PL","South East Urban"]
[30909,"MIRANDA ST","West"]
[22385,"MIRI RD","North Urban East"]
[40618,"MIRIAM CORBAN HGTS","West"]
[48171,"MIRIAM CORBAN HTS WWAY","West"]
[34086,"MIRIAM PL","Central"]
[22607,"MIRO PL (ALBANY)","North Urban West"]
[71181,"MIRO PL (WAIUKU)","South Rural"]
[52800,"MIRO RD (EAST)","South West Urban"]
[54635,"MIRO RD (EAST) CARPARK (RP108 LHS)","South West Urban"]
[34728,"MIRO RD (GREENLANE)","Central"]
[34087,"MIRO RD (WAIHEKE)","Hauraki Islands"]
[51924,"MIRO RD (WEST)","South West Urban"]
[60347,"MIRO ST (DRURY)","South West Urban"]
[10637,"MIRO ST (HELENSVILLE)","North Rural"]
[40135,"MIRO ST (WAITAKERE)","West"]
[22989,"MIROMIRO ST","North Urban West"]
[20376,"MIROVALE PL","North Urban West"]
[51925,"MIRRABOOKA AVE","South East Urban"]
[15701,"MIRRABOOKA AVE BRIDGE EAST LINK CYWAY","South East Urban"]
[15700,"MIRRABOOKA AVE LINK CYWAY (RP630)","South East Urban"]
[22386,"MIRWILL RD","North Urban East"]
[70418,"MISA RD","South Rural"]
[70419,"MISSION BUSH RD","South Rural"]
[70200,"MISSION BUSH RD/BROOKSIDE RD SLIP","South Rural"]
[53627,"MISSION HEIGHTS DR","South East Urban"]
[53628,"MISSION HEIGHTS/GIBBSTON RAB","South East Urban"]
[51926,"MISSION VIEW DR","South East Urban"]
[22387,"MISTLETOE PL","North Urban East"]
[41316,"MISTRAL PL","North Urban West"]
[15118,"MISTRAL PL LINK CYWAY","North Urban West"]
[51927,"MISTY PL","South West Urban"]
[80182,"MISTY VALLEY DR","West"]
[15137,"MISTY VALLEY DR LINK CYWAY","West"]
[34088,"MITCHELL RD","Hauraki Islands"]
[30910,"MITCHELL ST","West"]
[30911,"MITCHELSON ST","Central East"]
[34089,"MITCHENER RD","Hauraki Islands"]
[22666,"MIZEN CRT","North Urban East"]
[22388,"MIZPAH RD","North Urban East"]
[34090,"MOA AVE","Hauraki Islands"]
[30912,"MOA RD","Central"]
[20104,"MOA ST (DEVONPORT)","North Urban East"]
[34091,"MOA ST (OTAHUHU)","South West Urban"]
[22557,"MOA ST HAMMERHEAD","North Urban East"]
[20083,"MOANA AVE (BELMONT)","North Urban East"]
[34092,"MOANA AVE (ONEHUNGA)","Central East"]
[10638,"MOANA AVE (OREWA)","North Urban East"]
[34093,"MOANA AVE (WAIHEKE)","Hauraki Islands"]
[22141,"MOANA PL","North Urban East"]
[51928,"MOANA TCE (MARAETAI)","South Rural"]
[10639,"MOANA TCE (SNELLS BEACH)","North Rural"]
[34094,"MOANA VIEW RD","Hauraki Islands"]
[80613,"MOA-STONE RD","North Urban East"]
[34095,"MOATA RD","Central East"]
[71524,"MODELLO LANE","South Rural"]
[30913,"MODENA CRES","Central East"]
[35857,"MODENA/WEST TAMAKI WWAY (RP170)","Central East"]
[10640,"MOENUI AVE","North Urban East"]
[10641,"MOERA PL","North Urban East"]
[10642,"MOFFAT RD","North Urban East"]
[51929,"MOFFITT PL","South West Urban"]
[54569,"MOFFITT PL HAMMERHEAD","South West Urban"]
[53061,"MOHILL PL","South East Urban"]
[15679,"MOHILL PL LINK CYWAY","South East Urban"]
[80366,"MOHO LANE","South West Urban"]
[60646,"MOHUA AVE","South West Urban"]
[10643,"MOIR HILL RD","North Rural"]
[30915,"MOIRA ST","Central"]
[35772,"MOIRA/RICHMOND WWAY (RP270 RHS)","Central"]
[40617,"MOIRE RD","West"]
[48259,"MOIRE RD - BROUGHAM #42 WWAY","West"]
[48258,"MOIRE RD WWAY","West"]
[30916,"MOKAU ST","Central"]
[22135,"MOKOIA RD","North Urban West"]
[26043,"MOKOIA RD CARPARK DP 38599","North Urban West"]
[26042,"MOKOIA RD CARPARK DP 7159 LOT 16","North Urban West"]
[20844,"MOKOIA RD SERVICE LANE","North Urban West"]
[51930,"MOLESWORTH PL","South West Urban"]
[54625,"MOLESWORTH PL EXTN","South West Urban"]
[22136,"MOLLER ST","North Urban West"]
[34096,"MOLLEY GREEN PL","Central"]
[80635,"MOLLUSC RD","North Urban West"]
[22137,"MOLLYHAWK PL","North Urban West"]
[10644,"MOLLYHAWK RISE","North Urban East"]
[71003,"MOLONEY TCE","South Rural"]
[34097,"MOMONA RD","Central"]
[51931,"MON DESIR PL","South West Urban"]
[15447,"MON DESIR PL LINK CYWAY","South West Urban"]
[51932,"MONA AVE","South West Urban"]
[40616,"MONA VALE","West"]
[48271,"MONA VALE - EDGEWARE #25 WWAY","West"]
[48272,"MONA VALE WWAY","West"]
[34729,"MONACO PL","Central East"]
[30917,"MONAGHAN AVE","Central"]
[34098,"MONAHAN RD","Central East"]
[20548,"MONARCH AVE","North Urban West"]
[33007,"MONASH ST (PVT)","Central"]
[51933,"MONCRIEFF AVE","South West Urban"]
[53896,"MONCRIEFF AVE-STOLL PL","South West Urban"]
[51934,"MONDE PL","South West Urban"]
[40615,"MONET GR","North Urban West"]
[48251,"MONET GRV WWAY","North Urban West"]
[34099,"MONGORRY PL","Central"]
[34100,"MONIER PL","Central East"]
[54247,"MONIQUE PL","South East Urban"]
[53078,"MONIVEA PL","South East Urban"]
[15484,"MONIVEA PL/DAIRYLAND DR CYWAY","South East Urban"]
[10646,"MONK RD","North Rural"]
[22888,"MONKTON CLOSE","North Urban West"]
[30918,"MONKTON PL","Central East"]
[30919,"MONMOUTH ST (WEST)","Central"]
[34101,"MONO PL","Central East"]
[10647,"MONOWAI RD","North Rural"]
[10648,"MONOWAI ST","North Rural"]
[34102,"MONS AVE","Central"]
[34104,"MONT LE GRAND RD","Central"]
[22389,"MONTANA AVE","North Urban East"]
[60169,"MONTANA PL","South West Urban"]
[54193,"MONTANEZ DR","South East Urban"]
[11226,"MONTCALM CLOSE","North Urban East"]
[22390,"MONTCLAIR RISE","North Urban East"]
[22961,"MONTE CASSINO PL","North Urban West"]
[53009,"MONTECITO PL","South East Urban"]
[51935,"MONTEGO PL","South West Urban"]
[30920,"MONTEITH CRES","Central East"]
[40614,"MONTEL AVE","West"]
[34103,"MONTEREY AVE","South West Urban"]
[30921,"MONTEREY ST","Central East"]
[52760,"MONTGOMERIE RD (EAST)","South West Urban"]
[51936,"MONTGOMERIE RD (WEST)","South West Urban"]
[54641,"MONTGOMERIE/PAVILION RAB","South West Urban"]
[53455,"MONTGOMERIE/RICHARD PEARSE RAB","South West Urban"]
[20062,"MONTGOMERY AVE - BELMONT","North Urban East"]
[22392,"MONTGOMERY AVE - ROTHESAY BAY","North Urban East"]
[71004,"MONTGOMERY AVE (PUKEKOHE)","South Rural"]
[51937,"MONTGOMERY CRES","South East Urban"]
[53076,"MONTILLA PL","South West Urban"]
[40613,"MONTMERE AVE","West"]
[11585,"MONTPELLIER HEIGHTS","North Urban East"]
[11586,"MONTPELLIER HEIGHTS LANE","North Urban East"]
[51938,"MONTRESSOR PL","South East Urban"]
[30922,"MONTROSE ST","Central"]
[22393,"MONTROSE TCE","North Urban East"]
[26074,"MONTROSE TCE CARPARK DP13311","North Urban East"]
[51939,"MONUMENT RD","South Rural"]
[10649,"MONYASH RD","North Urban East"]
[10650,"MOONTIDE RD","North Rural"]
[40612,"MOOR AVE","West"]
[51940,"MOOR PARK","South West Urban"]
[54064,"MOOR PARK CARPARK (RP12 RHS)","South West Urban"]
[80215,"MOORE ST #27 - CARPARK NO2","South East Urban"]
[20447,"MOORE ST (GLENFIELD)","North Urban West"]
[51941,"MOORE ST (HOWICK)","South East Urban"]
[21058,"MOORE ST LLA","North Urban West"]
[54596,"MOORE/FENCIBLE RAB","South East Urban"]
[54593,"MOORE/RODNEY RAB","South East Urban"]
[80022,"MOORES RD","North Urban East"]
[22394,"MOORGREEN HEIGHTS","North Urban East"]
[53535,"MORAVALE LANE","South East Urban"]
[53897,"MORAVALE LANE-GORDAL PL","South East Urban"]
[30923,"MORAY PL","Central"]
[53425,"MORDANE PL","South East Urban"]
[34105,"MORELAND RD","Central"]
[53104,"MORESTEAD AVE","South East Urban"]
[10651,"MORETON DR","North Urban East"]
[60520,"MOREWA PL","South West Urban"]
[53259,"MOREWOOD LANE","South West Urban"]
[70420,"MORGAN RD (PUKEKOHE EAST)","South Rural"]
[34106,"MORGAN ST","Central"]
[22395,"MORICE PL","North Urban East"]
[70421,"MORLEY RD","South Rural"]
[70239,"MORLEY RD/WAIUKU RD SLIP","South Rural"]
[22396,"MORLIE PL","North Urban East"]
[53532,"MORNASH PL","South East Urban"]
[36057,"MORNING STAR PL (PVT)","Central"]
[15338,"MORNING STAR PL/FERGUSSON RESERVE LINK CYWAY","Central"]
[34107,"MORNINGSIDE DR","Central"]
[30924,"MORPETH PL","West"]
[11123,"MORPETH ST 2","North Rural"]
[11124,"MORPETH ST 3","North Rural"]
[34108,"MORRIE LAING AVE","Central"]
[20491,"MORRIGGIA PL","North Urban West"]
[30925,"MORRIN RD","Central East"]
[31594,"MORRIN RD SLIP (RP1305 RHS)","Central East"]
[15303,"MORRIN RD/PANMURE TRAIN STATION CYWAY","Central"]
[30926,"MORRIN ST (ELLERSLIE)","Central East"]
[51942,"MORRIN ST (MANUREWA)","South West Urban"]
[36023,"MORRIN/STONEFIELDS RAB","Central East"]
[51943,"MORRIS AVE","South West Urban"]
[22166,"MORRISON AVE","North Urban East"]
[11372,"MORRISON DR (WARKWORTH)","North Rural"]
[70422,"MORRISON RD (ORUA BAY)","South Rural"]
[51944,"MORROW AVE","South East Urban"]
[30927,"MORROW ST","Central"]
[71005,"MORROW TCE","South Rural"]
[30928,"MORTIMER PASS","Central"]
[20335,"MORTON AVE","North Urban East"]
[30929,"MORTON ST","Central"]
[30930,"MORVERN RD","Central"]
[35784,"MORVERN/FERRYHILL WWAY (RP222)","Central"]
[40611,"MOSELLE AVE","West"]
[80261,"MOSES RD","North Rural"]
[22138,"MOSMAN PL","North Urban West"]
[15401,"MOSS CR/ESTUARY CYWAY","South West Urban"]
[60495,"MOSS CRES","South West Urban"]
[15400,"MOSS CRES/LONGFORD PARK CYWAY(RP95)","South West Urban"]
[60170,"MOSSFORD GREEN","South West Urban"]
[22767,"MOSSOP RISE","North Urban West"]
[34115,"MOSTYN ST","Central"]
[15315,"MOSTYN ST EAST/MOTORWAY LINK CYWAY","Central"]
[15316,"MOSTYN ST WEST/MOTORWAY LINK CYWAY","Central"]
[34116,"MOTAIREHE RD","Hauraki Islands"]
[51945,"MOTATAU RD","South West Urban"]
[53900,"MOTATAU RD-MATUKU PL","South West Urban"]
[53899,"MOTATAU RD-VICTORY RD","South West Urban"]
[30931,"MOTIONS RD","Central"]
[35950,"MOTIONS RD CARPARK","Central"]
[11611,"MOTITI ST","North Rural"]
[15661,"MOTORWAY (OTAHUHU)/HIGHBROOK DR CYWAY","South West Urban"]
[15159,"MOTORWAY/GREAT NORTH RD CYWAY","Central"]
[52859,"MOTT LANE","South Rural"]
[34117,"MOTU PL","Central East"]
[10653,"MOTU RD","North Rural"]
[35259,"MOTUKAHA RD","Hauraki Islands"]
[80701,"MOTUKARAKA DR","South Rural"]
[10654,"MOTUKETEKETE AVE","North Urban East"]
[10655,"MOTUORA RD","North Urban East"]
[11163,"MOTUTAPU AVE","North Urban East"]
[10656,"MOTUTARA RD","North Rural"]
[11414,"MOTUTARA RD HLA (#280 -)","North Rural"]
[51946,"MOUMOUKAI HILL RD","South Rural"]
[70426,"MOUMOUKAI RD","South Rural"]
[10657,"MOUNT PLEASANT DR","North Rural"]
[30932,"MOUNT ST","Central"]
[22742,"MOUNTAIN BEECH RISE","North Urban West"]
[30933,"MOUNTAIN RD (EPSOM)","Central"]
[40610,"MOUNTAIN RD (HENDERSON VALLEY)","West"]
[51947,"MOUNTAIN RD (MANGERE)","South West Urban"]
[34730,"MOUNTAIN RD (PANMURE)","Central East"]
[54618,"MOUNTAIN RD CARPARK (RP736 RHS)","South West Urban"]
[34118,"MOUNTAIN VIEW MEWS","Central East"]
[30934,"MOUNTAIN VIEW RD","Central"]
[31618,"MOUNTAIN/MOUNTWELL BUS LINK","Central East"]
[20538,"MOUNTBATTEN AVE","North Urban West"]
[60171,"MOUNTBATTEN PL","South West Urban"]
[34120,"MOUNTFIELD TCE","Central"]
[51948,"MOUNTFORT ST","South West Urban"]
[34121,"MOUNTJOY PL","Central East"]
[31721,"MOUNTWELL CRES","Central East"]
[36037,"MOUNTWELL CRES CARPARK (RP59 LHS)","Central East"]
[54436,"MOVILLE DR (NORTH)","South East Urban"]
[51586,"MOVILLE DR (SOUTH)","South East Urban"]
[20353,"MOWBRAY PL","North Urban East"]
[40609,"MOXHAM GR","West"]
[53099,"MOY PL","South East Urban"]
[53062,"MOYCULLIEN LANE","South East Urban"]
[52958,"MOYLE PL","South West Urban"]
[53060,"MOYRUS CRES","South East Urban"]
[20590,"MOZLEY AVE","North Urban East"]
[34119,"MT ALBERT RD (SANDRINGHAM)","Central"]
[36040,"MT ALBERT RD (THREE KINGS) (CWC)","Central"]
[80315,"MT ALBERT RD (THREE KINGS) (CWCE)","Central East"]
[34888,"MT ALBERT RD LLA (#430 - PARAU)","Central"]
[15329,"MT ALBERT RD/GIFFORD AVE CYWAY","Central"]
[35709,"MT ALBERT/GREENVILLE W/WAY (RP2523)","Central"]
[52804,"MT BLANC PL","South East Urban"]
[30935,"MT CARMEL PL","Central East"]
[41330,"MT DONALD MCLEAN RD","West"]
[30936,"MT EDEN RD","Central"]
[30937,"MT HOBSON LANE","Central East"]
[30938,"MT HOBSON RD","Central East"]
[53135,"MT LEBANON CRES","South West Urban"]
[47272,"MT LEBANON LANE","West"]
[15140,"MT LEBANON LN/WINERY WAY CYWAY","West"]
[34122,"MT PLEASANT RD","Central"]
[34877,"MT RICHMOND DR","Central East"]
[34123,"MT ROSKILL RD","Central"]
[34124,"MT ROYAL AVE","Central"]
[35730,"MT ROYAL/OWAIRAKA WWAY (RP688)","Central"]
[34125,"MT SMART RD","Central East"]
[35688,"MT SMART/JORDAN WWAY (RP1185)","Central East"]
[35687,"MT SMART/ROOSEVELT WWAY (RP2002)","Central East"]
[34126,"MT ST JOHN AVE","Central"]
[30826,"MT TAYLOR DR","Central East"]
[34127,"MT WELLINGTON HIGHWAY","Central East"]
[31623,"MT WELLINGTON HIGHWAY (NORTHBOUND)","Central East"]
[31620,"MT WELLINGTON/VESTEY RAB","Central East"]
[40608,"MUDGEWAYS RD","West"]
[51949,"MUIR AVE","South West Urban"]
[53902,"MUIR AVE-BANBURY PL","South West Urban"]
[53901,"MUIR AVE-CHIPPING DALE","South West Urban"]
[70428,"MUIR RD (KARAKA)","South Rural"]
[30939,"MUIR RD (REMUERA)","Central East"]
[51950,"MUIRFIELD ST","South West Urban"]
[54035,"MUIRLEA DR","South East Urban"]
[51951,"MUKA CLOSE","South West Urban"]
[34128,"MULBERRY GROVE RD","Hauraki Islands"]
[20436,"MULBERRY PL","North Urban West"]
[30940,"MULGAN ST","West"]
[22758,"MULGAN WAY","North Urban East"]
[52999,"MULL PL","South West Urban"]
[53077,"MULLAGH PL","South East Urban"]
[15680,"MULLAGH PL LINK CYWAY","South East Urban"]
[60346,"MULLINS RD","South Rural"]
[23027,"MULROY PL (ALBANY)","North Urban West"]
[53116,"MULROY PL (DANNEMORA)","South East Urban"]
[53557,"MULTOSE DR","South East Urban"]
[15500,"MULTOSE DR LINK CYWAY (RP331)","South East Urban"]
[23037,"MULU PL","North Urban West"]
[47345,"MULVANEY CRES","West"]
[40857,"MULVANEY CRES LOOP","West"]
[48111,"MULVANEY CRES WWAY 1","West"]
[15110,"MULVANEY CRES/CHARLENNE CL CYWAY","West"]
[10658,"MUNCASTER RD","North Rural"]
[80483,"MUNFORD LANE","North Rural"]
[23009,"MUNROE LANE","North Urban West"]
[40607,"MUNROE RD","West"]
[51952,"MUNROS RD","South Rural"]
[21059,"MUNSTEAD PL","North Urban West"]
[23068,"MURAL PL","North Urban West"]
[22139,"MURANO PL","North Urban West"]
[51953,"MURCHISON RD","South West Urban"]
[30942,"MURDOCH RD","Central"]
[34130,"MURDOCH ST","South West Urban"]
[41356,"MURIEL PL","West"]
[40606,"MURILLO PL","West"]
[30943,"MURIPARA AVE","Central"]
[20183,"MURITAI RD (TAKAPUNA)","North Urban East"]
[34129,"MURITAI RD (WAIHEKE)","Hauraki Islands"]
[10659,"MURIWAI RD","North Rural"]
[10660,"MURIWAI VALLEY RD","North Rural"]
[51954,"MURPHYS RD","South East Urban"]
[49998,"MURRAY BECROFT AVE","West"]
[51955,"MURRAY RD (OTARA)","South West Urban"]
[40605,"MURRAY RD (WAITAKERE)","West"]
[60348,"MURRAY ST","South West Urban"]
[11222,"MURRAY WAY","North Rural"]
[53500,"MURRAYFIELD LANE","South West Urban"]
[51956,"MURVALE DR","South East Urban"]
[40604,"MUSCAT PL","West"]
[34909,"MUSEUM CIRCUIT","Central"]
[51957,"MUSICK POINT RD","South East Urban"]
[31722,"MUSKET PL","Central East"]
[35287,"MUSSON DR","Hauraki Islands"]
[71533,"MUSTER RD","South Rural"]
[34131,"MUTU ST","Central"]
[51958,"MYERS RD","South West Urban"]
[54345,"MYERS RD CARPARK (RP332 RHS)","South West Urban"]
[51959,"MYNA PL","South West Urban"]
[11583,"MYRA G PL","North Urban East"]
[30945,"MYRTLE ST","Central"]
[15309,"MYRTLE ST/MOTORWAY LINK CYWAY","Central"]
[35285,"NACTON LANE","West"]
[53173,"NAD PL","South East Urban"]
[51960,"NADINE PL","South West Urban"]
[53353,"NAGLE PL","South East Urban"]
[51961,"NAIRN PL","South West Urban"]
[70431,"NAIRN RD","South Rural"]
[52937,"NAKHLE PL","South West Urban"]
[34132,"NAMATA RD","Central East"]
[24119,"NAMSAN CLOSE (PVT)","North Urban West"]
[51962,"NAN PL","South East Urban"]
[40148,"NANDANA DR","West"]
[51963,"NANDINA AVE","South East Urban"]
[53367,"NANLEEN RISE","South West Urban"]
[51964,"NAOMI PL","South West Urban"]
[52867,"NAPA CRT","South East Urban"]
[20127,"NAPIER AVE","North Urban East"]
[34133,"NAPIER LANE (PVT)","Central"]
[30946,"NAPIER ST","Central"]
[24102,"NAPLES WAY (PVT)","North Urban West"]
[20253,"NAPOLEON AVE","North Urban East"]
[40603,"NAPUKA RD","West"]
[51965,"NARADA PL","South West Urban"]
[51966,"NAREK PL","South West Urban"]
[34134,"NASH RD","Central"]
[51967,"NASSAU CRT (PVT)","South East Urban"]
[54829,"NASSIPOUR WAY","South East Urban"]
[51968,"NATALIE PL","South West Urban"]
[54645,"NATALIE PL HAMMERHEAD","South West Urban"]
[47184,"NATASHA LANE","West"]
[52888,"NATHAN CLOSE","South East Urban"]
[34135,"NATZKA RD","Hauraki Islands"]
[31712,"NATZKA RD CARPARK (RP15 RHS)","Hauraki Islands"]
[53177,"NAUL PL","South East Urban"]
[54545,"NAUL PL EXTN","South East Urban"]
[10668,"NAUMAI RD","North Rural"]
[30947,"NAUMAI ST","West"]
[11394,"NAUTILUS DR","North Urban East"]
[53050,"NAVAN PL","South East Urban"]
[15676,"NAVAN PL LINK CYWAY","South East Urban"]
[30948,"NAVARRE RD","Central East"]
[51969,"NAVIGATOR PL","South West Urban"]
[53904,"NAVIGATOR PL-KOMAKO PL","South West Urban"]
[22397,"NAVITI PL","North Urban East"]
[53414,"NAYLORS DR","South West Urban"]
[53441,"NAYLORS RAB","South West Urban"]
[20426,"NEA PL","North Urban West"]
[20458,"NEAL AVE","North Urban West"]
[34136,"NEALES LANE (RP390 RHS GREYS AVE)","Central"]
[51970,"NEALES RD","South East Urban"]
[11524,"NEAPTIDE CLOSE","North Urban East"]
[51971,"NEARCO ST","South West Urban"]
[47136,"NECTAR AVE","West"]
[52782,"NEDLANDS PL","South East Urban"]
[71185,"NEEDHAM RD","South Rural"]
[51972,"NEEMS PL","South West Urban"]
[47317,"NEESONS WAY","West"]
[30949,"NEHU ST","Central East"]
[40602,"NEIL AVE","West"]
[54729,"NEILL BOAK PL","South Rural"]
[22398,"NEILON PL","North Urban East"]
[51973,"NEILPARK DR","South East Urban"]
[34137,"NEILSON ST","Central East"]
[31632,"NEILSON ST (WESTBOUND)","Central East"]
[30950,"NELIGAN AVE","Central East"]
[21060,"NELSON AVE (NORTHCOTE)","North Urban West"]
[34138,"NELSON AVE (WAIHEKE)","Hauraki Islands"]
[10325,"NELSON RD","North Rural"]
[30951,"NELSON ST (CITY)","Central"]
[11136,"NELSON ST (HELENSVILLE)","North Rural"]
[51974,"NELSON ST (HOWICK)","South East Urban"]
[34139,"NELSON ST (OTAHUHU)","South West Urban"]
[60172,"NELSON ST (PAPAKURA)","South West Urban"]
[71007,"NELSON ST (PUKEKOHE)","South Rural"]
[34858,"NELSON ST LLA (#155A - COOK)","Central"]
[35295,"NEPEAN AVE","Hauraki Islands"]
[53174,"NEPHIN PL","South East Urban"]
[15483,"NEPHIN PL/MONIVEA PL CYWAY","South East Urban"]
[22143,"NEPTUNE AVE","North Urban West"]
[60351,"NERALEE CRT","South West Urban"]
[22399,"NEREUS PL","North Urban East"]
[51975,"NERISSA PL","South West Urban"]
[51977,"NESDALE AVE","South West Urban"]
[51978,"NESS VALLEY RD","South Rural"]
[47185,"NETA GR","West"]
[40045,"NETHERLANDS AVE","West"]
[48058,"NETHERLANDS AVE WWAY","West"]
[30952,"NETHERTON ST","West"]
[51979,"NEVADA AVE","South East Urban"]
[30953,"NEVILLE ST (PT CHEVALIER)","Central"]
[40103,"NEVILLE ST (WAITAKERE)","West"]
[10669,"NEVILLE ST (WARKWORTH)","North Rural"]
[51980,"NEVIS PL","South West Urban"]
[34140,"NEW BOND ST","Central"]
[15313,"NEW BOND ST EAST/MOTORWAY LINK CYWAY","Central"]
[15312,"NEW BOND ST WEST/MOTORWAY LINK CYWAY","Central"]
[34141,"NEW BRIGHTON RD","Central East"]
[80302,"NEW DAWN LANE (PVT)","North Urban West"]
[30956,"NEW NORTH RD","Central"]
[35944,"NEW NORTH RD CARPARK (RP1606 LHS)","Central"]
[35943,"NEW NORTH RD CARPARK (RP4858 LHS)","Central"]
[30470,"NEW NORTH RD SERVICE LANE (RP4546)","Central"]
[35942,"NEW NORTH RD SERVICE LANE CARPARK","Central"]
[34859,"NEW NORTH RD SHOPPING CENTRE SLIP","Central"]
[35767,"NEW NORTH/BRIGHT WWAY (RP539)","Central"]
[30472,"NEW NORTH/MT ALBERT SLIP","Central"]
[30954,"NEW ST","Central"]
[30958,"NEW WINDSOR RD","West"]
[30303,"NEW WINDSOR RD LLA (#172 - END)","West"]
[30238,"NEW WINDSOR RD SHOPS SLIP (RP1969)","West"]
[51981,"NEWARK PL","South West Urban"]
[52947,"NEWBEGIN PL","South West Urban"]
[53178,"NEWBLISS CRES","South East Urban"]
[22400,"NEWBURN RD","North Urban East"]
[22964,"NEWBURY PL","North Urban West"]
[51982,"NEWBURY ST","South West Urban"]
[34142,"NEWCASTLE TCE","Central"]
[30955,"NEWELL ST","Central"]
[47360,"NEWFOUND WAY","West"]
[40600,"NEWHAM PL","West"]
[15133,"NEWHAM PL LINK CYWAY","West"]
[34143,"NEWHAVEN ST","Central East"]
[22401,"NEWHAVEN TCE","North Urban East"]
[22569,"NEWHAVEN TCE (LOWER)","North Urban East"]
[22568,"NEWHAVEN TCE (UPPER)","North Urban East"]
[51983,"NEWHOOK LANE","South West Urban"]
[40178,"NEWINGTON RD","West"]
[53187,"NEWINN CRES","South East Urban"]
[40599,"NEWLAND GR","West"]
[11108,"NEWMAN RD (EAST)","North Urban East"]
[10670,"NEWMAN RD (WEST)","North Urban East"]
[35623,"NEWNHAM LANE","Central"]
[20320,"NEWPORT PL","North Urban East"]
[53175,"NEWRY CLOSE","South East Urban"]
[34144,"NEWSOME ST","Central East"]
[22402,"NEWSTEAD AVE","North Urban East"]
[30957,"NEWTON RD (EDEN TERRACE)","Central"]
[31544,"NEWTON RD (EDEN TERRACE/NORTHBOUND)","Central"]
[10671,"NEWTON RD (RIVERHEAD)","North Rural"]
[34838,"NEWTON RD (WAIHEKE)","Hauraki Islands"]
[10672,"NEWTON RD 2 (WARKWORTH)","North Rural"]
[15306,"NEWTON RD/NOVAR PL CYWAY","Central"]
[36009,"NEWTON/IAN MCKINNON CYWAY (NTH)","Central"]
[36008,"NEWTON/IAN MCKINNON CYWAY (STH)","Central"]
[34953,"NGA OHO (PVT)","Central East"]
[11610,"NGAHAU ST","North Rural"]
[71006,"NGAHERE RD","South Rural"]
[35759,"NGAHERE TCE WWAY","Central"]
[10673,"NGAHERE VIEWS","North Urban East"]
[41246,"NGAHUE CRES (PVT)","North Urban West"]
[35972,"NGAHUE DR","Central East"]
[30960,"NGAHURA ST","Central"]
[51984,"NGAIO AVE","South West Urban"]
[24059,"NGAIO LANE (PVT)","North Urban West"]
[40598,"NGAIO RD","West"]
[30961,"NGAIO ST (ORAKEI)","Central East"]
[34146,"NGAIO ST (OTAHUHU)","South West Urban"]
[20170,"NGAIO ST (TAKAPUNA)","North Urban East"]
[35816,"NGAIO/RAUTARA WWAY (RP300 RHS)","Central East"]
[32971,"NGAIRE AVE","Central"]
[80292,"NGAIRE CLOSE","North Rural"]
[30962,"NGAIWI ST","Central East"]
[30963,"NGAKE ST","Central East"]
[71206,"NGAKOROA RD","South Rural"]
[35292,"NGAOHO PL","Central"]
[10674,"NGAPARA ST","North Urban East"]
[34148,"NGAPAWA ST","Central"]
[30964,"NGAPIPI RD","Central East"]
[34149,"NGAPORA ST","Central East"]
[30965,"NGAPUHI RD","Central East"]
[35758,"NGAPUHI/KELVIN WWAY (RP544 RHS)","Central East"]
[11321,"NGAPUKE RD","North Rural"]
[20647,"NGARAHANA AVE","North Urban West"]
[10675,"NGAREWA DR","North Rural"]
[34150,"NGARIMU RD","Central East"]
[80550,"NGAROMA HOUSE VIEWS","North Urban West"]
[34151,"NGAROMA RD","Central"]
[22222,"NGATARINGA RD","North Urban East"]
[22560,"NGATARINGA RD LLA","North Urban East"]
[15603,"NGATI ORA PARK LOOP CYWAY","South West Urban"]
[15604,"NGATI ORA PARK SOUTH - NORTH CYWAY","South West Urban"]
[15605,"NGATI ORA PARK WEST LOOP CYWAY","South West Urban"]
[54590,"NGATI OTARA PARK ACCESS","South East Urban"]
[34152,"NGATIAWA ST","Central East"]
[51986,"NGATIRA PL (MANUREWA)","South West Urban"]
[10676,"NGATIRA PL (SNELLS BEACH)","North Rural"]
[10677,"NGATIRA RD","North Rural"]
[20583,"NGATOA PL","North Urban West"]
[34153,"NGAURUHOE ST","Central"]
[34154,"NIAGARA CRES","Central"]
[22144,"NIAGRA PL","North Urban West"]
[35056,"NIALL BURGESS RD","Central East"]
[22190,"NICCOL AVE","North Urban East"]
[80426,"NICCONE PL","South Rural"]
[53276,"NICHOLAS GIBBONS DR","South West Urban"]
[51987,"NICHOLAS RD","South East Urban"]
[30966,"NICHOLAS ST","Central"]
[35060,"NICHOLLS LANE","Central"]
[51988,"NICHOLSON AVE","South West Urban"]
[20288,"NICHOLSON PL","North Urban West"]
[35253,"NICK JOHNSTONE DR","Hauraki Islands"]
[10678,"NICKELL PL","North Urban East"]
[51989,"NICKLEBY PL","South East Urban"]
[51990,"NICOLA PL","South West Urban"]
[40597,"NICOLAS AVE","West"]
[48074,"NICOLAS AVE WWAY","West"]
[51991,"NIELD RD","South West Urban"]
[40596,"NIELSEN PL","West"]
[53176,"NIER PL","South East Urban"]
[54546,"NIER PL EXTN","South East Urban"]
[15486,"NIER PL/NAUL PL CYWAY","South East Urban"]
[22403,"NIGEL RD","North Urban East"]
[30967,"NIGER ST","Central"]
[30968,"NIHILL CRES","Central East"]
[71187,"NIKAU PL","South Rural"]
[34156,"NIKAU RD (OTAHUHU)","South West Urban"]
[34155,"NIKAU RD (WAIHEKE)","Hauraki Islands"]
[30969,"NIKAU ST (MT EDEN)","Central"]
[40125,"NIKAU ST (WAITAKERE)","West"]
[80414,"NIKAU WAY (PVT)","North Rural"]
[40595,"NILE RD (NEW LYNN)","West"]
[20255,"NILE RD (TAKAPUNA)","North Urban East"]
[48063,"NILE RD WWAY","West"]
[51992,"NIMROD PL","South East Urban"]
[22825,"NIMSTEDT AVE","North Urban West"]
[51993,"NINA PL","South West Urban"]
[80518,"NINTH VIEW AVE","South Rural"]
[49999,"NIRMAL PL","West"]
[35007,"NIRVANA WAY","Central"]
[34157,"NISSAN PL","Central East"]
[35683,"NISSAN/WAITANGI WWAY (RP94 LHS)","Central East"]
[53405,"NITA PL","South West Urban"]
[34158,"NIXON AVE","South West Urban"]
[51994,"NIXON RD (MANGERE)","South West Urban"]
[10370,"NIXON RD (TAUPAKI)","North Rural"]
[30970,"NIXON ST","Central"]
[10679,"NOAKES HILL RD","North Rural"]
[40593,"NOALL ST","West"]
[10680,"NOBILO RD","North Rural"]
[53554,"NOBLE CRT","South East Urban"]
[53906,"NOBLE CRT-MULTOSE DR","South East Urban"]
[70909,"NOBLE PL","South Rural"]
[10681,"NOEL AVE","North Urban East"]
[52726,"NOEL BURNSIDE RD","South West Urban"]
[34160,"NOEL PL","Central"]
[22849,"NOEL WILLIAMS PL","North Urban East"]
[20498,"NOELEEN ST","North Urban West"]
[51995,"NOGAT AVE","South West Urban"]
[51996,"NOLA CRES","South West Urban"]
[40592,"NOLA RD","West"]
[30971,"NOLAN RD","Central"]
[35931,"NOLAN RD CARPARK (RP273 LHS)","Central"]
[51997,"NORANA AVE (FAVONA)","South West Urban"]
[30972,"NORANA AVE (REMUERA)","Central East"]
[40175,"NORCROSS AVE","West"]
[30973,"NORDON PL","Central East"]
[22404,"NOR'EAST DR","North Urban East"]
[71242,"NORFOLK KING DR","South Rural"]
[51998,"NORFOLK PL","South West Urban"]
[10682,"NORFOLK RD","North Urban East"]
[11282,"NORFOLK RD 3 - 11","North Urban East"]
[70869,"NORFOLK RISE","South Rural"]
[30974,"NORFOLK ST","Central"]
[30975,"NORGROVE AVE","Central"]
[53273,"NORM PELLOW DR","South West Urban"]
[40591,"NORMA AVE","West"]
[53131,"NORMAN CLOSE","South West Urban"]
[30976,"NORMAN LESSER DR","Central East"]
[35803,"NORMAN LESSER/COLLEGE WWAY (RP640)","Central East"]
[35802,"NORMAN LESSER/ST JOHN WWAY (RP1208)","Central East"]
[41431,"NORMAN RD (PVT)","West"]
[20129,"NORMAN RD (TAKAPUNA)","North Urban East"]
[40590,"NORMAN RD (TITIRANGI)","West"]
[51999,"NORMAN SPENCER DR","South West Urban"]
[30977,"NORMANBY RD (MT EDEN)","Central"]
[60418,"NORMANBY RD (PAPAKURA)","South West Urban"]
[60624,"NORMANBY RD EAST","South West Urban"]
[40589,"NORMANDY PL","West"]
[34163,"NORMANS HILL RD","Central East"]
[20409,"NORMANTON ST","North Urban West"]
[34164,"NORRIE AVE","Central"]
[60352,"NORRIE RD","South West Urban"]
[52000,"NORRIE SMITH DR","South West Urban"]
[22167,"NORTH AVE","North Urban East"]
[40588,"NORTH CANDIA RD","West"]
[10683,"NORTH CRES","North Rural"]
[40587,"NORTH PIHA RD","West"]
[24028,"NORTH PL (PVT)","North Urban West"]
[52001,"NORTH RD","South Rural"]
[24072,"NORTH SHORE HOSPITAL DR (PVT)","North Urban East"]
[40586,"NORTH WAY","West"]
[40070,"NORTHALL RD","West"]
[20115,"NORTHBORO RD","North Urban East"]
[23042,"NORTHBROOK CLOSE","North Urban West"]
[20172,"NORTHCOTE RD (EAST)","North Urban East"]
[80443,"NORTHCOTE RD (NORHT-SIDE LANE) (EAST)","North Urban East"]
[22572,"NORTHCOTE RD (NORTH-SIDE LANE) (WEST)","North Urban West"]
[20005,"NORTHCOTE RD (SOUTH-SIDE LANE) (EAST)","North Urban East"]
[80444,"NORTHCOTE RD (SOUTH-SIDE LANE) (WEST)","North Urban West"]
[22570,"NORTHCOTE RD (WEST)","North Urban West"]
[26052,"NORTHCOTE SHOPPING CENTRE SMALL CAR","North Urban West"]
[26049,"NORTHCOTE SHOPS CARPARK DP50766 L63","North Urban West"]
[26051,"NORTHCOTE WAR MEMORIAL CARPARK","North Urban West"]
[52002,"NORTHCREST WAY","South West Urban"]
[54080,"NORTHCREST WAY CARPARK (RP65 LHS)","South West Urban"]
[54826,"NORTHCREST WAY SERVICE LANE (RP20)","South West Urban"]
[54827,"NORTHCREST WAY SERVICE LANE (RP65)","South West Urban"]
[20152,"NORTHCROFT ST","North Urban East"]
[26016,"NORTHCROFT ST LOWER CARPARK DP47560","North Urban East"]
[20822,"NORTHCROFT ST SERVICE LANE","North Urban East"]
[26037,"NORTHCROFT ST UPPER CARPARK","North Urban East"]
[26017,"NORTHCROFT/AUBURN ST CARPRK DP47560","North Urban East"]
[22844,"NORTHCROSS DR","North Urban West"]
[22741,"NORTHERN RATA PL","North Urban West"]
[40585,"NORTHFIELD RD","West"]
[47243,"NORTHFIELD RD HLA (#7 - #1)","West"]
[21062,"NORTHGROVE AVE","North Urban West"]
[30978,"NORTHLAND ST","Central"]
[52003,"NORTHPARK AVE","South East Urban"]
[47307,"NORTHRIDGE TCE","West"]
[80279,"NORTHSIDE DR","West"]
[20092,"NORTHUMBERLAND ST","North Urban East"]
[71456,"NORTHVALE PL","South Rural"]
[10684,"NORTHVIEW RD","North Urban East"]
[11103,"NORTH-WEST ANCHORAGE","North Rural"]
[20584,"NORTHWICK PL","North Urban West"]
[22769,"NORTHWOOD AVE","North Urban West"]
[80726,"NORTHWOOD CLOSE","North Rural"]
[52004,"NORTON PL","South West Urban"]
[40584,"NORVAL RD","West"]
[53199,"NORWALK CRES","South West Urban"]
[30979,"NORWICH ST","Central"]
[53625,"NORWOOD DR","South East Urban"]
[20065,"NORWOOD RD","North Urban East"]
[53572,"NOTCH PL","South West Urban"]
[30980,"NOTLEY ST","Central"]
[34165,"NOTON RD","Central"]
[71008,"NOTRE DAME CRT","South Rural"]
[22678,"NOTRE DAME WAY","North Urban West"]
[22680,"NOTRE DAME WAY SIDE RD","North Urban West"]
[22854,"NOTTINGHAM PL","North Urban East"]
[30981,"NOTTINGHAM ST","Central"]
[22405,"NOUMEA PL","North Urban East"]
[53524,"NOVAK PL","South West Urban"]
[30982,"NOVAR PL","Central"]
[34731,"NUFFIELD LANE","Central"]
[31607,"NUFFIELD LANE EXTN","Central"]
[30983,"NUFFIELD ST","Central"]
[30984,"NUGENT ST","Central"]
[80425,"NUGGET AVENUE","North Urban West"]
[40583,"NUI MANA PL","West"]
[48139,"NUI MANA PL WWAY 1","West"]
[48138,"NUI MANA PL WWAY 2","West"]
[10685,"NUKUMEA COMMON","North Urban East"]
[53291,"NUNEATON DR","South East Urban"]
[21063,"NUTSEY AVE","North Urban West"]
[60556,"NYKKI PL","South West Urban"]
[52983,"NYPA WAY (PVT)","South East Urban"]
[52005,"NYSSA PL","South West Urban"]
[10686,"OAIA RD","North Rural"]
[23006,"OAK BARK DR","North Urban West"]
[34860,"OAK GR (PVT)","South West Urban"]
[22842,"OAK MANOR DR","North Urban West"]
[52009,"OAK RD","South West Urban"]
[11456,"OAK RIVER DR","North Rural"]
[34166,"OAK ST (ROYAL OAK)","Central"]
[80611,"OAK VALLEY RD","North Rural"]
[23031,"OAK VIEW TCE","North Urban West"]
[34167,"OAKDALE RD","Central"]
[34168,"OAKFIELD AVE","Central"]
[22727,"OAKFORD PARK CRES","North Urban West"]
[22799,"OAKFORD PARK SIDE RD","North Urban West"]
[41288,"OAKHAVEN PL","West"]
[54190,"OAKHURST AVE","South East Urban"]
[52010,"OAKLAND AVE","South West Urban"]
[53907,"OAKLAND AVE-SUTTON CRES","South West Urban"]
[60413,"OAKLAND RD","South West Urban"]
[24020,"OAKLANDS DR (PVT)","North Urban West"]
[34732,"OAKLANDS RD","Central"]
[60499,"OAKLEAF DR","South West Urban"]
[60353,"OAKLEIGH AVE","South West Urban"]
[30985,"OAKLEY AVE","Central"]
[52011,"OAKMONT PL","South West Urban"]
[40581,"OAKPARK PL","North Urban West"]
[52012,"OAKRIDGE WAY","South East Urban"]
[22406,"OAKTREE AVE","North Urban East"]
[53452,"OAKVILLE AVE (NORTHBOUND)","South East Urban"]
[54444,"OAKVILLE AVE (SOUTHBOUND)","South East Urban"]
[22918,"OAKWAY DR","North Urban West"]
[53666,"OAKWOOD GR","South East Urban"]
[71353,"OAKWOOD PL","South Rural"]
[40155,"OATES RD","West"]
[22407,"OBAN RD (BROWNS BAY)","North Urban East"]
[30986,"OBAN RD (WESTMERE)","Central"]
[22703,"OBELIN CLOSE","North Urban West"]
[30987,"OBERON PL","West"]
[35753,"OBERON/HORTON WWAY (RP80 LHS)","West"]
[10687,"O'BRIEN RD (ALBANY HEIGHTS)","North Rural"]
[34169,"O'BRIEN RD (WAIHEKE)","Hauraki Islands"]
[34170,"O'CASEY PL","Central"]
[34171,"OCEAN RD","Hauraki Islands"]
[34966,"OCEAN VIEW CRES (RAK)","Hauraki Islands"]
[10688,"OCEAN VIEW RD (HATFIELDS)","North Urban East"]
[21064,"OCEAN VIEW RD (NORTHCOTE)","North Urban West"]
[20184,"OCEAN VIEW RD (TAKAPUNA)","North Urban East"]
[10689,"OCEAN VIEW RD (TE ARAI)","North Rural"]
[34173,"OCEAN VIEW RD (WAIHEKE ISLAND)","Hauraki Islands"]
[40580,"OCEAN VIEW RD (WAITAKERE)","West"]
[52013,"OCEAN VIEW RD (WEYMOUTH)","South West Urban"]
[11270,"OCEAN VIEW RD 537 - 545","North Urban East"]
[31715,"OCEAN VIEW RD BUS LOOP (RP1560 RHS)","Hauraki Islands"]
[35909,"OCEAN VIEW RD LLA (GOODWIN - #213)","Hauraki Islands"]
[35908,"OCEAN VIEW/GOODWIN WWAY (RP2472)","Hauraki Islands"]
[31714,"OCEAN VIEW/OUE RAB","Hauraki Islands"]
[53582,"OCEANIA PL","South East Urban"]
[53908,"OCEANIA PL-TRANQUILITY RISE","South East Urban"]
[34172,"OCEANVIEW RD","Hauraki Islands"]
[35272,"OCHRE PL","West"]
[47218,"OCKLESTON LANDING","North Urban West"]
[15122,"OCKLESTON RD/CLARKS LN CYWAY","North Urban West"]
[30988,"O'CONNELL ST (AUCKLAND)","Central"]
[52006,"O'CONNELL ST (MANUREWA)","South West Urban"]
[71009,"O'CONNOR DR","South Rural"]
[52007,"O'CONNOR ST","South West Urban"]
[30989,"ODESSA CRES","Central East"]
[20382,"ODETTE PL","North Urban West"]
[22145,"ODIN PL","North Urban West"]
[22146,"O'DONN AVE","North Urban West"]
[34174,"O'DONNELL AVE","Central"]
[15289,"ODONNELL AVE/UNDERWOOD PARK LINK CYWAY (RP1046)","Central"]
[15287,"ODONNELL AVE/UNDERWOOD PARK LINK CYWAY (RP739)","Central"]
[53256,"OFFENHAUSER DR","South East Urban"]
[52014,"OGILVIE CRES (AIRPORT)","South West Urban"]
[10690,"OGLE RD","North Rural"]
[52008,"O'HALLORAN RD","South East Urban"]
[53909,"O'HALLORAN RD-RIDGE RD #1","South East Urban"]
[54128,"O'HALLORAN RD-RIDGE RD #2","South East Urban"]
[23055,"OHAU CRT","North Urban West"]
[30990,"OHINERAU ST","Central East"]
[40577,"OHIRA PL","West"]
[60173,"OHIWA RD","South West Urban"]
[80636,"OIOI RD","North Urban West"]
[60408,"OIRA RD","South Rural"]
[30991,"OKAHU ST","Central East"]
[35851,"OKAHU/KARORI WWAY (RP134 LHS)","Central East"]
[10692,"OKAHUKURA RD","North Rural"]
[52015,"OKAREKA PL","South East Urban"]
[52920,"OKARORO DR","South Rural"]
[52016,"OKATAINA ST","South East Urban"]
[40576,"OKEWA RD","West"]
[34175,"OKOKA RD","Hauraki Islands"]
[10693,"OKOROMAI VIEWS","North Urban East"]
[20060,"OKURA RIVER RD","North Urban East"]
[60001,"OLD BARN RD","South Rural"]
[70286,"OLD COACH HOUSE LANE","South Rural"]
[71251,"OLD COACH WAY","South Rural"]
[41183,"OLD FOREST HILL RD","West"]
[24073,"OLD HOSPITAL RD (PVT)","North Urban East"]
[10694,"OLD KAIPARA RD","North Rural"]
[40491,"OLD KAURI RD","North Urban West"]
[22191,"OLD LAKE RD","North Urban East"]
[30992,"OLD MILL RD (GREY LYNN)","Central"]
[80015,"OLD MILL RD (SILVERDALE)","North Urban East"]
[15206,"OLD MILL RD/SEDDON FIELDS CARPARK CYWAY","Central"]
[10695,"OLD NORTH RD (KUMEU)","North Rural"]
[10696,"OLD NORTH RD 2 (OREWA)","North Urban East"]
[60507,"OLD PARK PL","South West Urban"]
[11426,"OLD PINE VALLEY RD","North Rural"]
[10697,"OLD RAILWAY RD","North Rural"]
[11288,"OLD SCHOOL RD","North Rural"]
[40575,"OLD TE ATATU RD","West"]
[40574,"OLD TITIRANGI RD","West"]
[48029,"OLD TITIRANGI RD -TITIRANGI RD WWAY","West"]
[48028,"OLD TITIRANGI RD WWAY","West"]
[60174,"OLD WAIROA RD","South West Urban"]
[60655,"OLD WAIROA RD CARPARK (RP1583 RHS)","South West Urban"]
[60656,"OLD WAIROA RD CARPARK (RP965 LHS)","South West Urban"]
[11242,"OLD WHANGAPARAOA SHOPS ACCESS","North Urban East"]
[10698,"OLD WOODCOCKS RD","North Rural"]
[70441,"OLDFIELD RD (WAIPIPI)","South Rural"]
[10699,"OLDFIELD RD (WAYBY)","North Rural"]
[22408,"OLDHAM PL","North Urban East"]
[34176,"OLEA RD","Central East"]
[52017,"OLEANDER PT","South East Urban"]
[52018,"OLENA AVE","South East Urban"]
[52019,"OLIVE CRES","South West Urban"]
[34177,"OLIVE GR (PVT)","Central East"]
[24056,"OLIVE GR (UPPER HARBOUR)","North Urban West"]
[34178,"OLIVE RD","Central East"]
[52020,"OLIVE ST","South West Urban"]
[52021,"OLIVER RD","South East Urban"]
[54653,"OLIVER RD CARPARK (RP20 RHS)","South East Urban"]
[15824,"OLIVER RD/OAKWOOD GR CYWAY","South East Urban"]
[30993,"OLIVER ST","Central"]
[80534,"OLIVER STREET","North Rural"]
[52022,"OLIVER TWIST AVE","South East Urban"]
[15832,"OLIVER TWIST AVE/BLEAKHOUSE RD CYWAY","South East Urban"]
[34179,"OLSEN AVE","Central"]
[20611,"OLWYN PL","North Urban West"]
[60175,"OLYMPIC PL (PAPAKURA)","South West Urban"]
[40020,"OLYMPIC PL (WAITAKERE)","West"]
[10700,"OLYMPUS RD","North Rural"]
[34180,"OLYMPUS ST","Central"]
[30463,"OLYMPUS ST HAMMERHEAD","Central"]
[52023,"OMAGH AVE","South West Urban"]
[10702,"OMAHA DR","North Rural"]
[10703,"OMAHA FLATS RD","North Rural"]
[10704,"OMAHA VALLEY RD","North Rural"]
[30994,"OMAHU RD","Central East"]
[30995,"OMANA AVE (EPSOM)","Central"]
[11516,"OMANA AVE (SHELLY BEACH)","North Rural"]
[52024,"OMANA BEACH RD","South Rural"]
[52025,"OMANA ESP","South Rural"]
[54010,"OMANA ESP-CRAIG RD","South Rural"]
[53180,"OMANA HEIGHTS DR","South Rural"]
[20033,"OMANA RD (MILFORD)","North Urban East"]
[52026,"OMANA RD (PAPATOETOE)","South West Urban"]
[35006,"OMANAWA LANE","Hauraki Islands"]
[30996,"OMARU LANE","Central East"]
[35009,"OMATA RD","Hauraki Islands"]
[10705,"OMAUMAU RD","North Rural"]
[22779,"OMEGA ST","North Urban West"]
[15030,"OMEGA ST LINK CYWAY","North Urban West"]
[34181,"OMIHA RD","Hauraki Islands"]
[20408,"ONDINE PL","North Urban West"]
[40573,"ONEDIN PL","West"]
[34182,"ONEHUNGA HARBOUR RD","Central East"]
[15277,"ONEHUNGA HARBOUR RD LINK CYWAY (RP346)","Central East"]
[15278,"ONEHUNGA HARBOUR RD LINK CYWAY (RP354)","Central East"]
[15279,"ONEHUNGA HARBOUR RD/ONEHUNGA MALL CYWAY","Central East"]
[34183,"ONEHUNGA MALL","Central East"]
[35831,"ONEHUNGA MALL/ARTHUR RAB","Central East"]
[35832,"ONEHUNGA MALL/CHURCH RAB","Central East"]
[35833,"ONEHUNGA MALL/PRINCES RAB","Central East"]
[10706,"O'NEIL RD","North Rural"]
[30997,"O'NEILL ST","Central"]
[20179,"O'NEILLS AVE","North Urban East"]
[40582,"O'NEILLS RD (NORTH)","West"]
[40687,"O'NEILLS RD (SOUTH)","West"]
[80283,"ONEKIRITEA RD","North Urban West"]
[47064,"ONEMANA WAY","West"]
[15114,"ONEMANA WAY LINK CYWAY","West"]
[20094,"ONEPOTO RD","North Urban East"]
[10707,"ONEPU LANE","North Urban East"]
[53278,"ONEROA RD","South East Urban"]
[35679,"ONEROA VILLAGE LANE","Hauraki Islands"]
[34185,"ONETANGI RD","Hauraki Islands"]
[22147,"ONETAUNGA RD","North Urban West"]
[21065,"ONEWA RD","North Urban West"]
[15025,"ONEWA RD/SYLVAN AVE CYWAY","North Urban West"]
[11541,"ONEWHERO RD","North Rural"]
[30998,"ONSLOW AVE (EPSOM)","Central"]
[52027,"ONSLOW AVE (PAPATOETOE)","South West Urban"]
[24047,"ONSLOW LANE (PVT)","North Urban West"]
[34733,"ONSLOW RD (MT ALBERT)","Central"]
[60176,"ONSLOW RD (PAPAKURA)","South West Urban"]
[15330,"ONSLOW RD/GEORGE ST CYWAY","Central"]
[60709,"OPAHEKE RD (OPAHEKE) (SR)","South Rural"]
[60177,"OPAHEKE RD (PAPAKURA) (SW)","South West Urban"]
[60551,"OPAHEKE/LIVERPOOL RAB","South West Urban"]
[10708,"OPAHI BAY RD","North Rural"]
[52028,"OPAL AVE","South East Urban"]
[22763,"OPAL CLOSE","North Urban West"]
[40572,"OPANUKU RD","West"]
[40571,"OPANUKU RD EXTN","West"]
[53380,"OPAWA CRES","South West Urban"]
[30999,"OPHIR ST","Central"]
[53465,"OPITO WAY","South East Urban"]
[71559,"OPOIA DR","South Rural"]
[11420,"OPOTO PL","North Rural"]
[40570,"OPOU RD","West"]
[47228,"OPOU RD LLA (#24 - #32)","West"]
[41304,"OPTIMIST PL","North Urban West"]
[48248,"OPTIMIST PL WWAY","North Urban West"]
[48249,"OPTIMIST PL WWAY - HOBSONVILLE RD WWAY","North Urban West"]
[20082,"OPUA ST","North Urban East"]
[22981,"ORACLE DR","North Urban West"]
[10709,"ORAHA RD","North Rural"]
[11338,"ORAHA RD 50 - 56","North Rural"]
[31000,"ORAKAU AVE","Central"]
[52029,"ORAKAU RD","South West Urban"]
[31001,"ORAKEI RD","Central East"]
[36036,"ORAKEI RD CARPARK (RP2375 LHS)","Central East"]
[80287,"ORAKEI RD WWAY","Central East"]
[15326,"ORAKEI RD/ORAKEI BASIN RESERVE RD CYWAY","Central East"]
[15322,"ORAKEI RD/RAILWAY CYWAY (RP2205)","Central East"]
[15320,"ORAKEI STATION/MEADOWBANK STATION CYWAY","Central East"]
[35842,"ORAKEI/KEPA RAB","Central East"]
[35843,"ORAKEI/SHORE RAB","Central East"]
[52030,"ORAMS RD","South West Urban"]
[54321,"ORAMS RD LLA (#58 - #66)","South West Urban"]
[15458,"ORAMS RD/EVERGLADE DR CYWAY","South West Urban"]
[80416,"ORAMS/BROUDER WWAY (RP 159 RHS)","South West Urban"]
[34187,"ORAN RD","Central East"]
[34188,"ORANGA AVE","Central East"]
[52031,"ORANGEWOOD DR","South East Urban"]
[53912,"ORANGEWOOD DR-FIELDSTONE CRT","South East Urban"]
[34189,"ORAPIU RD","Hauraki Islands"]
[20616,"ORATAU PL","North Urban West"]
[47284,"ORATIA DR","West"]
[48046,"ORATIA DR WWAY","West"]
[52032,"ORATU PL","South West Urban"]
[53913,"ORATU PL-BENTON PL","South West Urban"]
[53914,"ORATU PL-ROWANDALE AVE","South West Urban"]
[52033,"ORB AVE","South West Urban"]
[22991,"ORBIT DR","North Urban West"]
[53530,"ORBIT PL","South East Urban"]
[34190,"ORCADES PL","Central"]
[11550,"ORCHARD LANE","North Rural"]
[22409,"ORCHARD RD","North Urban East"]
[60178,"ORCHARD RISE","South West Urban"]
[31002,"ORCHARD ST","West"]
[80540,"ORCHARD TERRACE","North Rural"]
[40569,"ORCHID PL","West"]
[31003,"OREGON AVE","West"]
[11161,"OREGON PARK","North Rural"]
[60179,"OREGON PL","South West Urban"]
[40568,"OREIL AVE","West"]
[48260,"OREIL AVE - HOMES NORTH WWAY","West"]
[48261,"OREIL AVE WWAY","West"]
[48263,"OREIL AVE WWAY - JUDEWYNN DR WWAY","West"]
[48262,"OREIL AVE WWAY - OREIL AVE #85 WWAY","West"]
[52034,"ORERE POINT RD","South Rural"]
[52035,"ORERE-MATINGARAHI RD","South Rural"]
[52036,"ORETI PL","South West Urban"]
[10710,"OREWA HEIGHTS CRES","North Urban East"]
[10711,"OREWA SQUARE","North Urban East"]
[80621,"OREWA SQUARE CAR PARK","North Urban East"]
[22410,"OREWA ST","North Urban East"]
[34191,"ORIANA AVE","Central"]
[15623,"ORINDA CL LINK CYWAY","South East Urban"]
[52037,"ORINDA CLOSE","South East Urban"]
[54688,"ORINDA CLOSE EXTN","South East Urban"]
[20542,"ORION PL","North Urban West"]
[60180,"ORION ST","South West Urban"]
[52040,"ORLY AVE","South West Urban"]
[54614,"ORLY AVE CARPARK (RP154 LHS)","South West Urban"]
[52041,"ORMISTON RD (EASTBOUND/EAST TAMAKI) (SW)","South West Urban"]
[54810,"ORMISTON RD (EASTBOUND/FLAT BUSH) (SE)","South East Urban"]
[54447,"ORMISTON RD (WESTBOUND/FLAT BUSH) (SE)","South East Urban"]
[15730,"ORMISTON RD/FLINTRIDGE DR CYWAY (RP3013)","South East Urban"]
[15499,"ORMISTON RD/MURPHYS RD CYWAY","South East Urban"]
[31004,"ORMONDE RD","Central East"]
[22411,"ORNE ST","North Urban East"]
[52821,"OROHENA PL","South East Urban"]
[34734,"O'RORKE RD","Central East"]
[34761,"O'RORKE ST (NORTH)","Central East"]
[34760,"O'RORKE ST (SOUTH)","Central East"]
[52042,"OROUA PL","South West Urban"]
[34735,"ORPHEUS DR","Central East"]
[60181,"ORPHEUS PL","South West Urban"]
[70445,"ORPHEUS RD","South Rural"]
[53527,"ORRELL PL","South West Urban"]
[52043,"ORRS RD","South West Urban"]
[34193,"ORSOVA PL","Central"]
[20400,"ORTON ST","North Urban West"]
[70447,"ORUA BAY RD","South Rural"]
[22149,"ORUAMO PL","North Urban West"]
[22232,"ORUAMO PL HAMMERHEAD","North Urban West"]
[52044,"ORUARANGI RD","South West Urban"]
[15537,"ORUARANGI RD/BEACH CYWAY (RP1406)","South West Urban"]
[15544,"ORUARANGI RD/PUKAKI LAGOON CYWAY","South West Urban"]
[35038,"ORUAWHARO LANE","Hauraki Islands"]
[52045,"ORVILLE PL","South West Urban"]
[20602,"ORWELL RD","North Urban West"]
[60182,"OSBORNE PL","South West Urban"]
[34194,"OSBORNE ST","Central"]
[20621,"OSCAR RD","North Urban West"]
[60552,"O'SHANNESSEY SERVICE LANE (RP276 LHS)","South West Urban"]
[60553,"O'SHANNESSEY SERVICE LANE (RP346 LHS)","South West Urban"]
[60277,"O'SHANNESSEY SERVICE LANE (RP404 RHS)","South West Urban"]
[60183,"O'SHANNESSEY ST","South West Urban"]
[60677,"O'SHANNESSEY ST CARPARK (RP195 RHS)","South West Urban"]
[60278,"O'SHANNESSEY/RAILWAY SERVICE LANE","South West Urban"]
[35010,"O'SHEA RD","Hauraki Islands"]
[40047,"OSMAN ST","West"]
[48031,"OSMAN ST WWAY","West"]
[40567,"OSMOND CRT","West"]
[52046,"OSPREY ST","South East Urban"]
[53915,"OSPREY ST-PANDORA PL","South East Urban"]
[53916,"OSPREY ST-UNDINE ST","South East Urban"]
[34195,"OSTEND RD","Hauraki Islands"]
[52047,"OSTERLEY WAY","South West Urban"]
[70448,"OSTRICH FARM RD","South Rural"]
[70449,"OSTRICH RD","South Rural"]
[71424,"O'SULLIVAN PL","South Rural"]
[53442,"OSWALD CLOSE","South East Urban"]
[52875,"OTAGO PL","South West Urban"]
[31005,"OTAHURI CRES","Central"]
[20191,"OTAKAU RD","North Urban East"]
[10713,"OTANERUA RD","North Urban East"]
[15610,"OTARA CREEK RESERVE LOOP CYWAY","South West Urban"]
[15607,"OTARA CREEK RESERVE WEST CYWAY","South West Urban"]
[15609,"OTARA CREEK RESERVE/CREEK CYWAY","South West Urban"]
[52048,"OTARA RD","South West Urban"]
[52049,"OTAU MOUNTAIN RD","South Rural"]
[15538,"OTAUTAUA STONEFIELDS CYWAY","South West Urban"]
[20030,"OTEHA VALLEY RD","North Urban West"]
[22821,"OTEHA VALLEY RD XTN","North Urban West"]
[52050,"OTHELLO DR","South West Urban"]
[54651,"OTHELLO DR CARPARK (RP462 LHS)","South East Urban"]
[31006,"OTIRA ST","West"]
[40565,"OTITORI BAY RD","West"]
[41179,"OTITORI BAY RD EXTN","West"]
[47229,"OTITORI BAY RD HLA (#11 - #17)","West"]
[70452,"OTTO RD","South Rural"]
[34198,"OUE RD","Hauraki Islands"]
[36106,"OUE RD CARPARK","Hauraki Islands"]
[34197,"OUTHWAITE LANE (PVT)","Central"]
[20609,"OUTLOOK RD","North Urban West"]
[80463,"OUTLOOK TERRACE","North Urban East"]
[53493,"OUTRIGGER PL","South West Urban"]
[71509,"OVEREND CRT","South Rural"]
[31007,"OVERLEA RD","Central East"]
[52051,"OVERTON RD","South West Urban"]
[34200,"OWAIRAKA AVE","Central"]
[53052,"OWENBEG RISE","South East Urban"]
[22523,"OWENS RD (DEVONPORT)","North Urban East"]
[31008,"OWENS RD (EPSOM)","Central"]
[70870,"OWENS RD (WAIUKU)","South Rural"]
[22671,"OWL CRT","North Urban West"]
[24096,"OXFORD DR (PVT)","North Urban East"]
[52052,"OXFORD RD","South West Urban"]
[22066,"OXFORD TCE","North Urban East"]
[34201,"OXLEY AVE","Central"]
[34232,"OXTON RD","Central"]
[10714,"OYSTER POINT RD","North Rural"]
[11429,"OYSTER POINT RD (WEST)","North Rural"]
[80717,"OYSTERCATCHER LANE","North Rural"]
[40564,"OYSTERGROVE RD","North Urban West"]
[48245,"OYSTERGROVE RD WWAY","North Urban West"]
[40563,"OZICH AVE","West"]
[10715,"OZONE RD","North Urban East"]
[53673,"PACIFIC EVENTS CENTRE DR","South West Urban"]
[10716,"PACIFIC PDE (ARMY BAY)","North Urban East"]
[34202,"PACIFIC PDE (WAIHEKE)","Hauraki Islands"]
[35591,"PACIFIC PL (PVT)","Central"]
[34203,"PACIFIC RISE","Central East"]
[70861,"PACIFIC ST","South Rural"]
[22152,"PACKHAM PL","North Urban West"]
[54027,"PACKSPUR DR","South East Urban"]
[31009,"PADDINGTON ST","Central East"]
[35864,"PADDINGTON/ELSTREE WWAY (RP194)","Central East"]
[52053,"PADFIELD PL","South East Urban"]
[71369,"PAERATA RD","South Rural"]
[70021,"PAERATA/CRISP SERVICE LANE","South Rural"]
[31010,"PAERIMU ST","Central East"]
[40562,"PAEWAI RD","West"]
[52054,"PAGE PT","South East Urban"]
[31011,"PAGET ST","Central"]
[10717,"PAH HILL RD","North Rural"]
[52055,"PAH RD (COCKLE BAY)","South East Urban"]
[34233,"PAH RD (EPSOM)","Central"]
[52056,"PAH RD (PAPATOETOE)","South West Urban"]
[54180,"PAH RD (PAPATOETOE) CARPARK (RP436)","South West Urban"]
[34208,"PAH RD (WAIHEKE)","Hauraki Islands"]
[52931,"PAH RD LLA (#58 - #86)","South East Urban"]
[31012,"PAHAKI ST","Central East"]
[40561,"PAHI PL","West"]
[34209,"PAICE AVE","Central"]
[34207,"PAIHIA RD","Central East"]
[52057,"PAINE PL","South West Urban"]
[80396,"PAINTON ROAD","North Urban East"]
[80399,"PAINTON/SMALL RAB","North Urban East"]
[34210,"PAISLEY PL","Central East"]
[52058,"PAISLEY ST","South East Urban"]
[80661,"PAITRY PLACE","West"]
[52059,"PAJARO PL","South East Urban"]
[34880,"PAKENHAM ST EAST","Central"]
[31013,"PAKENHAM ST WEST","Central"]
[71231,"PAKINGTON LANE","South Rural"]
[40560,"PAKIRA AVE","West"]
[10718,"PAKIRI BLOCK RD","North Rural"]
[10719,"PAKIRI RD","North Rural"]
[10720,"PAKIRI RIVER RD","North Rural"]
[15819,"PAKURANGA HIGHWAY/SEVEN OAKS DR CYWAY","South East Urban"]
[52060,"PAKURANGA RD (EAST BOUND)","South East Urban"]
[80375,"PAKURANGA RD (WEST BOUND)","South East Urban"]
[80214,"PAKURANGA RD 143-145  @RP1453","South East Urban"]
[15589,"PAKURANGA RD EB/PIGEON MOUNTAIN CYWAY (RP1340)","South East Urban"]
[54237,"PAKURANGA RD LLA (#39 - #51)","South East Urban"]
[54238,"PAKURANGA RD LLA (#75 - #105)","South East Urban"]
[15818,"PAKURANGA RD/DALE CRES CYWAY","South East Urban"]
[15577,"PAKURANGA RD/DOWLING PL CYWAY","South East Urban"]
[54746,"PAKURANGA RD/KERSWILL PL LINK","South East Urban"]
[15576,"PAKURANGA ROTARY PARK CYWAY","South East Urban"]
[60356,"PALANDO PL","South West Urban"]
[22412,"PALAWAN PL","North Urban East"]
[52061,"PALERMO PL","South West Urban"]
[60184,"PALISADE PL","South West Urban"]
[52062,"PALLANT ST","South West Urban"]
[22413,"PALLISER LANE","North Urban East"]
[34211,"PALLISTER DR","Central"]
[52063,"PALM AVE","South East Urban"]
[40044,"PALM COURT DR","West"]
[48037,"PALM COURT DR WWAY","West"]
[11410,"PALM COVE","North Urban East"]
[34212,"PALM RD","Hauraki Islands"]
[34990,"PALM RD EXTN (RP434 RHS)","Hauraki Islands"]
[52893,"PALMCREST GR","South East Urban"]
[40559,"PALMER AVE","West"]
[31014,"PALMER CRES","Central East"]
[10721,"PALMER ST","North Rural"]
[52064,"PALMERS RD","South West Urban"]
[54359,"PALMERS RD SLIP (RP428 RHS)","South East Urban"]
[54358,"PALMERS/FINLAYSON RAB","South West Urban"]
[22153,"PALMERSTON RD","North Urban West"]
[52065,"PALMETTO PL","South West Urban"]
[11215,"PALMGREEN CRT","North Urban East"]
[52066,"PALMYRA WAY","South East Urban"]
[15575,"PALMYRA WAY/PRINCE REGENT DR CYWAY","South East Urban"]
[53068,"PALOMA CRT (PVT)","South West Urban"]
[40558,"PALOMINO DR","West"]
[31015,"PAMELA PL","Central East"]
[40082,"PAMELA PL (WAITAKERE)","West"]
[52067,"PAMIR RD","South West Urban"]
[11293,"PAMPAS LANE","North Rural"]
[80722,"PAMU ROAD","North Urban West"]
[34213,"PANAMA RD","Central East"]
[35724,"PANAMA/JOLSON WWAY (RP1441 RHS)","Central East"]
[35726,"PANAMA/RAKINO WWAY (RP1510 LHS)","Central East"]
[31016,"PANAPA DR","Central East"]
[33135,"PANAPA DR HLA (#19 - #25)","Central East"]
[52068,"PANDORA PL","South East Urban"]
[40557,"PANKHURST PL","West"]
[34861,"PANMURE RAB","Central East"]
[22804,"PANNILL PL","North Urban West"]
[11246,"PANORAMA BORE ACCESS","North Urban East"]
[80208,"PANORAMA HEIGHTS","North Urban East"]
[34214,"PANORAMA RD","Central East"]
[53352,"PANTERA WAY","South West Urban"]
[10722,"PANUI TCE","North Rural"]
[40011,"PANZIC PL","West"]
[31017,"PAORA ST","Central East"]
[22154,"PAPA PL","North Urban West"]
[31018,"PAPAHIA ST","Central"]
[34215,"PAPAKU RD","South West Urban"]
[60470,"PAPAKURA/CLEVEDON RD","South Rural"]
[80164,"PAPAKURA/CLEVEDON RD (SR)","South Rural"]
[52069,"PAPAKURA-CLEVEDON RD (ARDMORE) (SW)","South West Urban"]
[31723,"PAPANGO ST","Central East"]
[70454,"PAPARATA RD","South Rural"]
[70076,"PAPARATA/PAPARIMU SLIP","South Rural"]
[70455,"PAPARIMU RD","South Rural"]
[52070,"PAPAROA RD","South East Urban"]
[54700,"PAPAROA RD CARPARK (RP283 LHS)","South East Urban"]
[40556,"PAPATAHI PL","West"]
[48173,"PAPATAHI PL WWAY","West"]
[80558,"PARA CLOSE","North Urban West"]
[80387,"PARACHUTE CRES","South West Urban"]
[52819,"PARADISE PL","South East Urban"]
[22155,"PARAGON AVE","North Urban West"]
[10723,"PARAKAI AVE","North Rural"]
[70456,"PARAKAU RD","South Rural"]
[40555,"PARAMOUNT DR","West"]
[22156,"PARAMU AVE","North Urban West"]
[47065,"PARANI CRT","West"]
[11468,"PARAOA CRES","North Rural"]
[11579,"PARAONE PL","North Rural"]
[60416,"PARAREKAU RD","South West Urban"]
[31019,"PARATA ST","Central East"]
[34216,"PARAU ST","Central"]
[34885,"PARAU ST HLA (#41 - #17)","Central"]
[34884,"PARAU ST LLA (#2 - #34)","Central"]
[31653,"PARAU/DUKE RAB","Central"]
[31020,"PARAWAI CRES","Central"]
[15218,"PARAWAI CRES/BAYFIELD RD CYWAY","Central"]
[20059,"PAREMOREMO RD","North Urban West"]
[52071,"PARERA PL","South West Urban"]
[34217,"PARFITT ST","Central"]
[22157,"PARIS PL","North Urban West"]
[52072,"PARISH LINE RD","South Rural"]
[31021,"PARITAI DR","Central East"]
[35850,"PARITAI/COATES WWAY (RP1641 RHS)","Central East"]
[20279,"PARITY PL","North Urban West"]
[20139,"PARK AVE - TAKAPUNA","North Urban East"]
[31022,"PARK AVE (GRAFTON)","Central"]
[21066,"PARK AVE (NORTHCOTE)","North Urban West"]
[34219,"PARK AVE (OTAHUHU)","South West Urban"]
[35958,"PARK AVE (OTAHUHU) CARPARK (RP182)","South West Urban"]
[52074,"PARK AVE (PAKURANGA) (PVT)","South East Urban"]
[52073,"PARK AVE (PAPATOETOE)","South West Urban"]
[36116,"PARK AVE CARPARK (RP35 RHS)","South West Urban"]
[60185,"PARK ESTATE RD","South West Urban"]
[60557,"PARK ESTATE RD LLA (#37-#53)","South West Urban"]
[60558,"PARK ESTATE RD LLA (#40-#46)","South West Urban"]
[34220,"PARK GARDENS","Central East"]
[30466,"PARK GATE AVE","Central"]
[20449,"PARK HILL RD (GLENFIELD)","North Urban West"]
[52075,"PARK HILL RD (HOWICK)","South East Urban"]
[54684,"PARK HILL RD CARPARK (RP30 LHS)","South East Urban"]
[23084,"PARK HILL RD LLA (#2 - #14)","North Urban West"]
[20453,"PARK RD (GLENFIELD)","North Urban West"]
[31023,"PARK RD (GRAFTON)","Central"]
[34218,"PARK RD (WAIHEKE)","Hauraki Islands"]
[40554,"PARK RD (WAITAKERE)","West"]
[70459,"PARK RD (WAIUKU)","South Rural"]
[22414,"PARK RISE","North Urban East"]
[47251,"PARKCREST DR","West"]
[11623,"PARKDALE CLOSE","North Rural"]
[31024,"PARKDALE RD","Central"]
[40063,"PARKER AVE","West"]
[52076,"PARKER CRES","South West Urban"]
[10724,"PARKER RD (KOMOKORIKI)","North Rural"]
[40553,"PARKER RD (WAITAKERE)","West"]
[10725,"PARKER RD 2 (TE HANA)","North Rural"]
[60186,"PARKER ST","South West Urban"]
[34221,"PARKFIELD TCE","Central"]
[60509,"PARKHAVEN DR","South West Urban"]
[20720,"PARKHEAD PL","North Urban West"]
[34222,"PARKHILL RD","Central"]
[10726,"PARKHURST RD","North Rural"]
[34223,"PARKINSON AVE","Central"]
[40552,"PARKLANDS AVE","West"]
[24088,"PARKLANE DR (PVT)","North Urban East"]
[47253,"PARKRIDGE WAY","West"]
[80129,"PARKSIDE DR","North Urban East"]
[40551,"PARKSIDE RD","North Urban West"]
[31025,"PARKSIDE ST","Central East"]
[53295,"PARKSTONE PL","South West Urban"]
[47319,"PARKVALE GR","West"]
[48144,"PARKVALE GRV WWAY","West"]
[11566,"PARKVIEW DR","North Urban East"]
[52077,"PARKVIEW PL","South East Urban"]
[20681,"PARKWAY DR","North Urban West"]
[23020,"PARKWAY DR NORTH BUS RAMP","North Urban West"]
[23019,"PARKWAY DR SOUTH BUS RAMP","North Urban West"]
[11395,"PARKWOOD CRES","North Urban East"]
[52078,"PARKWOOD PL","South East Urban"]
[80488,"PARLANE DR","North Rural"]
[31026,"PARLIAMENT ST","Central"]
[40550,"PARMA PL","West"]
[31028,"PARNELL RD","Central"]
[31027,"PARNELL RISE","Central"]
[31603,"PARNELL/BROADWAY RAB","Central"]
[31029,"PARR RD NORTH","Central"]
[35933,"PARR RD NORTH CARPARK (RP77 RHS)","Central"]
[31030,"PARR RD SOUTH","Central"]
[20230,"PARR TCE","North Urban East"]
[52079,"PARRAMATTA PL","South East Urban"]
[15708,"PARRAMATTA PL EAST LINK CYWAY","South East Urban"]
[15707,"PARRAMATTA PL LINK CYWAY","South East Urban"]
[34224,"PARRISH RD","Central"]
[40549,"PARRS CROSS RD","West"]
[48076,"PARRS CROSS RD WWAY 2","West"]
[15132,"PARRS CROSS RD/RAIL BRIDGE CYWAY","West"]
[11216,"PARRY CRT","North Rural"]
[34225,"PARRY RD","Central East"]
[34226,"PARRY ST","Central"]
[35725,"PARRY/HARWOOD WWAY (RP210 LHS)","Central"]
[31031,"PARSONS RD","Central East"]
[71486,"PARSOT PL","South Rural"]
[10727,"PARTRIDGE RD","North Rural"]
[31032,"PARTRIDGE ST","Central"]
[21067,"PARURU AVE","North Urban West"]
[71012,"PARVIN PL","South Rural"]
[31033,"PASADENA AVE","Central"]
[34227,"PASCOE ST","Central"]
[80655,"PASO FINO CRES","South West Urban"]
[31034,"PASTEUR PL","West"]
[52957,"PAT O'CONNOR PL","South West Urban"]
[51339,"PATE CRES","South West Urban"]
[52080,"PATEA PL (OTARA)","South West Urban"]
[60273,"PATEA PL (PAPAKURA)","South West Urban"]
[60503,"PATEKE DR","South West Urban"]
[71013,"PATERSON AVE","South Rural"]
[71180,"PATERSON AVE WEST","South Rural"]
[31035,"PATEY ST","Central"]
[11552,"PATIKI PL","North Rural"]
[31036,"PATIKI RD","West"]
[40548,"PATON AVE (HENDERSON)","West"]
[52081,"PATON AVE (PAPATOETOE)","South West Urban"]
[52082,"PATON RD","South East Urban"]
[40547,"PATRICE PL","West"]
[52083,"PATRICIA PL","South West Urban"]
[70462,"PATRICK LANE","South Rural"]
[34736,"PATRICK ST","Central East"]
[52084,"PATROS PL","South East Urban"]
[47085,"PATSY O'HARA PL","West"]
[34228,"PATTERSON ST","Central"]
[31037,"PATTESON AVE","Central East"]
[40546,"PATTS AVE","West"]
[48126,"PATTS AVE WWAY","West"]
[70463,"PATULLO RD","South Rural"]
[70465,"PATUMAHOE RD","South Rural"]
[20593,"PATUONE AVE","North Urban East"]
[22903,"PATUONE PL","North Urban East"]
[40545,"PATUROA RD","West"]
[11462,"PAUA LANE","North Rural"]
[35014,"PAUA PL (PVT)","Central"]
[20760,"PAUL MATTHEWS RD","North Urban West"]
[52085,"PAUL PL","South East Urban"]
[52788,"PAUL STEVENSON PL (PVT)","South East Urban"]
[52086,"PAULANGE PL","South East Urban"]
[52087,"PAULINE PL","South East Urban"]
[52088,"PAULOWNIA PL","South West Urban"]
[31038,"PAUNUI ST","Central East"]
[54029,"PAVILION DR","South West Urban"]
[20511,"PAVOLA GR","North Urban West"]
[52089,"PAWA PL","South West Urban"]
[20312,"PAX AVE","North Urban East"]
[52090,"PAYKEL AVE","South East Urban"]
[34229,"PAYNES LANE","Central East"]
[34230,"PEACE AVE","Central East"]
[70467,"PEACH HILL RD","South Rural"]
[31039,"PEACH PDE","Central East"]
[20455,"PEACH RD","North Urban West"]
[40544,"PEACHGROVE RD","West"]
[53285,"PEACHWOOD GR","South West Urban"]
[31040,"PEACOCK ST","Central East"]
[10730,"PEAK RD","North Rural"]
[34234,"PEARCE ST","Central East"]
[35946,"PEARCE ST CARPARK (RP57 LHS)","Central East"]
[52091,"PEARL BAKER DR","South West Urban"]
[21068,"PEARN CRES","North Urban West"]
[21069,"PEARN PL","North Urban West"]
[70468,"PEARSON RD (PATUMAHOE)","South Rural"]
[52842,"PEARSON RD (WHITFORD)","South Rural"]
[31041,"PEART VIEW","Central East"]
[35800,"PEART/ST JOHNS WWAY (RP82 LHS)","Central East"]
[34236,"PEARY RD","Central"]
[31649,"PEARY/KINGSFORD SLIP","Central"]
[52092,"PEBBLE BEACH PL","South East Urban"]
[15630,"PEBBLE BEACH PL LINK CYWAY","South East Urban"]
[10731,"PEBBLE BROOK RD","North Rural"]
[36058,"PECAN PL (PVT)","West"]
[52093,"PEDERSEN PL","South East Urban"]
[60458,"PEDLAR PL","South West Urban"]
[15413,"PEDLAR PL/BROCKTON AVE CYWAY","South West Urban"]
[34237,"PEEK ST","Central East"]
[31042,"PEEL ST","Central"]
[80361,"PEERLESS AVE","South West Urban"]
[34238,"PEET AVE","Central"]
[52094,"PEGASUS PL","South East Urban"]
[11360,"PEGASUS TCE","North Urban East"]
[34239,"PEGLER AVE","Central"]
[52095,"PEGLER DR","South East Urban"]
[52096,"PEGUERO PL","South West Urban"]
[80694,"PEIHINGA RD","South East Urban"]
[53047,"PELARGONIUM TCE","South West Urban"]
[31043,"PELHAM AVE","Central"]
[20730,"PELICAN LANE","North Urban West"]
[52097,"PELORUS PL","South East Urban"]
[31044,"PEMBER REEVES ST","Central"]
[20475,"PEMBERTON AVE","North Urban West"]
[31045,"PEMBROKE CRES","Central East"]
[52098,"PEMBROKE ST","South West Urban"]
[54544,"PEMBROKE ST CARPARK (RP32 LHS)","South West Urban"]
[35788,"PEMBROKE/WENDOVER WWAY (RP166)","Central East"]
[60187,"PEMBROOK ST","South West Urban"]
[31046,"PENBURY PL","West"]
[54824,"PENCAITLAND DR","South East Urban"]
[80600,"PENCAITLAND DR (NORTH)","South East Urban"]
[31047,"PENCARROW AVE","Central"]
[20318,"PENDENE PL","North Urban East"]
[52099,"PENDERFORD PL","South West Urban"]
[40543,"PENDERS PL","West"]
[40542,"PENDLEBURY ST","West"]
[40541,"PENDRELL RD","West"]
[40540,"PENFOLD PL","West"]
[54047,"PENG PL","South West Urban"]
[11212,"PENGELLY PL","North Rural"]
[22415,"PENGUIN DR","North Urban East"]
[10732,"PENGUIN ST","North Rural"]
[54028,"PENIHANA PL","South West Urban"]
[53192,"PENINSULA RD","South West Urban"]
[54609,"PENINSULA/CYCLAMEN RAB","South West Urban"]
[52100,"PENION DR","South West Urban"]
[52101,"PENNELL PL","South East Urban"]
[34240,"PENNEY AVE","Central"]
[20218,"PENNING RD","North Urban East"]
[80574,"PENNY LANE","South Rural"]
[52102,"PENNYCOOK PL","South East Urban"]
[53413,"PENNYGALE CLOSE","South East Urban"]
[34241,"PENRHYN RD","Central"]
[34242,"PENROSE RD","Central East"]
[31675,"PENROSE RD LLA (RP437 RHS)","Central East"]
[52103,"PENRUDDOCKE RD","South East Urban"]
[34243,"PENTLAND AVE","Central"]
[31636,"PENTLAND AVE HAMMERHEAD","Central"]
[10733,"PENTON RD","North Urban East"]
[53396,"PENWOOD CLOSE","South East Urban"]
[22416,"PENZANCE RD","North Urban East"]
[22417,"PENZANCE RD HLA","North Urban East"]
[52104,"PEPLER ST","South East Urban"]
[22883,"PEPPERDINE PL","North Urban West"]
[54242,"PERCIVAL GULL PL (PVT)","South West Urban"]
[31048,"PERCIVAL PDE","Central"]
[52105,"PERCIVAL ST","South West Urban"]
[80346,"PERCY GREENS (EASTBOUND)","North Urban East"]
[80345,"PERCY GREENS (WESTBOUND)","North Urban East"]
[71236,"PERCY MILLEN DR","South Rural"]
[34244,"PERCY ST","Central"]
[10734,"PERCY ST 1","North Rural"]
[11125,"PERCY ST 2","North Rural"]
[31049,"PERE ST","Central East"]
[22159,"PEREGRINE PL","North Urban West"]
[80300,"PEREKIA ST","North Urban West"]
[52106,"PERENDALE CLOSE","South East Urban"]
[52107,"PERETAO RISE","South West Urban"]
[60357,"PERIDOT PL","South West Urban"]
[15415,"PERIDOT PL LINK CYWAY","South West Urban"]
[60437,"PEROTTI PL","South West Urban"]
[60560,"PEROTTI PL HAMMERHEAD","South West Urban"]
[41185,"PERRIS RD","West"]
[10736,"PERRY RD","North Rural"]
[52108,"PERSHORE PL","South West Urban"]
[15530,"PERSHORE PL/HEYFORD CL CYWAY","South West Urban"]
[52109,"PERTH ST","South West Urban"]
[53571,"PERTOSA DR","South East Urban"]
[52110,"PESARO PL","South West Urban"]
[60596,"PESCARA PT","South West Urban"]
[31050,"PETER BUCK RD","West"]
[30941,"PETER MULGREW ST","West"]
[20211,"PETER TCE","North Urban East"]
[40539,"PETERHOUSE PL","West"]
[48280,"PETERHOUSE PL WWAY","West"]
[11355,"PETERS LANE","North Rural"]
[11496,"PETERS WAY","North Urban East"]
[34245,"PETERSON RD","Central East"]
[60359,"PETERSONS RD","South Rural"]
[40538,"PETREL PL","West"]
[48283,"PETREL PL WWAY","West"]
[34246,"PETRIE PL","South West Urban"]
[10737,"PETRIE RD","North Rural"]
[10738,"PETTET RD","North Rural"]
[52111,"PETTIT PL","South West Urban"]
[52112,"PEVERILL CRES","South West Urban"]
[54562,"PEVERILL CRES EXTN","South West Urban"]
[60631,"PHAR LAP CRES","South West Urban"]
[22879,"PHARLAP DR","North Urban West"]
[40537,"PHELPS PL","West"]
[22928,"PHILADELPHIA PL","North Urban West"]
[20543,"PHILIP PL","North Urban West"]
[52113,"PHILIP ST","South West Urban"]
[40536,"PHILIPS PL","North Urban West"]
[40194,"PHILLIP AVE","West"]
[41212,"PHILLIP AVE EXTN","West"]
[22730,"PHILLIP KEITH RISE","North Urban West"]
[20242,"PHILLIP PDE","North Urban East"]
[60358,"PHILLIP RD","South Rural"]
[71014,"PHILLIP ST","South Rural"]
[22418,"PHILLIPA PL","North Urban East"]
[52114,"PHILLIPS RD (CLEVEDON)","South Rural"]
[10740,"PHILLIPS RD (STREAMLANDS)","North Rural"]
[20079,"PHILOMEL CRES","North Urban East"]
[22419,"PHILSON TCE","North Urban East"]
[22601,"PHILSON TCE LLA (#29 - #31)","North Urban East"]
[22740,"PHOEBE MEIKLE PL","North Urban East"]
[53369,"PHOENICIA CRT","South West Urban"]
[52115,"PHOENIX PL","South West Urban"]
[52116,"PHOTINIA PL","South East Urban"]
[34247,"PHYLLIS ST","Central"]
[52117,"PIAKO ST","South West Urban"]
[54098,"PIAKO ST SERVICE LANE (RP48 RHS)","South West Urban"]
[40535,"PICASSO DR","North Urban West"]
[10741,"PICCADILLY CIRCUS","North Rural"]
[31051,"PICCADILLY PL","Central East"]
[60691,"PICKABERRY AVE","South West Urban"]
[34248,"PICKENS CRES","Central"]
[34249,"PICKETT ST","Central"]
[52118,"PICKWICK PDE","South East Urban"]
[31052,"PICTON ST (GREY LYNN')","Central"]
[52119,"PICTON ST (HOWICK)","South East Urban"]
[52120,"PICTON ST (PAPATOETOE)","South West Urban"]
[54692,"PICTON/WELLINGTON RAB","South East Urban"]
[35662,"PIEMELON BAY RD (PVT)","Hauraki Islands"]
[20187,"PIERCE RD","North Urban East"]
[20729,"PIERMARK DR","North Urban West"]
[15798,"PIGEON MOUNTAIN PRIMARY SCHOOL CYWAY","South East Urban"]
[52122,"PIGEON MOUNTAIN RD","South East Urban"]
[15580,"PIGEON MOUNTAIN RD LINK CYWAY (RP996)","South East Urban"]
[54671,"PIGEON MOUNTAIN RD LLA (#28 - #42)","South East Urban"]
[15644,"PIGEON MOUNTAIN RD/LISA RISE CYWAY","South East Urban"]
[54672,"PIGEON MOUNTAIN/HIMALAYA RAB","South East Urban"]
[10742,"PIGEON PL","North Rural"]
[22706,"PIGEONWOOD PL","North Urban West"]
[40533,"PIHA RD","West"]
[52123,"PIKE PL","South West Urban"]
[35663,"PIKI THOMPSON WAY","South West Urban"]
[52124,"PIKITEA RD","South West Urban"]
[70471,"PILGRIM RD","South Rural"]
[31053,"PILKINGTON RD","Central East"]
[35955,"PILKINGTON RD CARPARK (RP143 LHS)","Central East"]
[31705,"PILKINGTON RD CARPARK (RP150 RHS)","Central East"]
[31587,"PILKINGTON/APIRANA RAB","Central East"]
[31613,"PILKINGTON/PLEASANT VIEW BUS SLIP","Central East"]
[10743,"PILLING RD","North Rural"]
[47066,"PILSDON PL","West"]
[40407,"PILSDON PL HAMMERHEAD","West"]
[40532,"PIMENTO PL","West"]
[23012,"PIN OAK DR","North Urban West"]
[15012,"PIN OAK DR/ABERLEY RD CYWAY","North Urban West"]
[10744,"PINCHGUT RD","North Rural"]
[40531,"PINE AVE","West"]
[15615,"PINE HARBOUR MARINA/PURIRI CYWAY","South Rural"]
[53540,"PINE HARBOUR PDE","South Rural"]
[15616,"PINE HARBOUR PDE/PURIRI RD CYWAY","South Rural"]
[53543,"PINE HARBOUR/KARAKA RAB","South Rural"]
[24004,"PINE HILL CRESENT (PVT)","North Urban East"]
[10745,"PINE RD","North Urban East"]
[20124,"PINE RIDGE RD","North Urban East"]
[34251,"PINE ST (SANDRINGHAM)","Central"]
[40124,"PINE ST (WAITAKERE)","West"]
[52125,"PINE TCE","South East Urban"]
[10747,"PINE VALLEY RD","North Rural"]
[53658,"PINEBROOK LANE","South Rural"]
[11397,"PINECREST DR","North Urban East"]
[40530,"PINEDALE PL","West"]
[48191,"PINEDALE PL WWAY 1","West"]
[48192,"PINEDALE PL WWAY 2","West"]
[52126,"PINEHURST PL","South West Urban"]
[52127,"PINERO PL","South East Urban"]
[10746,"PINETONE RD","North Rural"]
[52128,"PINEWOOD GR","South East Urban"]
[15764,"PINEWOOD GR LINK CYWAY","South East Urban"]
[53923,"PINEWOOD GR-BOTANY RD","South East Urban"]
[31054,"PINEWOOD ST","West"]
[70473,"PINNACLE HILL RD","South Rural"]
[71398,"PINNACLE HILL RD EXT (RP2185 RHS)","South Rural"]
[40529,"PINOT LANE","West"]
[10748,"PINOTAGE PL","North Rural"]
[52862,"PINTNER PL","South East Urban"]
[10749,"PIONEER CRES","North Rural"]
[10750,"PIONEER LANE","North Rural"]
[71443,"PIONEER PL","South Rural"]
[52129,"PIONEER RD","South Rural"]
[40179,"PIONEER ST","West"]
[80404,"PIONEERS RISE","North Urban East"]
[11619,"PIPER LANE","North Rural"]
[53007,"PIPER PL","South West Urban"]
[54334,"PIPER PL SLIP","South West Urban"]
[11461,"PIPI LANE","North Rural"]
[60644,"PIPIPI CRES","South West Urban"]
[40527,"PIPITEA PL","West"]
[48291,"PIPITEA PL WWAY","West"]
[10751,"PIPITIWAI DR","North Rural"]
[41357,"PIPPEN CRT","West"]
[48104,"PIPPEN CRT WWAY","West"]
[31055,"PIRANGI ST","Central East"]
[22420,"PIRIPIRI CRES","North Urban East"]
[47067,"PIRITI DR","West"]
[53066,"PIRITI PL","South West Urban"]
[54381,"PIRITI PL HAMMERHEAD (EAST)","South West Urban"]
[54382,"PIRITI PL HAMMERHEAD (WEST)","South West Urban"]
[40153,"PISCES RD","West"]
[53056,"PISTACHIO PL","South West Urban"]
[31056,"PITCAIRN PL","West"]
[40526,"PITCHER PL","West"]
[35275,"PITFIRE PL","West"]
[52130,"PITLOCHRY PL","South East Urban"]
[53924,"PITLOCHRY PL-MCCAHILL VIEWS","South East Urban"]
[52131,"PITO PL","South West Urban"]
[80410,"PITOITOI DR","North Rural"]
[80544,"PITOITOI DR (EAST)","North Rural"]
[22908,"PITOITOI PL","North Urban West"]
[80338,"PITSAW LANE","North Urban East"]
[52132,"PITT AVE","South West Urban"]
[15718,"PITT AVE LINK CYWAY","South West Urban"]
[60361,"PITT RD (DRURY)","South Rural"]
[71248,"PITT RD (RUNCIMAN)","South Rural"]
[31057,"PITT ST","Central"]
[47291,"PITTVILLE PL","West"]
[48118,"PITTVILLE PL WWAY","West"]
[33000,"PIWAKAWAKA ST","Central"]
[52133,"PIXIE PL","South East Urban"]
[31058,"PLANE ST","West"]
[53508,"PLANTATION AVE","South East Urban"]
[31059,"PLATINA ST","Central East"]
[41434,"PLATINUM RISE","West"]
[34252,"PLAYFAIR RD","Central"]
[34253,"PLAZA DR","Central"]
[52134,"PLEASANT PL","South East Urban"]
[40057,"PLEASANT RD","West"]
[34254,"PLEASANT ST","Central East"]
[34255,"PLEASANT VIEW RD","Central East"]
[47203,"PLEASANT/ATKINSON RAB","West"]
[71446,"PLOUGHMANS AVE","South Rural"]
[31060,"PLUMER ST","Central"]
[52135,"PLUMLEY CRES","South West Urban"]
[34256,"PLUMPTON AVE","Central"]
[35701,"PLUMPTON/WAITE WWAY (RP96 RHS)","Central"]
[47135,"PLUMSTEAD RISE","West"]
[52136,"PLUNKET AVE","South West Urban"]
[54396,"PLUNKET RAB LLA","South West Urban"]
[34257,"PLUNKET RD","Central"]
[54782,"PLUNKET/FALCON RAB","South West Urban"]
[22160,"PLUTO PL","North Urban West"]
[20074,"PLYMOUTH CRES","North Urban East"]
[15005,"PLYMOUTH CRES/MERWOOD LN CYWAY","North Urban East"]
[52137,"PLYMOUTH PL","South West Urban"]
[60647,"POAKA AVE","South West Urban"]
[22161,"POAKA PL","North Urban West"]
[70475,"POAKA RD","South Rural"]
[80436,"POAKA ROAD","North Urban West"]
[80484,"POHUE AVE","North Rural"]
[11253,"POHUTAKAWA AVE AC/WAY 58-210 SH1","North Urban East"]
[11254,"POHUTAKAWA AVE AC/WAY NO 28 - 40","North Urban East"]
[10752,"POHUTUKAWA AVE (RED BEACH)","North Urban East"]
[52138,"POHUTUKAWA AVE (SHELLY PARK)","South East Urban"]
[34261,"POHUTUKAWA AVE (WAIHEKE)","Hauraki Islands"]
[15054,"POHUTUKAWA AVE LINK CYWAY (RP358)","North Urban East"]
[15037,"POHUTUKAWA AVE LINK CYWAY (RP520)","North Urban East"]
[54491,"POHUTUKAWA AVE LLA (#23 - #39)","South East Urban"]
[34258,"POHUTUKAWA DR (PVT)","Central East"]
[80378,"POHUTUKAWA PARADE","North Rural"]
[80411,"POHUTUKAWA PARADE (EAST)","North Rural"]
[34895,"POHUTUKAWA PL (ELLERSLIE)","Central East"]
[34260,"POHUTUKAWA PL (GREAT BARRIER)","Hauraki Islands"]
[60649,"POHUTUKAWA PL (PAPAKURA)","South West Urban"]
[52139,"POHUTUKAWA RD (BEACHLANDS)","South Rural"]
[40525,"POHUTUKAWA RD (WHENUAPAI)","North Urban West"]
[40524,"POINSETTIA PL","West"]
[24098,"POINT RIDGE AVE (PVT)","North Urban West"]
[10753,"POINT ST","North Rural"]
[52140,"POINT VIEW DR","South East Urban"]
[53247,"POINT VIEW LINK","South East Urban"]
[10754,"POINT WELLS RD","North Rural"]
[40523,"POKAPU ST","West"]
[48016,"POKAPU ST WWAY","West"]
[71326,"POKORUA RD","South Rural"]
[20419,"POLAND RD","North Urban West"]
[60189,"POLANDSON PL","South West Urban"]
[52141,"POLARIS PL","South East Urban"]
[80049,"POLARITY RISE","North Urban East"]
[80465,"POLE WAY","North Rural"]
[10755,"POLKINGHORNE DR","North Urban East"]
[11625,"POLLARD LANE","North Rural"]
[31063,"POLLEN ST","Central"]
[70481,"POLLOCK RD","South Rural"]
[70482,"POLLOK WHARF RD","South Rural"]
[52142,"POLO LANE","South Rural"]
[52143,"POLO PRINCE DR (EAST)","South West Urban"]
[54343,"POLO PRINCE DR (WEST)","South West Urban"]
[31064,"POLYGON RD","Central East"]
[40522,"POMARIA RD","West"]
[48193,"POMARIA RD WWAY","West"]
[40521,"POMELO RD","West"]
[10756,"POMONA RD","North Rural"]
[31065,"POMPALLIER TCE","Central"]
[22788,"PONDEROSA DR","North Urban West"]
[70483,"PONGA RD (HUNUA)","South Rural"]
[60360,"PONGA RD (PAPAKURA)","South Rural"]
[80431,"PONGA STREET","North Urban West"]
[71306,"PONO PL","South Rural"]
[70484,"PONSFORD RD","South Rural"]
[31066,"PONSONBY RD","Central"]
[30473,"PONSONBY RD (SOUTHBOUND)","Central"]
[31067,"PONSONBY TCE","Central"]
[22421,"PONUI PL (MAIRANGI BAY)","North Urban East"]
[34262,"PONUI PL (MT WELLINGTON)","Central East"]
[54113,"PONY PARK PL","South Rural"]
[15789,"PONY PARK PL/SHELLY BAY RD CYWAY","South Rural"]
[40519,"POOKS RD","West"]
[48202,"POOKS RD WWAY","West"]
[40739,"POOKS/CANDIA RAB","West"]
[10757,"POOL RD","North Rural"]
[52144,"POOLEY ST","South East Urban"]
[60355,"POPES RD","South West Urban"]
[10758,"POPLAR LANE","North Urban East"]
[10759,"POPLAR RD","North Urban East"]
[60642,"POPOKATEA DR","South West Urban"]
[20263,"PORANA RD","North Urban West"]
[52724,"PORCHESTER RD (MANUREWA)","South West Urban"]
[60190,"PORCHESTER RD (PAPAKURA)","South West Urban"]
[60682,"PORCHESTER RD CARPARK (RP1286 LHS)","South West Urban"]
[60561,"PORCHESTER/AIRFIELD RAB","South West Urban"]
[60562,"PORCHESTER/MANUROA RAB","South West Urban"]
[60563,"PORCHESTER/WALTERS RAB","South West Urban"]
[34263,"PORONUI ST","Central"]
[22162,"PORRITT AVE","North Urban West"]
[10760,"PORT ALBERT RD","North Rural"]
[10761,"PORT ALBERT RD (S.H.1)","North Rural"]
[35592,"PORT LANE (PVT)","Central"]
[52146,"PORTADOWN AVE","South East Urban"]
[53925,"PORTADOWN AVE-USSHER PL","South East Urban"]
[48003,"PORTAGE RD - HARRYBROOK RD #14A WWAY","West"]
[40102,"PORTAGE RD (AVONDALE - WCC)","West"]
[54577,"PORTAGE RD (EAST)","South West Urban"]
[34264,"PORTAGE RD (OTAHUHU)","South West Urban"]
[52147,"PORTAGE RD (WEST)","South West Urban"]
[54578,"PORTAGE RD CARPARK (RP1574 LHS)","South West Urban"]
[54579,"PORTAGE RD EXTN (RP1201 RHS)","South West Urban"]
[48000,"PORTAGE RD WWAY","West"]
[48001,"PORTAGE RD WWAY - HARRYBROOK RD #30 W","West"]
[41321,"PORTAGE/BOLTON RAB","West"]
[40579,"PORTAGE/GODLEY LINK","West"]
[40578,"PORTAGE/GOLF RAB","West"]
[41384,"PORTAGE/KINROSS RAB","West"]
[22422,"PORTAL PL","North Urban East"]
[40518,"PORTER AVE","West"]
[10762,"PORTER CRES","North Rural"]
[52148,"PORTERFIELD RD","South Rural"]
[54449,"PORTERFIELD RD EXTN","South Rural"]
[31069,"PORTERS AVE","Central"]
[80031,"PORTLAND PARK RD","North Urban East"]
[31070,"PORTLAND RD","Central East"]
[34899,"PORTLAND RD LLA (RP610 LHS)","Central East"]
[34265,"PORTMAN RD","Central East"]
[22423,"PORTOBELLO PL","North Urban East"]
[54251,"PORTOFINA PL","South East Urban"]
[60598,"PORTOFINO PT","South West Urban"]
[15671,"PORTOFINO PT LINK CYWAY","South West Urban"]
[22163,"PORTSEA PL","North Urban West"]
[70487,"PORTSMOUTH RD","South Rural"]
[20075,"PORTSMOUTH ST","North Urban East"]
[40517,"POSA AVE","West"]
[48085,"POSA AVE WWAY 1","West"]
[48086,"POSA AVE WWAY 2","West"]
[48087,"POSA AVE WWAY 3","West"]
[52149,"POSEIDON PL","South East Urban"]
[15805,"POSEIDON PL/ENDYMION PL CYWAY","South East Urban"]
[15799,"POSEIDON PL/HALF MOON BAY MARINA CYWAY","South East Urban"]
[15800,"POSEIDON PL/KANIERE PL CYWAY","South East Urban"]
[10763,"POSTMAN RD","North Rural"]
[34839,"POTAI RD","Hauraki Islands"]
[80267,"POTAKA LANE","Central East"]
[80268,"POTAKA LANE PLAZA","Central East"]
[31071,"POTATAU ST","Central"]
[31072,"POTIKI PL","Central East"]
[35885,"POTIKI/LINTAINE WWAY (RP74 END)","Central East"]
[34266,"POTO RD","Hauraki Islands"]
[31073,"POTO ST (REMUERA)","Central East"]
[40516,"POTO ST (WAITAKERE)","West"]
[21070,"POTTER AVE (NORTHCOTE)","North Urban West"]
[34267,"POTTER AVE (OWAIRAKA)","Central"]
[10764,"POTTER RD","North Rural"]
[35706,"POTTER/GALBRAITH WWAY (RP460)","Central"]
[52150,"POTTS RD","South Rural"]
[47249,"POTURI STREAMS","West"]
[47250,"POTURI STREAMS HAMMERHEAD","West"]
[20626,"POUNAMU AVE","North Urban West"]
[52151,"POUNAMU PL","South East Urban"]
[10765,"POUND ST","North Rural"]
[52152,"POUTINI PL","South West Urban"]
[80307,"POWELL LANE","South Rural"]
[40515,"POWELL PL","West"]
[31074,"POWELL ST","West"]
[53553,"POWERCOURT DR","South East Urban"]
[35031,"POWERHOUSE LANE (PVT)","Central"]
[20507,"POWRIE ST","North Urban West"]
[10766,"POYNER RD","North Rural"]
[11376,"POYNTER LANE","North Rural"]
[10767,"POYNTER RD","North Rural"]
[31075,"POYNTON TCE","Central"]
[71501,"PRADO DR","South Rural"]
[52153,"PRANGLEY AVE","South West Urban"]
[31076,"PRATT ST (FREEMANS BAY)","Central"]
[60191,"PRATT ST (PAPAKURA)","South West Urban"]
[70489,"PRATTS RD","South Rural"]
[31077,"PREBBLE PL","Central East"]
[31078,"PREMIER AVE","Central"]
[71378,"PREMILA DR","South Rural"]
[53427,"PREMWOOD RD","South East Urban"]
[34862,"PRENTICE PL (PVT)","Central"]
[34268,"PRESCOTT ST","Central East"]
[60192,"PRESIDENT AVE","South West Urban"]
[20226,"PRESTIGE PL","North Urban East"]
[20081,"PRESTON AVE (DEVONPORT)","North Urban East"]
[34270,"PRESTON AVE (MT ALBERT)","Central"]
[40514,"PRESTON AVE (WAITAKERE)","West"]
[48218,"PRESTON AVE WWAY 1","West"]
[48219,"PRESTON AVE WWAY 2","West"]
[24105,"PRESTON CRT (PVT)","North Urban East"]
[52154,"PRESTON RD","South West Urban"]
[15523,"PRESTON RD LINK CYWAY (RP515)","South West Urban"]
[15522,"PRESTON RD LINK CYWAY(RP697)","South West Urban"]
[15521,"PRESTON RD/IVON RD CYWAY","South West Urban"]
[53927,"PRESTON RD-BIRCH PL","South West Urban"]
[53926,"PRESTON RD-CLUTHA CRES","South West Urban"]
[54413,"PRESTON/BOUNDARY RAB","South West Urban"]
[52155,"PRESTWICK PL","South West Urban"]
[34271,"PRICE CRES","Central East"]
[52156,"PRICES RD","South West Urban"]
[10768,"PRICTOR RD","North Rural"]
[60193,"PRICTOR ST","South West Urban"]
[52157,"PRIESTLEY DR","South East Urban"]
[54657,"PRIESTLEY DR CARPARK (RP289 RHS)","South East Urban"]
[53928,"PRIESTLEY DR-UDALL PL","South East Urban"]
[31079,"PRIME RD","Central"]
[35924,"PRIMES LANE (PVT)","Central East"]
[35270,"PRIMROSE HILL RD (GOAT HILL)","Hauraki Islands"]
[22848,"PRIMROSE LANE","North Urban West"]
[52158,"PRIMROSE PL","South West Urban"]
[52159,"PRINCE REGENT DR","South East Urban"]
[15579,"PRINCE REGENT DR LINK CYWAY (RP702)","South East Urban"]
[15738,"PRINCE REGENT DR/FORTUNES RD CYWAY","South East Urban"]
[34273,"PRINCES AVE","Central"]
[31081,"PRINCES ST (CITY)","Central"]
[21071,"PRINCES ST (NORTHCOTE)","North Urban West"]
[34274,"PRINCES ST (ONEHUNGA)","Central East"]
[34737,"PRINCES ST (OTAHUHU)","South West Urban"]
[71015,"PRINCES ST (PUKEKOHE)","South Rural"]
[10769,"PRINCES ST (RIVERHEAD)","North Rural"]
[71561,"PRINCES ST CARPARK (RP405 RHS)","South Rural"]
[31671,"PRINCES ST EAST (OTAHUHU)","South West Urban"]
[11128,"PRINCES ST EAST (RIVERHEAD)","North Rural"]
[31672,"PRINCES ST EAST LLA (#146 - #142)","South West Urban"]
[71016,"PRINCES ST WEST","South Rural"]
[35735,"PRINCES/KINGS WWAY (RP291 LHS)","Central"]
[31532,"PRINCES/SYMONDS RAMP","Central"]
[41173,"PRINCESS MARIA PL","West"]
[60354,"PRINCESS ST","South West Urban"]
[60671,"PRINCESS ST CARPARK (RP16 LHS)","South West Urban"]
[22673,"PRINCETON PDE","North Urban West"]
[40513,"PRINGLE RD","West"]
[40512,"PRIOR PL","West"]
[52160,"PROCTOR PL","South West Urban"]
[53370,"PROGRESSIVE WAY","South West Urban"]
[26025,"PROMENADE BOAT RAMP CARPARK DP11318","North Urban East"]
[31082,"PROSFORD ST","Central"]
[80012,"PROSPECT TCE (MILLWATER)","North Urban East"]
[34275,"PROSPECT TCE (MT EDEN)","Central"]
[71017,"PROSPECT TCE (PUKEKOHE)","South Rural"]
[20225,"PROSPECT TCE (TAKAPUNA)","North Urban East"]
[34276,"PROSPERO TCE","Central"]
[52161,"PROTEUS PL","South East Urban"]
[47068,"PROVENCE ESP","West"]
[33196,"PROVOST ST","Central"]
[31061,"PT CHEVALIER RD","Central"]
[30758,"PT CHEVALIER RD BUS LOOP (RP101)","Central"]
[31062,"PT ENGLAND RD","Central East"]
[31588,"PT ENGLAND/ELSTREE RAB","Central East"]
[21072,"PUAWAI PL","North Urban West"]
[36077,"PUHI HUIA RD (PVT)","Central"]
[52162,"PUHINUI RD (EAST)","South West Urban"]
[54504,"PUHINUI RD (WEST)","South West Urban"]
[54505,"PUHINUI RD (WEST) EXTN (RP0)","South West Urban"]
[54138,"PUHINUI RD-FREYBERG AVE","South West Urban"]
[11459,"PUHOI CLOSE","North Rural"]
[10770,"PUHOI RD","North Rural"]
[34277,"PUKA ST (MT EDEN)","Central"]
[34278,"PUKA ST (ONEHUNGA)","Central East"]
[52163,"PUKAKI RD","South West Urban"]
[54606,"PUKAKI RD EXTN (RP1750 RHS)","South West Urban"]
[10771,"PUKAPUKA RD","North Rural"]
[22707,"PUKATEA AVE","North Urban West"]
[10772,"PUKE RD","North Rural"]
[33087,"PUKEHANA AVE","Central"]
[34280,"PUKEITI RD","South West Urban"]
[54246,"PUKEKIWIRIKI PL","South East Urban"]
[15545,"PUKEKIWIRIKI PL/TAMAKI STRT RES CYWAY (RP510)","South East Urban"]
[52164,"PUKEKO PL","South West Urban"]
[70490,"PUKEKOHE EAST RD","South Rural"]
[71553,"PUKEKOHE EAST RD/GOLDING RD SLIP","South Rural"]
[34281,"PUKEMIRO ST","Central East"]
[34282,"PUKENUI RD","Central"]
[31084,"PUKEORA AVE","Central East"]
[34283,"PUKEORA RD","South West Urban"]
[35718,"PUKEORA/RONAKI WWAY (RP145 RHS)","South West Urban"]
[70491,"PUKEOWARE RD","South Rural"]
[34284,"PUKERANGI CRES","Central East"]
[60194,"PUKEROA PL","South West Urban"]
[60564,"PUKEROA PL EXTN","South West Urban"]
[40511,"PUKETAHA RD","West"]
[36104,"PUKETAPAPA ST (PVT)","Central"]
[31085,"PUKETEA ST","West"]
[71507,"PUKETI LANE","South Rural"]
[40149,"PUKETITIRO ST","West"]
[15536,"PUKETUTU ISLAND LINK CYWAY","South West Urban"]
[70493,"PUKETUTU RD","South Rural"]
[34863,"PUKETUTU RISE  (PVT)","Central"]
[10773,"PULHAM RD","North Rural"]
[22164,"PULLUM ST","North Urban West"]
[52165,"PULMAN PL","South West Urban"]
[53117,"PUMA DR","South East Urban"]
[31086,"PUNA ST","Central East"]
[35817,"PUNA/TAUTARI WWAY (RP90 LHS)","Central East"]
[40510,"PUNGA RD","North Urban West"]
[34285,"PUNGA ST","Central"]
[71018,"PUNI RD","South Rural"]
[20024,"PUPUKE RD GLENFIELD","North Urban West"]
[52166,"PURATA PL","South West Urban"]
[15533,"PURATA PL LINK CYWAY","South West Urban"]
[36113,"PURCHAS HILL DR","Central East"]
[20128,"PURCHAS RD","North Urban East"]
[52167,"PUREORA PL","South West Urban"]
[31087,"PUREWA RD","Central East"]
[15321,"PUREWA RD/MEADOWBANK RD CYWAY","Central East"]
[36035,"PUREWA/MANAPAU LOOP","Central East"]
[32966,"PURIRI AVE","Central"]
[10774,"PURIRI AVE (LEIGH)","North Rural"]
[10775,"PURIRI AVE 2 (OREWA)","North Urban East"]
[35039,"PURIRI BAY RD","Hauraki Islands"]
[80132,"PURIRI BOULEVARD","North Urban East"]
[34288,"PURIRI DR (PVT)","Central"]
[10776,"PURIRI PL","North Rural"]
[52168,"PURIRI RD (BEACHLANDS)","South Rural"]
[52169,"PURIRI RD (MANUREWA)","South West Urban"]
[71019,"PURIRI RD (PUKEKOHE)","South Rural"]
[34286,"PURIRI RD (WAIHEKE)","Hauraki Islands"]
[40509,"PURIRI RD (WAITAKERE)","North Urban West"]
[10777,"PURIRI ST (HVILLE)","North Rural"]
[40107,"PURIRI ST (NEW LYNN)","West"]
[20175,"PURIRI ST (TAKAPUNA)","North Urban East"]
[52170,"PURLEY PL","South West Urban"]
[31088,"PUROTO ST","Central East"]
[35855,"PUROTO ST WWAY (RP138 RHS)","Central East"]
[52171,"PUSHON PL","South West Urban"]
[34289,"PUTIKI RD","Hauraki Islands"]
[31089,"PUTIKI ST","Central"]
[52172,"PUTINI RD","South West Urban"]
[40508,"PUTNEY PL","West"]
[48203,"PUTNEY PL WWAY","West"]
[52173,"PUTNEY WAY","South West Urban"]
[52174,"PUTTER PL","South East Urban"]
[15633,"PUTTER PL/KENWICK PL CYWAY","South East Urban"]
[60648,"PUWETO AVE","South West Urban"]
[31090,"PYATT CRES","Central East"]
[31091,"PYCROFT PL","Central East"]
[47186,"PYRAMID PL","West"]
[47187,"PYRITE ST","West"]
[34290,"QUADRANT RD","Central East"]
[34892,"QUADRANT RD HLA (#5 - #21)","Central East"]
[20666,"QUAIL DR","North Urban West"]
[10778,"QUAIL RD","North Rural"]
[60362,"QUARRY RD (DRURY)","South Rural"]
[70499,"QUARRY RD (PUKEKOHE)","South Rural"]
[10779,"QUARRY RD (WAITOKI)","North Rural"]
[11517,"QUARTER DECK LANE","North Urban East"]
[53022,"QUARTLEY PL","South East Urban"]
[53162,"QUATTRO AVE","South East Urban"]
[31092,"QUAY ST","Central"]
[31396,"QUAY ST (WESTBOUND)","Central"]
[35960,"QUAY ST EXTN (VIADUCT BASIN)","Central"]
[15302,"QUAY ST/UPPER QUEEN ST CYWAY","Central"]
[20259,"QUEBEC RD","North Urban East"]
[53080,"QUEDLEY CRT","South East Urban"]
[15833,"QUEDLEY CT LINK CYWAY","South East Urban"]
[31094,"QUEEN ELIZABETH SQ","Central"]
[31095,"QUEEN MARY AVE (EPSOM)","Central"]
[40019,"QUEEN MARY AVE (WAITAKERE)","West"]
[41172,"QUEEN NATALIE PL","West"]
[31093,"QUEEN ST (CITY)","Central"]
[21073,"QUEEN ST (ONEWA)","North Urban West"]
[34292,"QUEEN ST (OTAHUHU)","South West Urban"]
[60195,"QUEEN ST (PAPAKURA)","South West Urban"]
[71021,"QUEEN ST (PUKEKOHE)","South Rural"]
[10780,"QUEEN ST (RIVERHEAD)","North Rural"]
[70838,"QUEEN ST (WAIUKU)","South Rural"]
[10781,"QUEEN ST 2 (WARKWORTH)","North Rural"]
[60279,"QUEEN ST SERVICE LANE (RP201 LHS)","South West Urban"]
[22515,"QUEEN ST UPPER","North Urban West"]
[11127,"QUEEN ST WEST (RIVERHEAD)","North Rural"]
[71253,"QUEEN/HARRIS RAB","South Rural"]
[71418,"QUEEN/NELSON RAB","South Rural"]
[71254,"QUEEN/WESLEY RAB","South Rural"]
[34293,"QUEENS AVE","Central"]
[34294,"QUEENS DR","Hauraki Islands"]
[20752,"QUEENS PDE","North Urban East"]
[34295,"QUEENS RD","Central East"]
[31600,"QUEENS RD (WESTBOUND)","Central East"]
[35913,"QUEENS/HEKERUA BAY WWAY (RP812)","Hauraki Islands"]
[31601,"QUEENS/KINGS RAB","Central East"]
[34296,"QUEENSTOWN RD","Central"]
[15318,"QUEENSTOWN RD/ORPHEUS DR CYWAY","Central East"]
[31661,"QUEENSTOWN/BEACHCROFT BUS SLIP","Central"]
[35834,"QUEENSTOWN/BEACHCROFT RAB","Central"]
[31629,"QUEENSTOWN/HENDRY RAB","Central"]
[34864,"QUEENSWAY","Central"]
[34299,"QUELCH RD","Hauraki Islands"]
[52177,"QUENNELL AVE","South West Urban"]
[34300,"QUENTIN AVE","Central"]
[34301,"QUEST TCE","Central"]
[52178,"QUIBRAY PL","South East Urban"]
[11600,"QUIET RISE","North Rural"]
[40507,"QUIET ST","West"]
[15126,"QUIET ST LINK CYWAY","West"]
[40506,"QUINCEY PL","West"]
[70500,"QUINN RD","South Rural"]
[52179,"QUINNS RD (CLEVEDON)","South Rural"]
[40505,"QUINNS RD (WAIATARUA)","West"]
[52180,"QUINTAL PL","South West Urban"]
[10782,"QUINTAL RD","North Rural"]
[10783,"QUO VADIS PL","North Urban East"]
[34302,"QUONA AVE","Central"]
[52181,"RA ORA DR","South East Urban"]
[11504,"RAABIA CLOSE","North Rural"]
[40181,"RABONE ST","West"]
[31096,"RACECOURSE PDE","West"]
[70843,"RACECOURSE RD","South Rural"]
[52182,"RACHAEL PL","South East Urban"]
[10784,"RADCLIFFE RD","North Rural"]
[31097,"RADCLIFFE ST","Central East"]
[52183,"RADDOCK PL","South East Urban"]
[15737,"RADDOCK PL LINK CYWAY","South East Urban"]
[53931,"RADDOCK PL-PIGEON MOUNTAIN RD","South East Urban"]
[22168,"RADIATA LANE","North Urban West"]
[34303,"RADNOR RD","Central"]
[20212,"RAE RD","North Urban East"]
[20278,"RAEBEN AVE","North Urban West"]
[40504,"RAELENE PL","West"]
[34304,"RAETIHI CRES","Central"]
[52184,"RAEWYN PL","South East Urban"]
[52185,"RAGLAN ST","South West Urban"]
[54178,"RAGLAN ST CARPARK (RP591 RHS)","South West Urban"]
[54143,"RAGLAN ST SERVICE LANE (RP585 RHS)","South West Urban"]
[53932,"RAGLAN ST-HOKIANGA ST","South West Urban"]
[40503,"RAGLEY ST","West"]
[48012,"RAGLEY ST WWAY","West"]
[48013,"RAGLEY ST WWAY - TITIRANGI RD WWAY","West"]
[31098,"RAHIRI RD","Central"]
[20205,"RAHOPARA ST","North Urban East"]
[26099,"RAHOTU WAY","North Urban West"]
[20617,"RAHUI RD","North Urban West"]
[10786,"RAHUIKIRI RD","North Rural"]
[40180,"RAILSIDE AVE","West"]
[40863,"RAILSIDE/VIEW RAB","West"]
[35593,"RAILWAY AVE (PVT)","Central"]
[34738,"RAILWAY LANE","South West Urban"]
[34305,"RAILWAY ST","Central"]
[11137,"RAILWAY ST (SH16 HVILLE)","North Rural"]
[60567,"RAILWAY ST WEST (ALBERT-END)","South West Urban"]
[60197,"RAILWAY ST WEST (BROADWAY- ONSLOW)","South West Urban"]
[60565,"RAILWAY ST WEST (ONSLOW-END)","South West Urban"]
[52186,"RAINBOW PL","South West Urban"]
[53933,"RAINBOW PL-COXHEAD RD","South West Urban"]
[20311,"RAINES AVE","North Urban East"]
[34306,"RAINFORD ST","Central"]
[15305,"RAINFORD ST LINK CYWAY","Central"]
[34957,"RAJAN PL (PVT)","Central"]
[52187,"RAKAIA RISE","South East Urban"]
[53934,"RAKAIA RISE-LYELL CRT","South East Urban"]
[53935,"RAKAIA RISE-SANTA MONICA PL","South East Urban"]
[31099,"RAKAU ST","Central East"]
[11417,"RAKAU VIEWS","North Urban East"]
[40502,"RAKICH PL","West"]
[41081,"RAKICH RAB","West"]
[10787,"RAKINO AVE","North Urban East"]
[34307,"RAKINO WAY","Central East"]
[52188,"RAKO PL","South West Urban"]
[52189,"RALEIGH PL","South West Urban"]
[21074,"RALEIGH RD","North Urban West"]
[34308,"RALEIGH ST","Central"]
[20743,"RALPH EAGLES PL","North Urban East"]
[80602,"RALPH PL","South East Urban"]
[31100,"RAMA RD","Central"]
[60363,"RAMARAMA RD (DRURY)","South Rural"]
[70501,"RAMARAMA RD (RAMARAMA)","South Rural"]
[60539,"RAMARAMA/QUARRY RAB","South Rural"]
[22169,"RAMBLER CRES","North Urban West"]
[20605,"RAME RD","North Urban West"]
[34309,"RAMELTON RD","Central"]
[71512,"RAMESH PL","South Rural"]
[20427,"RAMILLIES PL","North Urban West"]
[52946,"RAMOANA MEWS","South East Urban"]
[20578,"RAMONDA PL","North Urban West"]
[20682,"RAMP RD","North Urban East"]
[52190,"RAMSEY ST","South West Urban"]
[34310,"RAMSGATE ST","Central East"]
[35937,"RAMSGATE ST CARPARK (RP33 RHS)","Central East"]
[22425,"RAMSGATE TCE","North Urban East"]
[53583,"RAMWALL PL","South West Urban"]
[22170,"RANCH AVE","North Urban West"]
[71360,"RANCH PL","South Rural"]
[70026,"RANCH PL LOOP","South Rural"]
[71511,"RANCHOD TCE","South Rural"]
[20474,"RANDAL PL","North Urban West"]
[31101,"RANDOLPH ST","Central"]
[52810,"RANDWICK PL","South West Urban"]
[54764,"RANFURLY RD (ALFRISTON) (SR)","South Rural"]
[31102,"RANFURLY RD (EPSOM)","Central"]
[52192,"RANFURLY RD (MANUREWA) (SW)","South West Urban"]
[52191,"RANFURLY RD (PAPATOETOE)","South West Urban"]
[31103,"RANFURLY RD (WEST)","Central"]
[52193,"RANGATAUA PL","South West Urban"]
[22171,"RANGATIRA RD","North Urban West"]
[11365,"RANGE CRT","North Urban East"]
[40501,"RANGE RD","West"]
[34311,"RANGE VIEW RD","Central"]
[35732,"RANGE VIEW/STEWART WWAY (RP274)","Central"]
[52194,"RANGER PL","South West Urban"]
[47357,"RANGEVIEW PARK N RIDE","West"]
[40500,"RANGEVIEW RD","West"]
[22959,"RANGI AVE (MARANGI WAY)","North Urban West"]
[11488,"RANGI RD (JAMIESON BAY)","North Rural"]
[60366,"RANGI RD (TAKANINI)","South West Urban"]
[31104,"RANGIATEA RD","Central"]
[10788,"RANGIMAARIE CRES","North Rural"]
[40499,"RANGIMARIE RD","West"]
[34312,"RANGIORA RD","Central East"]
[34313,"RANGIPAWA RD","Central East"]
[34314,"RANGITANE PL","Central"]
[34315,"RANGITATA PL","Central"]
[34316,"RANGITIKI CRES","Central"]
[20171,"RANGITIRA AVE","North Urban East"]
[10789,"RANGITOPUNI RD","North Rural"]
[31105,"RANGITOTO AVE","Central East"]
[52195,"RANGITOTO RD","South West Urban"]
[15466,"RANGITOTO RD/ERIC BAKER PL CYWAY","South West Urban"]
[20214,"RANGITOTO TCE","North Urban East"]
[52196,"RANGITOTO VIEW RD","South East Urban"]
[54511,"RANGITOTO/OMAGH RAB","South West Urban"]
[35763,"RANGITOTO/UPLAND WWAY (RP390)","Central East"]
[40498,"RANGIWAI RD","West"]
[41181,"RANGIWAI RD LOOP","West"]
[70882,"RANGIWHEA RD","South Rural"]
[34317,"RANIER ST","Central East"]
[80136,"RANKIN AVE","West"]
[80140,"RANKIN AVE SERVICE LANE","West"]
[34319,"RANLEIGH RD","Central"]
[52725,"RANSOM SMYTH DR","South West Urban"]
[54373,"RANSOM SMYTH DR SLIP","South West Urban"]
[53936,"RANSOM SMYTH DR-EWHURST PL","South West Urban"]
[54374,"RANSOM SMYTH/BOUGAINVILLAEA RAB","South West Urban"]
[40497,"RANUI AVE","West"]
[31106,"RANUI RD","Central East"]
[47219,"RANUI SCHOOL RD","West"]
[40496,"RANUI STATION RD","West"]
[52198,"RANUM RD","South West Urban"]
[40495,"RAPAKI PL","West"]
[52199,"RAPALLO PL","South East Urban"]
[15573,"RAPALLO PL LINK CYWAY","South East Urban"]
[40494,"RAPHAEL PL","North Urban West"]
[34320,"RAPHOE PL","Central East"]
[53438,"RAPHOE RD","South East Urban"]
[52200,"RAPLEY PL","South West Urban"]
[10790,"RAPSON ACCESS RD","North Rural"]
[10791,"RAPSON RD (KAUKAPAKAPA)","North Rural"]
[52201,"RAPSON RD (OTARA)","South West Urban"]
[52202,"RARAHU PL","South West Urban"]
[80435,"RARAHU ROAD","North Urban West"]
[31107,"RARANGI RD","Central East"]
[34321,"RARAWA ST","Central"]
[20146,"RARERE RD","North Urban East"]
[40493,"RAROA TCE","West"]
[71022,"RATA PL","South Rural"]
[22051,"RATA RD (DEVONPORT)","North Urban East"]
[10792,"RATA RD (STANMORE BAY)","North Urban East"]
[40492,"RATA RD (WAITAKERE)","North Urban West"]
[15049,"RATA RD LINK CYWAY","North Urban East"]
[15023,"RATA RD/PALMGREEN CT CYWAY","North Urban East"]
[15058,"RATA RESERVE CARPARK NTH LINK CYWAY","North Urban East"]
[15057,"RATA RESERVE CARPARK STH LINK CYWAY","North Urban East"]
[11138,"RATA ST (HELENSVILLE)","North Rural"]
[47233,"RATA ST (NORTHBOUND)","West"]
[47235,"RATA ST (SOUTHBOUND)","West"]
[34322,"RATA ST (WAIHEKE)","Hauraki Islands"]
[70875,"RATA ST (WAIUKU)","South Rural"]
[52203,"RATA VINE DR","South West Urban"]
[54303,"RATA VINE/LAURELIA RAB","South West Urban"]
[40490,"RATANUI ST","West"]
[40489,"RATHGAR RD","West"]
[48200,"RATHGAR RD WWAY","West"]
[31108,"RATHLIN ST","West"]
[53072,"RATHMAR DR","South West Urban"]
[22752,"RATHMULLEN PL","North Urban West"]
[20596,"RATTRAY ST","North Urban East"]
[20802,"RATTRAY ST SERVICE LANE","North Urban East"]
[10793,"RAUHORI RD","North Rural"]
[40488,"RAUHUIA CRES","West"]
[70886,"RAUKAWA GR","South Rural"]
[35594,"RAUKURA LANE (PVT)","Central East"]
[31109,"RAUMATI RD","Central East"]
[10794,"RAUNER RD","North Rural"]
[21075,"RAUPAPA ST","North Urban West"]
[80668,"RAUPO DR","West"]
[60634,"RAUPO ST","South West Urban"]
[34323,"RAURENGA AVE","Central East"]
[34324,"RAUTANGI RD","Central"]
[31110,"RAUTARA ST","Central East"]
[35815,"RAUTARA/COATES WWAY (RP177 LHS)","Central East"]
[52204,"RAUTAWA PL","South Rural"]
[10795,"RAUTAWHIRI RD","North Rural"]
[54254,"RAVELLO RISE","South East Urban"]
[34325,"RAVEN AVE","Central"]
[52205,"RAVENNA WAY","South West Urban"]
[52860,"RAVENSDALE RISE","South East Urban"]
[22172,"RAVENSTONE PL","North Urban West"]
[20237,"RAVENWOOD DR","North Urban East"]
[24024,"RAVINE LANE (PVT)","North Urban West"]
[31111,"RAWALPINDI ST","Central"]
[35769,"RAWALPINDI/TASMAN WWAY (RP47)","Central"]
[31112,"RAWENE AVE","Central"]
[22173,"RAWENE RD","North Urban West"]
[26046,"RAWENE RD CARPARK DP 2922","North Urban West"]
[26041,"RAWENE RD CARPARK DP 415","North Urban West"]
[26054,"RAWENE RD MEDICAL CENTRE CARPARK","North Urban West"]
[10796,"RAWHITI PL","North Rural"]
[10797,"RAWHITI RD (MANLY)","North Urban East"]
[34326,"RAWHITI RD (ONEHUNGA)","Central East"]
[31113,"RAWHITIROA RD","Central East"]
[60442,"RAWSON WAY","South West Urban"]
[52206,"RAY EMERY DR (AIRPORT)","South West Urban"]
[60198,"RAY SMALL DR","South West Urban"]
[70505,"RAY WRIGHT RD","South Rural"]
[34327,"RAYMA PL","Central East"]
[52207,"RAYMOND RD","South West Urban"]
[31114,"RAYMOND ST","Central"]
[20560,"RAYMOND TCE","North Urban West"]
[40487,"RAYNER RD","West"]
[70506,"RAZORBACK RD","South Rural"]
[52208,"REAGAN RD","South West Urban"]
[52923,"REAGAN RD LLA (#26 - #32)","South West Urban"]
[52922,"REAGAN RD LLA (#33 - #39)","South West Urban"]
[52925,"REAGAN RD LLA (#34 - #52)","South West Urban"]
[40486,"REALM PL","West"]
[10798,"REAY RD","North Rural"]
[52209,"REBECCA RISE","South West Urban"]
[34956,"REBECCA RISE (PVT)","Central"]
[24115,"RECREATION DR (PVT)","North Urban West"]
[71517,"RED BARN LANE","South Rural"]
[10799,"RED BEACH RD","North Urban East"]
[22426,"RED BLUFF RD","North Urban East"]
[11447,"RED HIBISCUS RD","North Urban East"]
[15048,"RED HIBISCUS RD LINK CYWAY","North Urban East"]
[60199,"RED HILL RD","South West Urban"]
[10800,"RED HILL RD (TE ARAI)","North Rural"]
[40485,"RED HILLS RD","West"]
[10435,"RED HILLS RD 2 (TAUPAKI)","West"]
[22917,"RED OAK PL","North Urban West"]
[22808,"RED SHED LANE","North Urban West"]
[53241,"REDCASTLE DR","South East Urban"]
[53938,"REDCASTLE DR-GRANSNA LANE","South East Urban"]
[53359,"REDCASTLE RAB","South East Urban"]
[53357,"REDCASTLE/SHRULE RAB","South East Urban"]
[53358,"REDCASTLE/SNAVE RAB","South East Urban"]
[52210,"REDCOAT PL","South East Urban"]
[60200,"REDCREST AVE","South West Urban"]
[22616,"REDFERN LANE","North Urban West"]
[60369,"REDING ST","South West Urban"]
[40484,"REDLANDS GR","West"]
[70507,"REDMAN RD","South Rural"]
[31115,"REDMOND ST","Central"]
[35945,"REDMOND ST CARPARK (RP73 RHS)","Central"]
[60201,"REDMOUNT PL","South West Urban"]
[54794,"REDOUBT RD (MANUKAU HEIGHTS) (SE)","South East Urban"]
[52211,"REDOUBT RD (MANUKAU) (SW)","South West Urban"]
[54495,"REDOUBT RD (WESTBOUND) (SW)","South West Urban"]
[15563,"REDOUBT RD/MARWAN CRES CYWAY (RP2324)","South West Urban"]
[15555,"REDOUBT RD/MARWAN CRES STH - NTH LOOP CYWAY","South West Urban"]
[11626,"REDVALE RISE","North Urban East"]
[22427,"REDWING ST","North Urban East"]
[40483,"REDWOOD DR","West"]
[70508,"REED RD","South Rural"]
[53494,"REEF PL","South West Urban"]
[53560,"REEFTON PL","South East Urban"]
[52212,"REELICK AVE","South East Urban"]
[52213,"REEVES AVE","South West Urban"]
[52214,"REEVES RD","South East Urban"]
[54713,"REEVES RD CARPARK (RP1792 LHS)","South East Urban"]
[54714,"REEVES/UDYS RAB","South East Urban"]
[40482,"REFLECTION DR","North Urban West"]
[70509,"REG BENNETT RD","South Rural"]
[52998,"REG SAVORY PL","South East Urban"]
[20306,"REGAL PL","North Urban East"]
[53201,"REGALWOOD PL","South West Urban"]
[22428,"REGATTA RD","North Urban East"]
[24080,"REGENCY LANE - MAYFAIR DR (PVT)","North Urban East"]
[24044,"REGENCY LANE (ROSEDALE) (PVT)","North Urban West"]
[11358,"REGENCY PARK DR","North Urban East"]
[20343,"REGENCY PL","North Urban East"]
[24094,"REGENT LANE (PVT)","North Urban East"]
[22221,"REGENT ST (DEVONPORT)","North Urban East"]
[52215,"REGENT ST (PAPATOETOE)","South West Urban"]
[47002,"REGENTS PARK PL","West"]
[52216,"REGIA CLOSE","South East Urban"]
[54679,"REGIA CLOSE HAMMERHEAD","South East Urban"]
[31116,"REGINA ST","Central"]
[15211,"REGINA ST LINK CYWAY","Central"]
[53373,"REGIS LANE","South East Urban"]
[80573,"REGIS PARK DR","South Rural"]
[40481,"REHIA RD","West"]
[53670,"REHUA PL","South West Urban"]
[53939,"REHUA PL-WALMSLEY RD","South West Urban"]
[70511,"REID RD (GLENBROOK)","South Rural"]
[40119,"REID RD (WAITAKERE)","West"]
[11409,"REID UNDERPASS","North Rural"]
[71023,"REIDY PL","South Rural"]
[31117,"REIHANA ST","Central East"]
[35847,"REIHANA/KUPE WWAY (RP234 RHS)","Central East"]
[35848,"REIHANA/TAUTARI WWAY (RP119 LHS)","Central East"]
[35826,"REIHANA/TAUTARI WWAY (RP623 LHS)","Central East"]
[40074,"REIMAN ST","West"]
[34328,"REIMERS AVE","Central"]
[40480,"REINGA PL","West"]
[53564,"REINHEIMER PL","South East Urban"]
[60583,"REINS RD","South West Urban"]
[36111,"REIPAE ST","Central East"]
[34329,"RELIABLE WAY","Central East"]
[54553,"RELIANCE CRES","South Rural"]
[11290,"RELIANCE WAY","North Rural"]
[22429,"RELKO CRES","North Urban East"]
[80623,"REMANA CRES","North Rural"]
[60202,"REMBRANDT PL","South West Urban"]
[10802,"REMIGER RD","North Rural"]
[20627,"REMU PL","North Urban West"]
[31118,"REMUERA RD (CWC)","Central"]
[80316,"REMUERA RD (CWCE)","Central East"]
[35934,"REMUERA RD CARPARK (RP3538 RHS)","Central East"]
[33136,"REMUERA RD HLA (#754 - #774)","Central East"]
[80327,"REMUREMU ST","North Urban East"]
[20368,"REMUS PL","North Urban West"]
[40479,"RENA PL","West"]
[31119,"RENALL ST","Central"]
[40478,"RENATA CRES","West"]
[31120,"RENDALL PL","Central"]
[34330,"RENDCOMB PL","Central"]
[52217,"RENE PL","South East Urban"]
[34331,"RENFREW AVE","Central"]
[53287,"RENLEE PL","South East Urban"]
[54689,"RENLEE PL HAMMERHEAD","South East Urban"]
[52218,"RENNIE DR","South West Urban"]
[54812,"RENO WAY","South East Urban"]
[54906,"RENO WAY-STANCOMBE RD","South East Urban"]
[40477,"RENOIR ST","North Urban West"]
[15121,"RENOIR ST EAST LINK CYWAY","North Urban West"]
[15115,"RENOIR ST WEST LINK CYWAY","North Urban West"]
[34332,"RENOWN AVE","Central"]
[52219,"RENTON RD (MANGERE)","South West Urban"]
[34333,"RENTON RD (MT ALBERT)","Central"]
[52891,"RENWAY RISE","South East Urban"]
[60203,"RENWICK ST","South West Urban"]
[53064,"REREMANU PL","South West Urban"]
[40476,"REREWAI PL","West"]
[48062,"REREWAI PL WWAY","West"]
[52220,"RESEDA PL","South West Urban"]
[60204,"RESOLUTE WAY","South West Urban"]
[53526,"RETREAT DR","South West Urban"]
[34334,"REVEL AVE","Central"]
[35698,"REVEL/MCGREGOR WWAY (RP208 RHS)","Central"]
[71024,"REVELL CRT","South Rural"]
[40475,"REVERIE PL","West"]
[52221,"REWA RD (MARAETAI)","South Rural"]
[34335,"REWA RD (THREE KINGS)","Central"]
[54523,"REWA RD HLA (#38 - #50)","South Rural"]
[40133,"REWA ST","West"]
[51386,"REWARD PL","South West Urban"]
[40474,"REWAREWA RD (WAITAKERE)","West"]
[70515,"REWAREWA RD (WAIUKU)","South Rural"]
[34336,"REWI RD","Central"]
[22430,"REWI ST","North Urban East"]
[20138,"REWITI AVE","North Urban East"]
[31121,"REWITI ST","Central East"]
[52222,"REX LANE","South West Urban"]
[41182,"REYBERT PL","West"]
[52223,"REYDON PL","South East Urban"]
[53017,"REYLAND CLOSE","South West Urban"]
[60367,"REYNARD TCE","South West Urban"]
[60568,"REYNARD TCE HAMMERHEAD","South West Urban"]
[15405,"REYNARD TCE/ESPLANADE LINK CYWAY","South West Urban"]
[15756,"REYNARD TCE/GARDONETCE CYWAY","South West Urban"]
[40473,"REYNELLA DR","West"]
[47204,"REYNELLA/BROADFIELD RAB","West"]
[47205,"REYNELLA/GALLONY RAB","West"]
[22431,"REYNOLDS PL (LINK)","North Urban East"]
[22432,"REYNOLDS PL HAMMERHEAD","North Urban East"]
[71025,"REYNOLDS RD","South Rural"]
[10803,"RHEINGOLD PL","North Rural"]
[52224,"RHINE PL","South West Urban"]
[40472,"RHINEVALE CLOSE","West"]
[48090,"RHINEVALE CLOSE WWAY 1","West"]
[48091,"RHINEVALE CLOSE WWAY 2","West"]
[34337,"RHODES AVE","Central"]
[60205,"RHONDA PL","South West Urban"]
[47069,"RHONE AVE","West"]
[31122,"RHYDE ST","Central"]
[53471,"RIALTO CRT (EASTBOUND)","South East Urban"]
[53581,"RIALTO CRT (WESTBOUND)","South East Urban"]
[40471,"RIBBLESDALE RD","West"]
[52889,"RIBBONWOOD CRES","South West Urban"]
[52225,"RIBOT PL","South West Urban"]
[53502,"RICARDO CRT","South West Urban"]
[35255,"RICCARTON WAY (PVT)","Central East"]
[60206,"RICE CRES","South West Urban"]
[52226,"RICHARD AVE","South East Urban"]
[31124,"RICHARD FARRELL AVE","Central East"]
[53635,"RICHARD HALSE DR","South West Urban"]
[22971,"RICHARD HILL CLOSE","North Urban West"]
[52227,"RICHARD PEARSE DR","South West Urban"]
[52228,"RICHARD RD","South West Urban"]
[31123,"RICHARD ST","Central"]
[52229,"RICHARDS AVE (PAPATOETOE)","South West Urban"]
[20238,"RICHARDS AVE (TAKAPUNA)","North Urban East"]
[54045,"RICHARDS AVE-ACCESSWAY","South West Urban"]
[10804,"RICHARDS RD","North Rural"]
[71026,"RICHARDSON AVE","South Rural"]
[21076,"RICHARDSON PL","North Urban West"]
[52230,"RICHARDSON RD (MANUREWA)","South Rural"]
[36041,"RICHARDSON RD (MT ROSKILL)","Central"]
[31125,"RICHARDSON RD (OWAIRAKA)","Central"]
[35932,"RICHARDSON RD CARPARK (RP4313 LHS)","Central"]
[33137,"RICHARDSON RD HLA (#175 - #195)","Central"]
[15295,"RICHARDSON RD/KEITH HAY PARK LINK CYWAY","Central"]
[36087,"RICHARDSON/ERNIE PINCHES CYWAY","Central"]
[35694,"RICHARDSON/SANFT WWAY (RP3920)","Central"]
[35699,"RICHARDSON/VERCOE WWAY (RP3604)","Central"]
[34338,"RICHBOURNE ST","Central"]
[15314,"RICHBOURNE ST/MOTORWAY LINK CYWAY","Central"]
[45001,"RICHFIELD CRES","West"]
[21077,"RICHMOND AVE","North Urban West"]
[31126,"RICHMOND RD","Central"]
[40131,"RICKARDS PL","West"]
[48056,"RICKARDS PL WWAY","West"]
[31127,"RIDDELL RD","Central East"]
[31571,"RIDDELL RD HLA (#261 - #271)","Central East"]
[31572,"RIDDELL RD HLA (#296 - #322)","Central East"]
[31573,"RIDDELL RD HLA (#587 - #613)","Central East"]
[33138,"RIDDELL RD LLA (#110 - #130)","Central East"]
[31575,"RIDDELL RD LLA (#444 - #488)","Central East"]
[31574,"RIDDELL RD LLA (ABINGDON - #412)","Central East"]
[35823,"RIDDELL/SHORELINE ACCESS (RP2711)","Central East"]
[20718,"RIDE WAY","North Urban West"]
[80445,"RIDGE RD (ALBANY) (RURAL)","North Rural"]
[20641,"RIDGE RD (ALBANY) (WEST)","North Urban West"]
[52231,"RIDGE RD (HOWICK)","South East Urban"]
[10806,"RIDGE RD (MAHURANGI EAST)","North Rural"]
[10805,"RIDGE RD (PAREMOREMO)","North Rural"]
[22434,"RIDGE RD (WAIAKE)","North Urban East"]
[34339,"RIDGE RD (WAIHEKE ISLAND)","Hauraki Islands"]
[22945,"RIDGE VALLEY DR","North Urban East"]
[71514,"RIDGE VIEW CRES","South Rural"]
[80264,"RIDGEDALE RD","North Urban East"]
[53118,"RIDGEFIELD LANE","South East Urban"]
[70518,"RIDGELEY RD","South Rural"]
[52232,"RIDGEMOUNT RISE","South West Urban"]
[54642,"RIDGEMOUNT RISE EXTN","South West Urban"]
[31128,"RIDGEWAY PL","Central East"]
[71027,"RIDGEWAY RD","South Rural"]
[71366,"RIDGEWAY RD EXTN","South Rural"]
[20527,"RIDGEWOOD CRES","North Urban West"]
[31129,"RIDINGS RD","Central East"]
[53163,"RIECHELMANN CRT","South East Urban"]
[34340,"RIELLY PL","Central East"]
[54793,"RIENZO DR","South East Urban"]
[40470,"RIESLING PL","West"]
[70519,"RIFLE RANGE RD","South Rural"]
[20723,"RIFLEMAN RISE","North Urban West"]
[31130,"RIKI RD","Central East"]
[60368,"RIKSHA PL","South West Urban"]
[52233,"RIMINI PL","South West Urban"]
[10807,"RIMMER RD","North Rural"]
[52234,"RIMU RD (MANGERE)","South West Urban"]
[52235,"RIMU RD (MANUREWA)","South West Urban"]
[10808,"RIMU RD (STANMORE BAY)","North Urban East"]
[40469,"RIMU RD (WAITAKERE)","West"]
[11280,"RIMU RD 24 - 32","North Urban East"]
[54148,"RIMU RD SERVICE LANE (RP34 RHS)","South West Urban"]
[54161,"RIMU RD SERVICE LANE CARPARK (RP12)","South West Urban"]
[22611,"RIMU RISE","North Urban West"]
[11139,"RIMU ST (HELENSVILLE)","North Rural"]
[40134,"RIMU ST (NEW LYNN)","West"]
[40468,"RIMUTAKA PL","West"]
[31131,"RING TCE","Central"]
[35771,"RING TCE WWAY (RP102 LHS)","Central"]
[22435,"RINGWOOD ST","North Urban East"]
[80724,"RIPEKA LANE","North Urban West"]
[53103,"RIPLINGTON RD","South East Urban"]
[54535,"RIPLINGTON RD HAMMERHEAD","South East Urban"]
[31132,"RIPON CRES","Central East"]
[71523,"RIPPLE GR","South Rural"]
[60207,"RIPPLESIDE PL","South West Urban"]
[52236,"RIRINO PL (MANUREWA)","South West Urban"]
[41247,"RIRINO PL (PVT)","North Urban West"]
[31133,"RIRO ST","Central"]
[40203,"RISERRA DR","West"]
[10809,"RISHWORTH AVE","North Urban East"]
[22877,"RISING PDE","North Urban West"]
[31134,"RISK RD","Central East"]
[47356,"RISSINGTON AVE","West"]
[11373,"RITA WAY","North Rural"]
[60578,"RITCHIE CRES","South West Urban"]
[52237,"RITO PL","South West Urban"]
[10810,"RIVENDELL PL","North Rural"]
[71272,"RIVER LANE","South Rural"]
[10811,"RIVER RD (RED BEACH)","North Urban East"]
[40467,"RIVER RD (WAITAKERE)","West"]
[31135,"RIVER TCE (PVT)","Central"]
[40121,"RIVERBANK RD (WAITAKERE)","West"]
[11382,"RIVERDALE GR","North Urban East"]
[11453,"RIVERGLADE LANE","North Rural"]
[47344,"RIVERGLADE PARKWAY","West"]
[80222,"RIVERHAVEN DR - RD 1","North Urban East"]
[80223,"RIVERHAVEN DR - RD 2","North Urban East"]
[80482,"RIVERHEAD POINT DR","North Rural"]
[10812,"RIVERHEAD RD","North Rural"]
[52238,"RIVERHILLS AVE","South East Urban"]
[52239,"RIVERINA AVE","South East Urban"]
[10813,"RIVERLAND RD","North Rural"]
[52240,"RIVERLEA AVE","South East Urban"]
[15625,"RIVERLEA AVE LINK CYWAY (RP216)","South East Urban"]
[15627,"RIVERLEA AVE LINK CYWAY (RP335)","South East Urban"]
[53941,"RIVERLEA AVE-BROWNS AVE","South East Urban"]
[40466,"RIVERLEA RD","North Urban West"]
[11620,"RIVERLEIGH DR","North Rural"]
[40465,"RIVERPARK CRES","West"]
[31136,"RIVERSDALE RD","West"]
[31137,"RIVERSIDE AVE","Central East"]
[10814,"RIVERSIDE DR (POINT WELLS)","North Rural"]
[70873,"RIVERSIDE DR (WAIUKU)","South Rural"]
[10815,"RIVERSIDE RD","North Urban East"]
[71413,"RIVERSIDE/MANDALAY RAB","South Rural"]
[47190,"RIVERSTONE RD","West"]
[48186,"RIVERSTONE RD WWAY","West"]
[52241,"RIVERTON DR","South West Urban"]
[54337,"RIVERTON/MAGIC RAB","South West Urban"]
[34341,"RIVERVIEW RD (PANMURE)","Central East"]
[40142,"RIVERVIEW RD (WAITAKERE)","West"]
[54191,"RIVIERA DR","South East Urban"]
[20118,"RIVIERA PL","North Urban East"]
[60615,"RIVOLI PL","South West Urban"]
[10816,"RIX RD","North Rural"]
[40464,"RIXON PL","West"]
[52242,"ROADLEY AVE","South East Urban"]
[22837,"ROANOKE WAY","North Urban West"]
[20418,"ROBAND AVE","North Urban West"]
[60208,"ROBB ST","South West Urban"]
[60664,"ROBB ST CARPARK (RP14 RHS)","South West Urban"]
[52243,"ROBBIES RD","South East Urban"]
[52244,"ROBERT ALLAN WAY","South East Urban"]
[40463,"ROBERT BURKE PL","West"]
[48169,"ROBERT BURKE PL WWAY","West"]
[31139,"ROBERT HALL AVE","Central East"]
[11545,"ROBERT MIGHT RD","North Rural"]
[52245,"ROBERT ROSS PL","South West Urban"]
[35990,"ROBERT SALE RISE","Central East"]
[52246,"ROBERT SKELTON PL","South West Urban"]
[54378,"ROBERT SKELTON RAB","South West Urban"]
[34342,"ROBERT ST (ELLERSLIE)","Central East"]
[10818,"ROBERT ST (MAHURANGI EAST)","North Rural"]
[35936,"ROBERT ST CARPARK (RP61 RHS)","Central East"]
[31138,"ROBERTA AVE","Central East"]
[31569,"ROBERTA AVE SHOPPING CENTRE SLIP","Central East"]
[11418,"ROBERTA CRES","North Urban East"]
[31140,"ROBERTON RD","West"]
[20066,"ROBERTS AVE","North Urban East"]
[40462,"ROBERTS RD (WAITAKERE)","West"]
[10817,"ROBERTS RD (WHANGAPARAOA)","North Urban East"]
[20043,"ROBERTS RD GLENFIELD","North Urban West"]
[40140,"ROBERTS/AYRTON RAB","West"]
[80554,"ROBERTS/HOBBS CYWAY (RP1248)","North Urban East"]
[52247,"ROBERTSON RD (MANGERE)","South West Urban"]
[40461,"ROBERTSON RD (WAITAKERE)","West"]
[10819,"ROBERTSON RD (WAYBY)","North Rural"]
[54166,"ROBERTSON RD CARPARK (RP1304 LHS)","South West Urban"]
[54165,"ROBERTSON RD CARPARK (RP2176 LHS)","South West Urban"]
[54154,"ROBERTSON RD SERVICE LANE (RP2213)","South West Urban"]
[52802,"ROBERTSON/BADER RAB","South West Urban"]
[53086,"ROBIN BROOKE DR","South East Urban"]
[22436,"ROBIN LANE","North Urban East"]
[52855,"ROBINA CRT","South East Urban"]
[10728,"ROBINIA PL","North Rural"]
[10820,"ROBINSON RD","North Rural"]
[31141,"ROBLEY CRES","Central East"]
[33139,"ROBLEY CRES LLA (#50 - #58)","Central East"]
[34343,"ROBSON ST","Central"]
[40460,"ROBY ST","West"]
[48179,"ROBY ST WWAY","West"]
[52248,"ROBYN PL","South West Urban"]
[52249,"ROCHAS PL","South West Urban"]
[31142,"ROCHDALE AVE","Central East"]
[52827,"ROCHESTER CRES","South East Urban"]
[53336,"ROCK DAISY CRES (NORTH)","South West Urban"]
[54602,"ROCK DAISY CRES (SOUTH)","South West Urban"]
[54603,"ROCK DAISY CRES LINK","South West Urban"]
[22437,"ROCK ISLE RD","North Urban East"]
[34344,"ROCKFIELD RD","Central East"]
[35686,"ROCKFIELD/STATE WWAY (RP1234)","Central East"]
[34345,"ROCKLANDS AVE","Central"]
[35256,"ROCKRIDGE AVE","Central East"]
[31143,"ROCKWOOD PL","Central"]
[34346,"ROCKY NOOK AVE","Central"]
[52250,"ROD PL","South West Urban"]
[11217,"RODEO DR","North Urban East"]
[21078,"RODNEY RD (NORTHCOTE)","North Urban West"]
[10821,"RODNEY RD (PAKIRI)","North Rural"]
[52251,"RODNEY ST (HOWICK)","South East Urban"]
[34347,"RODNEY ST (OTAHUHU)","South West Urban"]
[10822,"RODNEY ST (WELLSFORD/SH 1)","North Rural"]
[52252,"ROELL PL","South West Urban"]
[10823,"ROGAN AVE","North Rural"]
[34348,"ROGAN ST","Central"]
[52253,"ROGERS AVE","South East Urban"]
[53942,"ROGERS AVE-THE ESPLANADE","South East Urban"]
[52254,"ROGERS RD (MANUREWA)","South West Urban"]
[70526,"ROGERS RD (PUKEKOHE)","South Rural"]
[35595,"ROGERS WAY (PVT)","Central"]
[51404,"ROGERS/CHRISTMAS RAB","South West Urban"]
[80618,"ROHEA PL (PVT)","South West Urban"]
[51406,"ROHI PL","South East Urban"]
[40010,"ROICK PDE","West"]
[40009,"ROLAND HILL","West"]
[20604,"ROLAND RD","North Urban West"]
[60209,"ROLLERSON ST","South West Urban"]
[34349,"ROMA RD","Central"]
[52255,"ROMFORD RD","South West Urban"]
[60210,"ROMILLY CRT","South West Urban"]
[52256,"ROMNEY PL","South West Urban"]
[53943,"ROMNEY PL-ADDINGTON AVE","South West Urban"]
[31144,"ROMOLA ST","Central East"]
[22587,"ROMULUS PL","North Urban West"]
[52257,"RON DRIVER PL","South East Urban"]
[60211,"RON KEAT DR","South West Urban"]
[60669,"RON KEAT DR CARPARK (RP144 RHS)","South West Urban"]
[60670,"RON KEAT DR CARPARK (RP252 RHS)","South West Urban"]
[60686,"RON KEAT DR CARPARK (RP27 RHS)","South West Urban"]
[60668,"RON KEAT DR CARPARK (RP54 LHS)","South West Urban"]
[31145,"RONA AVE","Central"]
[31146,"RONAKI RD (MISSION BAY)","Central East"]
[34350,"RONAKI RD (OTAHUHU)","South West Urban"]
[31147,"RONALD ALGIE PL","Central East"]
[70527,"RONALD AVE","South Rural"]
[20686,"RONALD MACKEN PL","North Urban West"]
[52258,"RONALD PL","South West Urban"]
[31148,"RONAYNE ST","Central"]
[52259,"RONDORLYN PL","South West Urban"]
[34351,"RONGO RD","Central East"]
[52260,"RONGOMAI RD","South West Urban"]
[15525,"RONGOMAI RD/FEATHERSTON CRES CYWAY","South West Urban"]
[54309,"RONWOOD AVE (EASTBOUND)","South West Urban"]
[52261,"RONWOOD AVE (WESTBOUND)","South West Urban"]
[54110,"RONWOOD AVE SERVICE LANE (RP565)","South West Urban"]
[54225,"RONWOOD/OSTERLEY RAB","South West Urban"]
[22623,"ROOK PL","North Urban West"]
[71028,"ROOSE AVE","South Rural"]
[34352,"ROOSEVELT AVE","Central East"]
[31149,"ROPATA AVE","Central East"]
[40459,"ROPE RD","North Urban West"]
[47289,"ROSA PL","West"]
[48113,"ROSA PL WWAY","West"]
[34353,"ROSALIE BAY RD","Hauraki Islands"]
[35068,"ROSALIE BAY RD LLA (RP2513 RHS)","Hauraki Islands"]
[20406,"ROSALIND ST","North Urban West"]
[31150,"ROSAMUND AVE","West"]
[35752,"ROSAMUND AVE WWAY (RP696 RHS)","West"]
[47278,"ROSANDICH DR","West"]
[10824,"ROSARIO CRES","North Urban East"]
[52262,"ROSCA LANE (PVT)","South East Urban"]
[54398,"ROSCOMMON RD (NORTHBOUND)","South West Urban"]
[54253,"ROSCOMMON RD (SOUTHBOUND)","South West Urban"]
[15449,"ROSCOMMON RD/TAMWORTH CL CYWAY","South West Urban"]
[11431,"ROSE CRT","North Urban East"]
[31151,"ROSE RD (GREY LYNN)","Central"]
[52264,"ROSE RD (PAPATOETOE)","South West Urban"]
[15241,"ROSE RD/GREY LYNN PARK CYWAY (RP 771)","Central"]
[15254,"ROSE RD/GREY LYNN PARK CYWAY (RP695)","Central"]
[52265,"ROSEANNE RD","South West Urban"]
[31152,"ROSEBANK RD (AVONDALE)","West"]
[52266,"ROSEBANK RD (PAPATOETOE)","South West Urban"]
[54564,"ROSEBANK RD CARPARK (RP17 RHS)","South West Urban"]
[35935,"ROSEBANK RD CARPARK (RP490 RHS)","West"]
[31543,"ROSEBANK RD CYWAY (RP4525 LHS)","West"]
[15168,"ROSEBANK RD LINK CYWAY","West"]
[30475,"ROSEBANK/PATIKI RAB","West"]
[41358,"ROSEBAY RISE","West"]
[22175,"ROSEBERRY AVE","North Urban West"]
[23093,"ROSEBERRY AVE ACCESSWAY - #69 TO","North Urban West"]
[20845,"ROSEBERRY AVE SERVICE LANE","North Urban West"]
[53514,"ROSEBOROUGH PL","South East Urban"]
[52267,"ROSEBURN PL","South East Urban"]
[22176,"ROSECAMP RD","North Urban West"]
[34354,"ROSEDALE AVE","Central"]
[22948,"ROSEDALE CLOSE (OLD ROSEDALE RD)","North Urban West"]
[20058,"ROSEDALE RD","North Urban West"]
[22970,"ROSEDALE RD ACCESSWAY #1 - #9","North Urban West"]
[60212,"ROSEHILL DR","South West Urban"]
[60213,"ROSELAWN LANE","South West Urban"]
[11191,"ROSELLA GR","North Rural"]
[22856,"ROSELLA PL","North Urban East"]
[52784,"ROSELLA RD","South West Urban"]
[54171,"ROSELLA RD CARPARK (RP781 RHS)","South West Urban"]
[34355,"ROSEMAN AVE","Central"]
[20332,"ROSEMARY AVE","North Urban East"]
[52269,"ROSEMARY LANE (PVT)","South West Urban"]
[52762,"ROSEMEAD PL","South West Urban"]
[54339,"ROSEMEAD PL HAMMERHEAD","South West Urban"]
[10094,"ROSEMOUNT RD","North Rural"]
[22177,"ROSENEATH PL","North Urban West"]
[70529,"ROSENEATH RD","South Rural"]
[35567,"ROSEPARK CRES","Central East"]
[52270,"ROSETTA CRT","South East Urban"]
[41314,"ROSETTI RISE","North Urban West"]
[11359,"ROSEVILLE RD","North Urban East"]
[31153,"ROSEVILLE ST","West"]
[40458,"ROSEWARNE CRES","West"]
[31154,"ROSEWAY PL","Central East"]
[80384,"ROSEWELL CRES (NTH)","South East Urban"]
[80589,"ROSEWELL CRES (STH)","South East Urban"]
[52271,"ROSEWOOD PL","South East Urban"]
[40164,"ROSIER RD","West"]
[52272,"ROSINA PL","South East Urban"]
[34357,"ROSKILL WAY","Central"]
[34358,"ROSLYN RD","Central East"]
[20660,"ROSLYN TCE","North Urban East"]
[20430,"ROSS AVE (GLENFIELD)","North Urban West"]
[52273,"ROSS AVE (OTARA)","South West Urban"]
[52274,"ROSS AVE (PAPATOETOE)","South West Urban"]
[10825,"ROSS CRES","North Urban East"]
[11116,"ROSS CRESENT HAMMERHEAD","North Urban East"]
[60365,"ROSS MARTIN CRT","South West Urban"]
[60214,"ROSS PL","South West Urban"]
[10826,"ROSS RD","North Rural"]
[52275,"ROSS REID PL","South East Urban"]
[31155,"ROSS ST","Central East"]
[22933,"ROSSES PL","North Urban West"]
[34359,"ROSSGROVE TCE","Central"]
[60612,"ROSSINI CRT (EAST)","South West Urban"]
[60611,"ROSSINI CRT (WEST)","South West Urban"]
[70885,"ROSSITER AVE","South Rural"]
[34360,"ROSSMAY TCE","Central"]
[22438,"ROSSMORE TCE","North Urban East"]
[34361,"ROSTREVOR AVE","Central"]
[20073,"ROSYTH AVE","North Urban East"]
[31156,"ROTA PL","Central"]
[52276,"ROTHERY RD","South West Urban"]
[22439,"ROTHESAY BAY RD","North Urban East"]
[31157,"ROTHESAY ST","Central East"]
[35016,"ROTHSCHILD TCE","Hauraki Islands"]
[20715,"ROTHWELL AVE","North Urban West"]
[52277,"ROTHWELL PL","South East Urban"]
[24076,"ROTO RD (PVT)","North Urban East"]
[52278,"ROTOITI AVE","South East Urban"]
[15743,"ROTOITI AVE/MANAPOURI PL CYWAY","South East Urban"]
[52279,"ROTOMA RISE","South West Urban"]
[54411,"ROTOMA RISE EXTN","South East Urban"]
[53945,"ROTOMA RISE-HOLLYFORD DR","South West Urban"]
[31158,"ROTOMAHANA TCE","Central East"]
[71209,"ROULSTON LANE","South Rural"]
[71029,"ROULSTON ST","South Rural"]
[71430,"ROULSTON ST CARPARK (RP282 LHS)","South Rural"]
[60364,"ROUNTREE PL","South West Urban"]
[40035,"ROUTLEY DR","West"]
[71030,"ROUTLY AVE","South Rural"]
[34363,"ROWAN CRT","Central"]
[34362,"ROWAN RD","Central"]
[40457,"ROWAN TCE","West"]
[35892,"ROWAN/BUCKLEY WWAY (RP278 RHS)","Central"]
[52280,"ROWANDALE AVE","South West Urban"]
[54307,"ROWANDALE/WORDSWORTH RAB","South West Urban"]
[34364,"ROWE ST","Central East"]
[31159,"ROWENA CRES","Central East"]
[31590,"ROWENA CRES LOOP #1 (RP115 LHS)","Central East"]
[31591,"ROWENA CRES LOOP #2 (RP345 LHS)","Central East"]
[34365,"ROWLANDS AVE","Central East"]
[70530,"ROWLES RD","South Rural"]
[34366,"ROXBURGH ST","Central"]
[31160,"ROXY TCE","Central East"]
[54228,"ROY DOUGLAS PL","South West Urban"]
[47191,"ROY MALONEY DR","West"]
[60215,"ROYAL ARCH PL","South West Urban"]
[70531,"ROYAL DOULTON DR","South Rural"]
[40456,"ROYAL RD","West"]
[47149,"ROYAL RD LLA (#125 - #131)","West"]
[34367,"ROYAL TCE","Central"]
[40455,"ROYAL VIEW RD","West"]
[34368,"ROYAL VIKING WAY","Central"]
[41191,"ROYAL/DON BUCK SLIP","West"]
[53124,"ROYALPARK PL","South West Urban"]
[10827,"ROYALTY RISE","North Urban East"]
[52281,"ROYS RD","South West Urban"]
[54792,"ROYS RD CARPARK (RP432 LHS)","South West Urban"]
[52282,"ROYSFIELD LANE","South East Urban"]
[60216,"ROYSTON ST","South West Urban"]
[52283,"ROYTON AVE","South West Urban"]
[40060,"RUA RD","West"]
[31161,"RUAHINE ST","West"]
[52284,"RUAITI RD","South West Urban"]
[34369,"RUAPEHU ST","Central"]
[34370,"RUARANGI RD","Central"]
[41248,"RUATEA ST (PVT)","North Urban West"]
[34371,"RUAWAI RD","Central East"]
[40454,"RUBENS LANE","North Urban West"]
[10828,"RUBY COVE","North Rural"]
[10829,"RUBY PL","North Urban East"]
[52285,"RUBY ST","South West Urban"]
[11480,"RUE D'AMARRES","North Urban East"]
[22178,"RUGBY RD","North Urban West"]
[31162,"RUKA LANE","Central East"]
[35806,"RUKA/TAITOKERAU LINK (RP80 RHS)","Central East"]
[52286,"RUKUMOANA PL","South West Urban"]
[31163,"RUKUTAI ST","Central East"]
[35846,"RUKUTAI/ATKIN WWAY (RP258 RHS)","Central East"]
[10830,"RUN RD","North Rural"]
[34372,"RUNA PL","Central East"]
[70533,"RUNCIMAN RD","South Rural"]
[31164,"RUNNELL ST","Central"]
[40453,"RUPEKE PL","West"]
[35680,"RUPI CRT","Central East"]
[11604,"RURAL VIEW LANE","North Rural"]
[31165,"RURU ST","Central"]
[47001,"RUSH CREEK DR","West"]
[47206,"RUSH CREEK/LAZURITE RAB","West"]
[52287,"RUSH PL","South West Urban"]
[53946,"RUSH PL-PAINE PL","South West Urban"]
[53281,"RUSHBURY PL","South West Urban"]
[10831,"RUSHDEN TCE","North Urban East"]
[60217,"RUSHGREEN AVE","South West Urban"]
[71496,"RUSHLAND RISE","South Rural"]
[31683,"RUSKIN ST (EAST)","Central"]
[31166,"RUSKIN ST (WEST)","Central"]
[71031,"RUSSELL AVE","South Rural"]
[52288,"RUSSELL RD (MANUREWA)","South West Urban"]
[70534,"RUSSELL RD (PUKEKOHE)","South Rural"]
[10832,"RUSSELL RD (WAINUI)","North Rural"]
[54063,"RUSSELL RD CARPARK (RP23 LHS)","South West Urban"]
[53947,"RUSSELL RD-WHITE RD","South West Urban"]
[22528,"RUSSELL ST (DEVONPORT)","North Urban East"]
[10833,"RUSSELL ST (MAHURANGI EAST)","North Rural"]
[31167,"RUSSELL ST (PONSONBY)","Central"]
[47070,"RUSSETT GR","West"]
[48107,"RUSSETT GRV WWAY","West"]
[34373,"RUSTIC AVE","Central"]
[10834,"RUSTYBROOK RD","North Rural"]
[22771,"RUTGERS PL","North Urban West"]
[80548,"RUTH CRAIG PL","North Urban East"]
[52289,"RUTH ST","South West Urban"]
[70535,"RUTHERFORD RD","South Rural"]
[20111,"RUTHERFORD ST","North Urban East"]
[31168,"RUTHERFORD TCE","Central East"]
[20656,"RUTLAND RD (DEVONPORT)","North Urban East"]
[34739,"RUTLAND RD (MT WELLINGTON)","Central East"]
[32935,"RUTLAND ST","Central"]
[47090,"RUZE VIDA DR","West"]
[52290,"RYAN PL","South West Urban"]
[70536,"RYAN RD (PATUMAHOE)","South Rural"]
[10835,"RYAN RD (TOMARATA)","North Rural"]
[40452,"RYANS RD","North Urban West"]
[34374,"RYBURN RD","Central East"]
[34375,"RYDAL DR","Central East"]
[41359,"RYDEN PL","West"]
[52291,"RYE CRT","South West Urban"]
[41416,"RYEHILL CLOSE","West"]
[31170,"RYLE ST","Central"]
[52292,"RYLOCK PL","South East Urban"]
[52293,"RYMER PL","South West Urban"]
[20691,"SABANA PL","North Urban West"]
[52294,"SABI PL","South West Urban"]
[40450,"SABOT PL","West"]
[52295,"SABRE PL","South West Urban"]
[40449,"SABULITE RD","West"]
[48061,"SABULITE RD WWAY","West"]
[40201,"SACHEL PL","West"]
[31191,"SACKVILLE ST","Central"]
[22440,"SADDLEBACK RISE","North Urban East"]
[22441,"SADDLEBACK RISE (AC.WAY)","North Urban East"]
[70537,"SADDLETON RD","South Rural"]
[34376,"SADGROVE TCE","Central"]
[22182,"SAFFRON ST","North Urban West"]
[31192,"SAGE RD","Central East"]
[54786,"SAI ST","South East Urban"]
[52967,"SAIDIA PL","South East Urban"]
[40448,"SAILFISH DR","North Urban West"]
[34377,"SAINSBURY RD","Central"]
[35620,"SAINTLY LANE (PVT)","West"]
[53015,"SAINTS CRT (PVT)","South West Urban"]
[20354,"SALAMANCA RD","North Urban East"]
[52296,"SALAS PL (HOWICK)","South East Urban"]
[60218,"SALAS PL (PAPAKURA)","South West Urban"]
[31193,"SALE ST (AUCKLAND)","Central"]
[52297,"SALE ST (HOWICK)","South East Urban"]
[31724,"SALE/UNION SLIP","Central"]
[22442,"SALEM PL","North Urban East"]
[24101,"SALERNO WAY (PVT)","North Urban West"]
[52298,"SALEYARD RD","South Rural"]
[11143,"SALEYARD ST","North Rural"]
[34381,"SALEYARDS RD (OTAHUHU)","South West Urban"]
[10836,"SALEYARDS RD (PUHOI)","North Rural"]
[53632,"SALFORD CRES","South East Urban"]
[15501,"SALFORD CRES/MULTOSE DR CYWAY","South East Urban"]
[35963,"SALIMA TALAGI ST","Central East"]
[22183,"SALISBURY RD","North Urban West"]
[31194,"SALISBURY ST","Central"]
[34382,"SALLY CRES","Central"]
[31195,"SALTAIRE ST","West"]
[20185,"SALTBURN RD","North Urban East"]
[80638,"SALTMARSH RD","North Urban West"]
[11525,"SALTWOOD ST","North Urban East"]
[54131,"SAM PL","South West Urban"]
[30300,"SAM WRIGLEY ST","Central"]
[53209,"SAMARA PL","South West Urban"]
[53249,"SAMBROOKE CRES","South East Urban"]
[36034,"SAMOA HOUSE LANE","Central"]
[22724,"SAMPLE RD","North Urban West"]
[22509,"SAMPSON LANE","North Urban West"]
[80671,"SAMUEL CASSIDY AVENUE","West"]
[22887,"SAMUEL CROSS PL","North Urban West"]
[31695,"SAMUEL PL","Central East"]
[22809,"SAMUEL'S LANE","North Urban West"]
[41360,"SAN AMBROSIO RISE","West"]
[47262,"SAN ANGELO CRT","West"]
[40079,"SAN ANGELO CRT HAMMERHEAD","West"]
[47071,"SAN ANTONIO WAY","West"]
[47116,"SAN ANTONIO/SAN PEDRO RAB","West"]
[41285,"SAN BERNADINO DR","West"]
[47207,"SAN BERNADINO/SAN DOMINGO RAB","West"]
[41391,"SAN BERNADINO/SAN MARINO RAB","West"]
[47247,"SAN BERNADINO/SAN PEDRO LINK","West"]
[41392,"SAN BERNADINO/SAN VALENTINO RAB","West"]
[47192,"SAN CARLO CRT","West"]
[80274,"SAN CASSELLO RISE","West"]
[47119,"SAN CLEMENTO RISE (PVT)","West"]
[47193,"SAN DIEGO CRT","West"]
[47131,"SAN DOMINGO RISE","West"]
[47208,"SAN DOMINGO/SAN CARLO RAB","West"]
[41361,"SAN FERNANDO WAY","West"]
[41394,"SAN FERNANDO/SAN LORENZO RAB","West"]
[47072,"SAN IGNACIO CRT","West"]
[52887,"SAN JOSE RISE","South East Urban"]
[41362,"SAN LORENZO RISE","West"]
[53039,"SAN LUIS PL","South East Urban"]
[47087,"SAN MARCO RISE (PVT)","West"]
[41363,"SAN MARINO DR","West"]
[47347,"SAN MARINO DR WEST","West"]
[48097,"SAN MARINO DRV WWAY 1","West"]
[48096,"SAN MARINO DRV WWAY 2","West"]
[48095,"SAN MARINO DRV WWAY 3","West"]
[40111,"SAN MARINO WEST/WALTHAM RAB","West"]
[52974,"SAN MARTIN PL (PVT)","South East Urban"]
[47073,"SAN PABLO WAY","West"]
[47118,"SAN PABLO/SAN ANGELO RAB","West"]
[47074,"SAN PEDRO PL","West"]
[80273,"SAN PROSPERO CRES","West"]
[41364,"SAN VALENTINO DR","West"]
[47117,"SAN VALENTINO/SAN ANTONIO RAB","West"]
[41393,"SAN VALENTINO/SAN FERNANDO RAB","West"]
[47114,"SAN VALENTINO/SAN PABLO RAB","West"]
[47075,"SAN VITO PL","West"]
[71352,"SANCTUARY DR","South Rural"]
[52299,"SANCTUARY PT","South East Urban"]
[54719,"SANCTUARY PT HAMMERHEAD","South East Urban"]
[15583,"SANCTUARY PT LINK CYWAY","South East Urban"]
[34384,"SANDA RD","Central East"]
[52877,"SANDALWOOD PL","South East Urban"]
[52300,"SANDBROOK AVE","South West Urban"]
[20650,"SANDERS AVE","North Urban East"]
[22502,"SANDERS RD - PAREMOREMO","North Urban West"]
[52832,"SANDERSON LANE","South West Urban"]
[10837,"SANDERSON RD","North Rural"]
[22443,"SANDFORD ST","North Urban East"]
[34968,"SANDFORD WAY (RAK)","Hauraki Islands"]
[52302,"SANDGATE AVE","South East Urban"]
[34383,"SANDHILLS RD","Hauraki Islands"]
[35032,"SANDHILLS RD BEACH ACCESS (RP16)","Hauraki Islands"]
[47194,"SANDHURST RISE","West"]
[22444,"SANDIACRE WAY","North Urban East"]
[22445,"SANDOWN RD","North Urban East"]
[80350,"SANDPIPER AVE","North Rural"]
[20722,"SANDPIPER GR","North Urban West"]
[52303,"SANDRA AVE","South West Urban"]
[52304,"SANDRINE AVE","South West Urban"]
[34385,"SANDRINGHAM RD","Central"]
[31725,"SANDRINGHAM RD BUS LOOP (RP150 LHS)","Central"]
[34386,"SANDRINGHAM RD EXTN","Central"]
[36088,"SANDRINGHAM RD EXTN CYWAY","Central"]
[15296,"SANDRINGHAM RD EXTN OVERBRIDGE CYWAY","Central"]
[70538,"SANDS RD","South Rural"]
[10838,"SANDSPIT RD (SANDSPIT)","North Rural"]
[52305,"SANDSPIT RD (SHELLY PARK)","South East Urban"]
[70842,"SANDSPIT RD (WAIUKU)","South Rural"]
[70209,"SANDSPIT RD LOOP #1 (RP725 LHS)","South Rural"]
[70215,"SANDSPIT RD LOOP #2 (RP915 LHS)","South Rural"]
[53949,"SANDSPIT RD-CALLENDER PL","South East Urban"]
[54492,"SANDSPIT/PAPAROA RAB","South East Urban"]
[52306,"SANDSTONE RD","South Rural"]
[53134,"SANDWICK DR","South West Urban"]
[20070,"SANDY BAY RD","North Urban East"]
[35284,"SANDY LANE","West"]
[40447,"SANDYS PDE","West"]
[34387,"SANFT AVE","Central"]
[71475,"SANGAM PL","South Rural"]
[52864,"SANTA ANA DR","South East Urban"]
[52886,"SANTA CRUZ DR","South East Urban"]
[54424,"SANTA CRUZ/ANAHEIM RAB","South East Urban"]
[52307,"SANTA MONICA PL","South East Urban"]
[41408,"SANTA ROSA CRT (PVT)","North Urban West"]
[20325,"SANTA ROSA TCE","North Urban East"]
[20690,"SANTIAGO CRES","North Urban West"]
[34389,"SANTOS PL","Central East"]
[35898,"SANTOS/WAITANGI WWAY (RP75 LHS)","Central East"]
[71404,"SAPLING DR","South Rural"]
[70022,"SAPLING DR LOOP","South Rural"]
[47276,"SAPPERTON DR","West"]
[20464,"SAPPHIRE PL","North Urban West"]
[52308,"SARAH PL","South East Urban"]
[15748,"SARAH PL/ELIMAR DR CYWAY","South East Urban"]
[10839,"SARAH TODD LANE","North Rural"]
[40446,"SARAJEVO PL","West"]
[48316,"SARAJEVO PL WWAY","West"]
[53168,"SARALEE DR","South West Urban"]
[34958,"SARAN PL (PVT)","Central"]
[31197,"SARATOGA AVE","Central"]
[31198,"SARAWIA ST","Central"]
[54787,"SARAZEN DR","South East Urban"]
[40445,"SARI PL","West"]
[40041,"SARONA AVE","West"]
[31199,"SARSFIELD ST","Central"]
[53504,"SARTEANO DR","South West Urban"]
[22446,"SARTORS AVE","North Urban East"]
[11145,"SATELLITE STATION RD","North Rural"]
[22780,"SATURN PL","North Urban West"]
[31200,"SAUNDERS PL","West"]
[30476,"SAUNDERS PL HAMMERHEAD","West"]
[41435,"SAUVIGNON AVE","West"]
[31201,"SAVAGE ST","Central"]
[15205,"SAVAGE ST/NOTLEY ST CYWAY","Central"]
[31202,"SAVANNAH ST","Central"]
[52309,"SAVILL DR","South West Urban"]
[54051,"SAVINA CRT","South East Urban"]
[53568,"SAVONA DR","South East Urban"]
[15493,"SAVONA DR EAST LINK CYWAY (RP254)","South East Urban"]
[15494,"SAVONA DR WEST LINK CYWAY (RP254)","South East Urban"]
[11166,"SAVOY RD","North Urban East"]
[40053,"SAVOY RD (GLEN EDEN)","West"]
[80036,"SAWMILL RD","North Rural"]
[70539,"SAWYER RD","South Rural"]
[80340,"SAWYERS LANE","North Urban East"]
[31203,"SAXON ST","Central"]
[53200,"SAYBROOK PL","South West Urban"]
[31204,"SAYEGH ST","Central East"]
[53317,"SAYES CLOSE","South East Urban"]
[10840,"SCANDRETT RD","North Rural"]
[31205,"SCANLAN ST","Central"]
[31536,"SCANLAN ST (SOUTHBOUND)","Central"]
[40444,"SCANLEN TCE","West"]
[22447,"SCARBORO TCE","North Urban East"]
[31206,"SCARBOROUGH LANE","Central"]
[31207,"SCARBOROUGH TCE","Central"]
[40443,"SCARLET DR","West"]
[22916,"SCARLET OAK DR","North Urban West"]
[22448,"SCARLOCK AVE","North Urban East"]
[22449,"SCARLOCK AVE (AC.WAY)","North Urban East"]
[52310,"SCENIC DR (MANUREWA)","South West Urban"]
[40442,"SCENIC DR (TITIRANGI)","West"]
[41187,"SCENIC DR NORTH","West"]
[47227,"SCENIC DR NORTH HLA (#1082 - #1098)","West"]
[47226,"SCENIC DR NORTH HLA (#1218 - #1234)","West"]
[41209,"SCENIC/WOODLANDS PARK SLIP","West"]
[31208,"SCEPTRE PL","West"]
[31209,"SCHERFF RD","Central East"]
[10841,"SCHISCHKA RD","North Urban East"]
[70541,"SCHLAEPFER RD","South Rural"]
[20634,"SCHNAPPER ROCK RD (NORTH)","North Urban West"]
[20633,"SCHNAPPER ROCK RD (SOUTH)","North Urban West"]
[20608,"SCHNAPPER ROCK RD ACCESSWAY 5-11","North Urban West"]
[31210,"SCHOFIELD ST","Central"]
[15249,"SCHOFIELD ST/GREY LYNN PARK LINK CYWAY","Central"]
[10842,"SCHOLLUM ACCESS RD","North Rural"]
[10843,"SCHOLLUM RD","North Rural"]
[20100,"SCHOOL RD (DEVONPORT)","North Urban East"]
[10844,"SCHOOL RD (KAIPARA FLATS)","North Rural"]
[34391,"SCHOOL RD (KINGSLAND)","Central"]
[80368,"SCHOOL RD (MANUREWA)","South West Urban"]
[40441,"SCHOOL RD (WAITAKERE)","West"]
[10845,"SCHOOL RD 2 (RIVERHEAD)","North Rural"]
[10846,"SCHOOL RD 3 (TOMARATA)","North Rural"]
[10847,"SCHOOL RD 4 (WAIMAUKU)","North Rural"]
[10848,"SCHOOL RD 5 (WELLSFORD)","North Rural"]
[10645,"SCHOOLHOUSE BAY RD","North Rural"]
[54788,"SCHOOMBIE DR","South East Urban"]
[11618,"SCHOONER AVE","North Rural"]
[34392,"SCHOONER BAY RD","Hauraki Islands"]
[22960,"SCHOPOLO PL","North Urban West"]
[15011,"SCHOPOLO PL/MIROMIRO ST CYWAY","North Urban West"]
[31694,"SCORIA CRES","Central East"]
[20685,"SCORPIO PL","North Urban West"]
[31211,"SCOTIA PL","Central"]
[30662,"SCOTIA PL HAMMERHEAD","Central"]
[31212,"SCOTLAND ST","Central"]
[53597,"SCOTSMOOR DR","South West Urban"]
[54370,"SCOTSMOOR DR BUS STOP (RP62 LHS)","South West Urban"]
[40051,"SCOTSTOUN PL","West"]
[41170,"SCOTSTOUN PL HAMMERHEAD","West"]
[52311,"SCOTT AVE","South West Urban"]
[60219,"SCOTT RD (PAPAKURA)","South West Urban"]
[52312,"SCOTT RD (PAPATOETOE)","South West Urban"]
[40440,"SCOTT RD (WAITAKERE)","North Urban West"]
[10849,"SCOTT RD (WHANGAPARAOA)","North Urban East"]
[31213,"SCOTT ST","Central"]
[60513,"SCOTTS FIELD DR","South West Urban"]
[52313,"SCOTTS RD (MANUREWA)","South West Urban"]
[34393,"SCOTTS TCE","Hauraki Islands"]
[34394,"SCOUT AVE","Central"]
[80464,"SCOUT WAY","North Urban East"]
[47318,"SCOWNS WAY","West"]
[41160,"SCOWNS WAY HAMMERHEAD","West"]
[52314,"SEA SPRAY DR","South East Urban"]
[10850,"SEA VIEW RD (LEIGH)","North Rural"]
[34396,"SEA VIEW RD (WAIHEKE)","Hauraki Islands"]
[52316,"SEA VIEW TCE (HOWICK)","South East Urban"]
[52315,"SEA VIEW TCE (MARAETAI)","South Rural"]
[22184,"SEA VISTA AVE","North Urban West"]
[40439,"SEABAR PL","West"]
[48073,"SEABAR PL WWAY","West"]
[22180,"SEABREEZE RD","North Urban East"]
[40078,"SEABROOK AVE","West"]
[48022,"SEABROOK AVE WWAY","West"]
[20019,"SEACLIFFE AVE","North Urban East"]
[34395,"SEACLIFFE RD","Central"]
[34962,"SEACLIFFE RD HLA (#49 - #27)","Central"]
[15319,"SEACLIFFE RD/QUEENSTOWN RD CYWAY","Central East"]
[31214,"SEACOMBE RD","Central"]
[15120,"SEACREAST DR LINK CYWAY","North Urban West"]
[41365,"SEACREST DR","North Urban West"]
[32922,"SEAFIELD VIEW RD","Central"]
[22450,"SEAFORD PL","North Urban East"]
[52317,"SEAFORTH AVE","South West Urban"]
[53950,"SEAFORTH AVE-CHIPPING DALE","South West Urban"]
[11520,"SEAGATE WAY","North Urban East"]
[52318,"SEAGLEN PL","South East Urban"]
[70542,"SEAGROVE RD (WAIAU PA)","South Rural"]
[40438,"SEAGROVE RD (WAITAKERE)","North Urban West"]
[22185,"SEAHORSE PL","North Urban West"]
[40437,"SEAKENS WAY","West"]
[52319,"SEALAND PL","South West Urban"]
[53951,"SEALAND PL-ANDES AVE","South West Urban"]
[52320,"SEALORD PL","South West Urban"]
[15450,"SEALORD PL/ROSCOMMON RD LINK CYWAY","South West Urban"]
[15451,"SEALORD PL/TAMWORTH CL CYWAY","South West Urban"]
[22451,"SEALY RD","North Urban East"]
[11567,"SEAMOUNT DR","North Urban East"]
[53321,"SEAN FITZPATRICK PL","South West Urban"]
[41188,"SEARIDGE RISE","North Urban West"]
[71547,"SEARLE DR","South Rural"]
[35981,"SEARLE ST","Central East"]
[31216,"SEASCAPE RD","Central East"]
[31217,"SEASIDE AVE","Central"]
[22452,"SEATON RD","North Urban East"]
[10851,"SEATOUN AVE","North Rural"]
[21080,"SEAVIEW AVE - NORTHCOTE","North Urban West"]
[80272,"SEAVIEW CRES","North Urban East"]
[11599,"SEAVIEW HEIGHTS","North Rural"]
[20510,"SEAVIEW RD - GLENFIELD","North Urban West"]
[20216,"SEAVIEW RD - MILFORD","North Urban East"]
[40436,"SEAVIEW RD (PIHA)","West"]
[31218,"SEAVIEW RD (REMUERA)","Central East"]
[70904,"SEAVIEW RISE","South Rural"]
[70543,"SEAVIEW TCE (GRAHAMS BEACH)","South Rural"]
[34398,"SEAVIEW TCE (MT ALBERT)","Central"]
[52321,"SEAWARD PL","South West Urban"]
[70544,"SEAWAY RD","South Rural"]
[31219,"SECCOMBES RD","Central"]
[53125,"SECOIA CRES","South West Urban"]
[22531,"SECOND AVE (DEVONPORT)","North Urban East"]
[70540,"SECOND AVE (GLENBROOK BEACH)","South Rural"]
[34400,"SECOND AVE (MT ALBERT)","Central"]
[34399,"SECOND AVE (WAIHEKE)","Hauraki Islands"]
[52322,"SECOND VIEW AVE","South Rural"]
[15622,"SECOND VIEW AVE/OMAHA BEACH RD CYWAY","South Rural"]
[52323,"SECRETARIAT PL","South West Urban"]
[52324,"SEDDON AVE","South West Urban"]
[53952,"SEDDON AVE-ATKINSON AVE","South West Urban"]
[15202,"SEDDON FIELDS CARPARK CYWAY","Central"]
[15208,"SEDDON FIELDS LOOP CYWAY","Central"]
[15203,"SEDDON FIELDS/JAGGERS BUSH RESERVE CYWAY","Central"]
[71032,"SEDDON LANE","South Rural"]
[70168,"SEDDON LANE EXTN (RP154 RHS)","South Rural"]
[31220,"SEDDON ST (GREY LYNN)","Central"]
[71033,"SEDDON ST (PUKEKOHE)","South Rural"]
[70545,"SEDGEBROOK RD","South Rural"]
[31221,"SEFTON AVE","Central"]
[31222,"SEGAR AVE","Central"]
[20505,"SEGEDIN PL","North Urban West"]
[40435,"SEIBEL RD","West"]
[20293,"SEINE RD","North Urban East"]
[40032,"SEL PEACOCK DR","West"]
[15149,"SEL PEACOCK DR/WEST WAVE CYWAY","West"]
[52325,"SELAGO PL","South West Urban"]
[41171,"SELAK PL","West"]
[31535,"SELBOURNE ST (NORTH)","Central"]
[31223,"SELBOURNE ST (SOUTH)","Central"]
[31224,"SELBY SQ","Central"]
[34401,"SELCOURT RD","Central"]
[52326,"SELFS RD","South West Urban"]
[30467,"SELKIRK RD","Central"]
[34402,"SELKIRK RD HAMMERHEAD","Central"]
[80569,"SELLARS RD","South Rural"]
[10852,"SELMAN RD","North Rural"]
[52327,"SELSEY LANE","South West Urban"]
[71322,"SELVA RD","South Rural"]
[40434,"SELWOOD RD","West"]
[31225,"SELWYN AVE (MISSION BAY)","Central East"]
[40193,"SELWYN AVE (WAITAKERE)","West"]
[20221,"SELWYN CRES","North Urban East"]
[31226,"SELWYN RD (EPSOM)","Central"]
[52328,"SELWYN RD (HOWICK)","South East Urban"]
[52329,"SELWYN RD (MANUREWA)","South West Urban"]
[34403,"SELWYN ST","Central East"]
[35813,"SELWYN/KOHIMIRAMA WWAY (RP700)","Central East"]
[54314,"SELWYN/LUPTON RAB","South West Urban"]
[31553,"SELWYN/TAMAKI SLIP","Central East"]
[47137,"SEMILLON AVE","West"]
[48100,"SEMILLON AVE WWAY","West"]
[52330,"SENA PL","South West Urban"]
[53210,"SENATOR DR","South West Urban"]
[52331,"SENECA CRT","South East Urban"]
[54473,"SENECA CRT EXTN","South East Urban"]
[52332,"SENECIO PL","South West Urban"]
[31227,"SENTINEL RD","Central"]
[52333,"SENTOSA PL","South West Urban"]
[22186,"SEON PL","North Urban West"]
[20330,"SEPTEMBER PL","North Urban East"]
[40433,"SEPTIMUS PL","West"]
[20348,"SEQUOIA PL","North Urban East"]
[52868,"SERAI PL","South West Urban"]
[11325,"SERENE PL","North Urban East"]
[53496,"SERENITY PL","South West Urban"]
[54022,"SERESIN CRES","South East Urban"]
[54013,"SERESIN CRES-JEFFS RD","South East Urban"]
[70547,"SERGEANT RD","South Rural"]
[40432,"SERJEANT ST","West"]
[52848,"SERL PL","South West Urban"]
[52334,"SERRANO PL","South West Urban"]
[22453,"SERRATA PL","North Urban East"]
[52335,"SERRITA AVE","South East Urban"]
[40431,"SERWAYNE PL","West"]
[15142,"SERWAYNE PL LINK CYWAY","West"]
[53058,"SESAME GR","South West Urban"]
[52336,"SETON PL","South West Urban"]
[60220,"SETTLEMENT RD (PAPAKURA)","South West Urban"]
[70549,"SETTLEMENT RD (PUKEKOHE)","South Rural"]
[60689,"SETTLEMENT RD CARPARK (RP1188 LHS)","South West Urban"]
[60667,"SETTLEMENT RD CARPARK (RP2225 LHS)","South West Urban"]
[60569,"SETTLEMENT/DOMINION RAB","South West Urban"]
[60570,"SETTLEMENT/MARNE RAB","South West Urban"]
[52908,"SETTLERS COVE","South West Urban"]
[15715,"SETTLERS COVE LINK CYWAY","South West Urban"]
[10853,"SETTLERS GR","North Urban East"]
[15055,"SETTLERS GR CYWAY (RP149)","North Urban East"]
[15056,"SETTLERS GR LINK CYWAY (RP323)","North Urban East"]
[15040,"SETTLERS GR LINK CYWAY (RP372)","North Urban East"]
[15041,"SETTLERS GR LINK CYWAY (RP492)","North Urban East"]
[52337,"SEVEN OAKS DR","South East Urban"]
[34404,"SEVENTH AVE","Hauraki Islands"]
[35915,"SEVENTH AVE WWAY (RP78 LHS)","Hauraki Islands"]
[80572,"SEVENTH VIEW AVE","South Rural"]
[31228,"SEVERN ST","Central"]
[20693,"SEVILLA PL","North Urban West"]
[52338,"SEXTON PL","South West Urban"]
[34405,"SEYCHELLES ST","Central"]
[52339,"SEYMOUR AVE","South West Urban"]
[52340,"SEYMOUR RD (HOWICK)","South East Urban"]
[40430,"SEYMOUR RD (SUNNYVALE)","West"]
[48078,"SEYMOUR RD WWAY","West"]
[15104,"SEYMOUR RD/MILLBROOK RD CYWAY","West"]
[31229,"SEYMOUR ST","Central"]
[15571,"SH 20A CYWAY","South West Urban"]
[15566,"SH 20A CYWAY/KILLINGTON CRES CYWAY","South West Urban"]
[15564,"SH 20A CYWAY/TACON PL CYWAY","South West Urban"]
[15569,"SH 20A/MOYLE PARK CARPARK CYWAY","South West Urban"]
[15567,"SH 20A/VISCOUNT PRIMARY SCHOOL CYWAY","South West Urban"]
[70155,"SH 22 (PAERATA)","South Rural"]
[70156,"SH 22 (PUKEKOHE)","South Rural"]
[34406,"SHACKLETON RD","Central"]
[31230,"SHADDOCK ST","Central"]
[10854,"SHADON PL","North Urban East"]
[31231,"SHADWELL PL","Central East"]
[35650,"SHAFTESBURY AVE (PVT)","Central"]
[53419,"SHAH LANE","South West Urban"]
[47283,"SHAH PL","West"]
[10855,"SHAKESPEAR RD","North Urban East"]
[21001,"SHAKESPEARE RD (AC.WAY)","North Urban East"]
[20037,"SHAKESPEARE RD (TAKAPUNA)","North Urban East"]
[70550,"SHAKESPEARE RD (WAIUKU)","South Rural"]
[23057,"SHAKESPEARE TO TAHAROTO RD SLIP L","North Urban East"]
[40429,"SHALE AVE","West"]
[52341,"SHALIMAR PL","South West Urban"]
[10856,"SHAMROCK CREST","North Rural"]
[40428,"SHAMROCK LANE","West"]
[48152,"SHAMROCK LANE WWAY","West"]
[20555,"SHANAWAY RISE","North Urban West"]
[54783,"SHANDON ST","South East Urban"]
[53246,"SHANKILL PL","South East Urban"]
[54462,"SHANKILL PL EXTN","South East Urban"]
[54235,"SHANKILL PL-FEENY CRES","South East Urban"]
[10857,"SHANKS RD","North Rural"]
[70902,"SHANLEY CRES","South Rural"]
[52844,"SHANNON PL (NORTHPARK)","South East Urban"]
[22663,"SHANNON PL (TORBAY)","North Urban East"]
[60370,"SHARIVARI PL","South West Urban"]
[52342,"SHARKEY ST","South West Urban"]
[54257,"SHARKEY ST SERVICE LANE (RP109 RHS)","South West Urban"]
[52343,"SHARLAND AVE","South West Urban"]
[54327,"SHARLAND/JOHN WALKER RAB","South West Urban"]
[22454,"SHARON RD (WAIAKE)","North Urban East"]
[10858,"SHARON RD (WAITOKI)","North Rural"]
[22455,"SHARON RD LLA (#38 - #42)","North Urban East"]
[10859,"SHARP RD","North Rural"]
[31232,"SHARPE RD","Central"]
[52344,"SHARPLES PL","South East Urban"]
[54456,"SHARPLES PL HAMMERHEAD","South East Urban"]
[40427,"SHAW RD (WAITAKERE)","West"]
[34407,"SHAW ST","Central"]
[34408,"SHAW WAY","Central"]
[36102,"SHAWCROSS AVE (PVT)","Central"]
[54212,"SHAYLA PL","South West Urban"]
[20173,"SHEA TCE","North Urban East"]
[34409,"SHEARER ST","Central"]
[35702,"SHEARER/BELCHER WWAY (RP69 LHS)","Central"]
[80716,"SHEARWATER LANE","North Rural"]
[24007,"SHEARWATER RISE (PVT)","North Urban East"]
[53475,"SHEDDINGS LANE","South East Urban"]
[60221,"SHEEHAN AVE","South West Urban"]
[60662,"SHEEHAN AVE CARPARK (RP685 LHS)","South West Urban"]
[60281,"SHEEHAN AVE SERVICE LANE (RP682)","South West Urban"]
[40426,"SHEEHAN RD","West"]
[31233,"SHEEHAN ST","Central"]
[52345,"SHEFFIELD PL","South East Urban"]
[10860,"SHEFFIELD RD","North Rural"]
[10861,"SHEGADEEN RD","North Rural"]
[80306,"SHELBY LN","South East Urban"]
[80506,"SHELBY PLACE","North Urban East"]
[52988,"SHELDON PL","South East Urban"]
[80640,"SHELDUCK WAY","North Urban West"]
[52346,"SHELLY BAY RD","South Rural"]
[52347,"SHELLY BEACH PDE","South East Urban"]
[54796,"SHELLY BEACH PDE CARPARK (RP275)","South East Urban"]
[31234,"SHELLY BEACH RD (PONSONBY)","Central"]
[10862,"SHELLY BEACH RD (SHELLY BEACH)","North Rural"]
[34410,"SHELLY BEACH RD (WAIHEKE)","Hauraki Islands"]
[36084,"SHELLY BEACH RD EXT (PONSONBY)","Central"]
[34989,"SHELLY BEACH RD EXTN (RP138)","Hauraki Islands"]
[22923,"SHELTER DR","North Urban West"]
[34411,"SHENANDOAH AVE","Central"]
[52817,"SHENTON PL","South East Urban"]
[10863,"SHEPHERD RD","North Rural"]
[52348,"SHEPHERDS LANE","South East Urban"]
[54560,"SHEPHERDS LANE EXTN","South East Urban"]
[60222,"SHEPHERDS RD","South West Urban"]
[34412,"SHEPPARD AVE","Central"]
[15284,"SHEPPARD AVE/WALMSLEY PARK LINK CYWAY","Central"]
[31235,"SHERA RD (EAST)","Central East"]
[31657,"SHERA RD (WEST)","Central East"]
[52349,"SHERALEE PL (HOWICK)","South East Urban"]
[60223,"SHERALEE PL (PAPAKURA)","South West Urban"]
[60571,"SHERALEE PL EXTN (PAPAKURA)","South West Urban"]
[34413,"SHERBOURNE RD","Central"]
[40084,"SHERIDAN DR","West"]
[48019,"SHERIDAN DR WWAY","West"]
[31236,"SHERIDAN LANE","Central"]
[52350,"SHERIE PL","South East Urban"]
[52752,"SHERIFF PL","South West Urban"]
[15423,"SHERIFF PL/HORLICKS PL CYWAY","South West Urban"]
[41366,"SHERPA PL","West"]
[47232,"SHERRYBROOKE PL","West"]
[40425,"SHERRYBROOKE PL HAMMERHEAD","West"]
[31237,"SHERWOOD AVE (GREY LYNN)","Central"]
[40424,"SHERWOOD AVE (WAITAKERE)","West"]
[15125,"SHERWOOD AVE LINK CYWAY","West"]
[71327,"SHERWOOD DR","South Rural"]
[22851,"SHERWOOD GR","North Urban East"]
[40195,"SHETLAND ST","West"]
[41202,"SHETLAND ST HLA (#29 - #39)","West"]
[41284,"SHETLAND ST HLA (#59 - #83)","West"]
[48047,"SHETLAND ST WWAY","West"]
[80591,"SHIBATA RISE","West"]
[54341,"SHIFNAL DR","South West Urban"]
[52351,"SHIFNAL DR EXTN (RP0 RHS)","South West Urban"]
[20624,"SHILOH WAY","North Urban West"]
[10864,"SHINE RD","North Rural"]
[53428,"SHINGLETON LANE","South East Urban"]
[53430,"SHINGLETON LANE EXTN","South East Urban"]
[31238,"SHIPHERDS AVE","Central"]
[31648,"SHIPHERDS AVE HLA (RP251 RHS)","Central"]
[35018,"SHIPHERDS CLOSE (PVT)","Central"]
[31239,"SHIPTON PL","West"]
[11603,"SHIPWRIGHT PL","North Rural"]
[47195,"SHIRAZ PL","West"]
[48102,"SHIRAZ PL WWAY","West"]
[60224,"SHIRLEY AVE","South West Urban"]
[31240,"SHIRLEY RD (GREY LYNN)","Central"]
[52352,"SHIRLEY RD (PAPATOTOE)","South West Urban"]
[40423,"SHIRLEY RD (WAITAKERE)","West"]
[54173,"SHIRLEY RD CARPARK (RP1733 LHS)","South West Urban"]
[54513,"SHIRLEY/CORONATION RAB","South West Urban"]
[20565,"SHOAL BAY RD (DEVONPORT)","North Urban East"]
[34415,"SHOAL BAY RD (GBI)","Hauraki Islands"]
[22525,"SHOAL BAY RD HIGH","North Urban East"]
[22526,"SHOAL BAY RD LOW","North Urban East"]
[10865,"SHOESMITH ST","North Rural"]
[40422,"SHONA PL","West"]
[31241,"SHORE RD","Central East"]
[31597,"SHORE/ARNEY BUS LOOP","Central East"]
[35844,"SHORE/BASSETT RAB","Central East"]
[31242,"SHOREHAM ST","West"]
[10866,"SHORT RD","North Rural"]
[31243,"SHORT ST (CITY)","Central"]
[10867,"SHORT ST (MAH EAST)","North Rural"]
[52353,"SHORT ST (MANUREWA)","South West Urban"]
[34419,"SHORT ST (NEWMARKET)","Central"]
[60225,"SHORT ST (PAPAKURA)","South West Urban"]
[34418,"SHORT ST (WAIHEKE)","Hauraki Islands"]
[31244,"SHORTLAND ST","Central"]
[52354,"SHORTT AVE","South West Urban"]
[34416,"SHORWELL ST","Central"]
[31245,"SHREWSBURY AVE","Central East"]
[53244,"SHRULE PL","South East Urban"]
[10869,"SHUTTLEWORTH PL","North Urban East"]
[80405,"SIBLING COURT","North Urban East"]
[53416,"SID PL","South West Urban"]
[53954,"SID PL-WALDOS WAY","South West Urban"]
[52355,"SIDEY AVE","South West Urban"]
[22457,"SIDMOUTH ST","North Urban East"]
[20878,"SIDMOUTH ST SERVICE LANE","North Urban East"]
[10870,"SIDWELL RD","North Rural"]
[53562,"SIEDEBERG DR","South East Urban"]
[40416,"SIENA PL","West"]
[31246,"SIERRA ST","Central East"]
[10871,"SIESTA TCE","North Urban East"]
[52356,"SIKKIM CRES","South West Urban"]
[53645,"SILENI PL","South East Urban"]
[60623,"SILKWOOD CRES","South West Urban"]
[52794,"SILKWOOD GR","South West Urban"]
[54050,"SILVANA DR","South East Urban"]
[40421,"SILVER BIRCH RISE","West"]
[52357,"SILVER CREEK RD","South West Urban"]
[10872,"SILVER HILL RD","North Rural"]
[23092,"SILVER MOON RD","North Urban West"]
[31247,"SILVER RD","Central"]
[10873,"SILVERDALE ST","North Urban East"]
[11245,"SILVERDALE ST CARPARK","North Urban East"]
[20266,"SILVERFIELD","North Urban West"]
[40420,"SILVERSTONE PL","West"]
[48080,"SILVERSTONE PL WWAY","West"]
[31248,"SILVERTON AVE","Central East"]
[53505,"SILVERWOOD DR","South East Urban"]
[71376,"SIM RD (NORTH)","South Rural"]
[70553,"SIM RD (SOUTH)","South Rural"]
[52358,"SIME RD","South West Urban"]
[31249,"SIMKIN AVE","Central East"]
[52359,"SIMMENTAL CRES","South East Urban"]
[34422,"SIMMONDS AVE","Central"]
[34423,"SIMMONDS LANE","Central East"]
[35715,"SIMMONDS/MOUNTAIN VIEW WWAY","Central East"]
[35703,"SIMMONDS/MT ALBERT WWAY (RP207)","Central"]
[10874,"SIMON BAYER RD","North Rural"]
[20488,"SIMON ELLICE DR","North Urban West"]
[52360,"SIMON LANE","South West Urban"]
[52768,"SIMON OWEN PL","South East Urban"]
[40419,"SIMPSON RD","West"]
[34424,"SIMS RD","Central East"]
[70554,"SINCLAIR RD (ARARIMU)","South Rural"]
[10875,"SINCLAIR RD (KAUKAPAKAPA)","North Rural"]
[22142,"SINCLAIR ST","North Urban East"]
[35986,"SINGLETON AVE","Central East"]
[80074,"SINTON RD (EAST)","North Urban West"]
[80073,"SINTON RD WEST","North Urban West"]
[31250,"SIOTA CRES","Central East"]
[35812,"SIOTA/BADDELEY WWAY (RP190 LHS)","Central East"]
[52361,"SIR LLOYD DR","South East Urban"]
[15598,"SIR LLOYD DR/ EAST - WEST CYWAY","South East Urban"]
[15599,"SIR LLOYD DR/AVIEMORE DR CYWAY","South East Urban"]
[54711,"SIR LLOYD RAB","South East Urban"]
[24116,"SIR PETER BLAKE PDE (PVT)","North Urban East"]
[52362,"SIR WILLIAM AVE","South East Urban"]
[54481,"SIR WOOLF FISHER DR","South East Urban"]
[54484,"SIR WOOLF FISHER/EL KOBAR RAB","South East Urban"]
[54485,"SIR WOOLF FISHER/UNDERWOOD RAB","South East Urban"]
[60576,"SIRES PARKWAY (EAST)","South West Urban"]
[60575,"SIRES PARKWAY (WEST)","South West Urban"]
[52363,"SIRIUS PL","South East Urban"]
[52364,"SISKA PL","South West Urban"]
[22187,"SISPARA PL","North Urban West"]
[34425,"SIXTH AVE","Hauraki Islands"]
[34426,"SKEATES AVE","Central"]
[53955,"SKELLIGS  DR-DRUMSTONE PL","South East Urban"]
[53545,"SKELLIGS DR","South East Urban"]
[52365,"SKELTON AVE","South West Urban"]
[47076,"SKILGATE AVE","West"]
[52366,"SKILLING PL","South East Urban"]
[34427,"SKINNER RD","Central East"]
[53529,"SKIP LANE","South East Urban"]
[54461,"SKIP LANE LOOP","South East Urban"]
[80406,"SKIPJACK PASS","North Urban East"]
[34414,"SKIPPER AVE","Central"]
[11519,"SKIPPERS COVE","North Urban East"]
[52367,"SKIPTON ST","South West Urban"]
[70556,"SKY HIGH RD","South Rural"]
[41311,"SKYBIRD PL","West"]
[48072,"SKYBIRD PL WWAY","West"]
[53398,"SKYE RD","South East Urban"]
[40417,"SKYLA PL","West"]
[48222,"SKYLA PL WWAY","West"]
[48223,"SKYLA PL WWAY FORK","West"]
[10876,"SLATER RD","North Rural"]
[52368,"SLIGO PL","South East Urban"]
[52369,"SLIM PL","South West Urban"]
[53164,"SLIPPER AVE","South East Urban"]
[24040,"SLOANE LANE (PVT)","North Urban West"]
[31251,"SLOANE ST","Central East"]
[31252,"SMALE ST","Central"]
[26088,"SMALES FARM BUS STATION CARPARK","North Urban East"]
[23049,"SMALES FARM BUS STATION RING RD","North Urban East"]
[52370,"SMALES RD","South East Urban"]
[15590,"SMALES RD/KELVIN HART DR CYWAY","South East Urban"]
[10877,"SMALL RD","North Urban East"]
[70557,"SMALLEY RD","South Rural"]
[34429,"SMALLFIELD AVE","Central"]
[70558,"SMEATON RD","South Rural"]
[52371,"SMEDLEY ST","South West Urban"]
[34430,"SMITH CRES","Central East"]
[10878,"SMITH RD","North Rural"]
[31253,"SMITH ST","Central"]
[22986,"SMITHFIELD AVE","North Urban West"]
[60226,"SMITHS AVE","South West Urban"]
[10879,"SMYTH RD","North Rural"]
[40183,"SMYTHE RD","West"]
[15139,"SMYTHE RD LINK CYWAY","West"]
[10880,"SNAPPER RD","North Urban East"]
[53243,"SNAVE PL","South East Urban"]
[60227,"SNELL AVE","South West Urban"]
[52372,"SNELL PL","South East Urban"]
[10881,"SNELLS BEACH RD","North Rural"]
[60228,"SNOWDEN PL","South West Urban"]
[80651,"SOARING BIRD DR","South West Urban"]
[23064,"SOHLUE PL","North Urban West"]
[11437,"SOLAN DR","North Rural"]
[52373,"SOLANA CRT","South East Urban"]
[40192,"SOLAR RD","West"]
[48075,"SOLAR RD WWAY","West"]
[40415,"SOLEA RD","West"]
[52374,"SOLENT ST","South West Urban"]
[34431,"SOLENT ST (PVT)","Central"]
[40414,"SOLING PL","North Urban West"]
[71328,"SOLITAIRE LANE","South Rural"]
[35634,"SOLJAK PL (PVT)","Central"]
[40243,"SOLJAN DR (NORTH)","West"]
[40225,"SOLJAN DR (SOUTH)","West"]
[54015,"SOLJANS PL","South East Urban"]
[34432,"SOLLUM RD","Central East"]
[52375,"SOLO PL","South West Urban"]
[54016,"SOLSTONE PL","South East Urban"]
[52376,"SOLVEIG PL","South West Urban"]
[34433,"SOMERFIELD ST","Central East"]
[34435,"SOMERSET RD","Central"]
[31631,"SOMERSET/DENBEIGH RAB","Central"]
[47105,"SOMERTON RISE","West"]
[52377,"SOMERVILLE RD","South East Urban"]
[70561,"SOMMERVILLE RD","South Rural"]
[31254,"SONIA AVE","Central East"]
[60426,"SONJA DR","South Rural"]
[40413,"SONNENBERG WAY","West"]
[23030,"SONOMA CRES","North Urban West"]
[15457,"SONTERRA CL/IRONSTONE PL CYWAY","South West Urban"]
[53432,"SONTERRA CLOSE","South West Urban"]
[36019,"SOPHIA CLOSE","Central East"]
[60626,"SOPHIA PL","South West Urban"]
[52378,"SOPHORA PL","South West Urban"]
[22743,"SOPHORA WAY","North Urban West"]
[22744,"SOPHORA WAY HAMMERHEAD","North Urban West"]
[22676,"SORBONNE CLOSE","North Urban West"]
[52379,"SORREL CRES","South East Urban"]
[15797,"SORREL CRES/MANDER PL CYWAY","South East Urban"]
[15780,"SORREL CRES/PEDERSEN PL CYWAY","South East Urban"]
[10882,"SOUTH AVE (KAUKAP)","North Rural"]
[10883,"SOUTH AVE 2 (MANLY)","North Urban East"]
[35267,"SOUTH EASTERN HIGHWAY (EASTBOUND) (CWCE)","Central East"]
[80317,"SOUTH EASTERN HIGHWAY (EASTBOUND) (SE)","South East Urban"]
[80318,"SOUTH EASTERN HIGHWAY (WESTBOUND) (CWCE)","Central East"]
[35299,"SOUTH EASTERN HIGHWAY (WESTBOUND) (SE)","South East Urban"]
[35579,"SOUTH EASTERN HIGHWAY CYWAY","Central East"]
[54830,"SOUTH EASTERN HWAY (EASTBOUND)","South East Urban"]
[52774,"SOUTH EASTERN HWAY (WESTBOUND)","South East Urban"]
[10884,"SOUTH HEAD RD","North Rural"]
[47349,"SOUTH KENSINGTON WAY","West"]
[48098,"SOUTH KENSINGTON WAY WWAY","West"]
[15136,"SOUTH KENSINGTON WAY/MOUNT LEBANON LN CYWAY","West"]
[40412,"SOUTH LYNN RD","West"]
[40388,"SOUTH PACIFIC PL","West"]
[34963,"SOUTH PACIFIC RD (RAK)","Hauraki Islands"]
[31255,"SOUTH ST (NEWTON)","Central"]
[60229,"SOUTH ST (PAPAKURA)","South West Urban"]
[40411,"SOUTH TITIRANGI RD","West"]
[47225,"SOUTH TITIRANGI RD HLA (#779-#787)","West"]
[34754,"SOUTHDOWN LANE","Central East"]
[31256,"SOUTHERN CROSS RD","Central East"]
[35814,"SOUTHERN CROSS WWAY (RP450 LHS)","Central East"]
[40409,"SOUTHGATE PL","West"]
[10885,"SOUTHGATE RD","North Rural"]
[35268,"SOUTHPARK PL","Central East"]
[52380,"SOUTHVIEW PL","South West Urban"]
[20440,"SOVEREIGN PL","North Urban West"]
[53639,"SOVEREIGN ST","South East Urban"]
[71192,"SOWERBY HGTS","South Rural"]
[53120,"SPALDING RISE","South East Urban"]
[40408,"SPARGO RD","West"]
[52381,"SPARROW PL","South West Urban"]
[60372,"SPARTAN RD","South West Urban"]
[52382,"SPEARS PL","South East Urban"]
[41158,"SPEDDING RD","North Urban West"]
[20450,"SPEEDY CRES","North Urban West"]
[71235,"SPEEDY RD","South Rural"]
[31257,"SPEIGHT RD","Central East"]
[53468,"SPENBROOKE RD","South East Urban"]
[40406,"SPENCE RD","West"]
[20673,"SPENCER RD (ALBANY)","North Urban West"]
[11515,"SPENCER RD (RATAC NORTH)","North Rural"]
[31258,"SPENCER ST","Central East"]
[20130,"SPENCER TCE","North Urban East"]
[52383,"SPERRY PL","South West Urban"]
[53958,"SPERRY PL-KIRKBRIDE RD","South West Urban"]
[53536,"SPEYSIDE CRES","South East Urban"]
[10886,"SPINDLER RD","North Rural"]
[20487,"SPINELLA DR","North Urban West"]
[40405,"SPINNAKER DR","West"]
[48183,"SPINNAKER DRV WWAY","West"]
[11335,"SPINNAKER POINT","North Urban East"]
[41367,"SPLENDOUR CLOSE","West"]
[40404,"SPODE PL","West"]
[22876,"SPOONBILL PL","North Urban West"]
[34740,"SPOONER LANE","Central East"]
[10887,"SPRAY CRES","North Rural"]
[40403,"SPRING GR (PVT)","West"]
[22225,"SPRING ST (DEVONPORT)","North Urban East"]
[32950,"SPRING ST (FREEMANS BAY/EAST)","Central"]
[31259,"SPRING ST (FREEMANS BAY/WEST)","Central"]
[34438,"SPRING ST (ONEHUNGA)","Central East"]
[52384,"SPRING ST (PAPATOETOE)","South West Urban"]
[24023,"SPRING VALLEY PL (PVT)","North Urban West"]
[40402,"SPRINGBANK LANE","West"]
[31260,"SPRINGCOMBE RD","Central East"]
[60692,"SPRINGCREST DR","South West Urban"]
[31261,"SPRINGFIELD RD","Central"]
[20327,"SPRINGFIELD ST","North Urban East"]
[80714,"SPRINGHILL RD","South East Urban"]
[34830,"SPRINGLEIGH AVE","Central"]
[54797,"SPRINGS RD (EAST TAMAKI) (SE)","South East Urban"]
[52385,"SPRINGS RD (OTARA) (SW)","South West Urban"]
[10888,"SPRINGS RD (PARAKAI)","North Rural"]
[51407,"SPRINGSIDE DR","South East Urban"]
[40087,"SPRINGSIDE PL","West"]
[11522,"SPRINGTIDE PL","North Urban East"]
[10889,"SPRINGTIME CRES","North Urban East"]
[23023,"SPRINGVALE DR","North Urban West"]
[80527,"SPRINGVALE DR EXTN (PVT)","North Urban West"]
[71384,"SPRINGVALE RD","South Rural"]
[24006,"SPRINGWATER VALE (PVT)","North Urban West"]
[34441,"SPRINGWOOD PL","Central"]
[15332,"SPRINGWOOD PL/BALMER LN CYWAY","Central"]
[34442,"SPROSTON AVE","Central East"]
[31262,"SPROTT RD","Central East"]
[52386,"SPRUCE PL","South West Urban"]
[10890,"SPUR RD","North Urban East"]
[11568,"SPYGLASS ST","North Urban East"]
[80123,"SQUADRON DR","North Urban West"]
[80299,"SQUADRON DR (SOUTHBOUND)","North Urban West"]
[80630,"SQUADRON DR 2","North Urban West"]
[80124,"SQUADRON RAB","North Urban West"]
[22458,"SQUIRREL LANE","North Urban East"]
[53242,"SRAH PL","South East Urban"]
[54234,"SRAH PL-TE IRIRANGI DR","South East Urban"]
[34378,"ST ALBANS AVE","Central"]
[31171,"ST ANDREWS RD","Central"]
[31652,"ST ANDREWS RD LLA (#157 - #167)","Central"]
[31651,"ST ANDREWS RD LLA (#180 - #194)","Central"]
[33140,"ST ANDREWS RD LLA (#50 - #64)","Central"]
[10891,"ST ANNE PL","North Rural"]
[52388,"ST ANNES CRES","South West Urban"]
[15653,"ST ANNES CRES LINK CYWAY","South West Urban"]
[20595,"ST AUBYN ST","North Urban East"]
[31172,"ST BENEDICTS ST","Central"]
[40401,"ST CATHERINE CRES","West"]
[22846,"ST CLAIR PL","North Urban East"]
[31173,"ST DAVIDS ST","West"]
[52885,"ST ELMO RISE","South East Urban"]
[35647,"ST FRANCIS CRES (PVT)","Central"]
[31174,"ST FRANCIS DE SALES ST","Central"]
[52387,"ST GEORGE ST","South West Urban"]
[54576,"ST GEORGE/CARRUTH RAB","South West Urban"]
[31598,"ST GEORGES BAY RD (NORTH)","Central"]
[31176,"ST GEORGES BAY RD (SOUTH)","Central"]
[31175,"ST GEORGES RD","West"]
[34868,"ST GEORGES RD SERVICE LANE (RP1018)","West"]
[35019,"ST HELIERS BAY GARDENS (PVT)","Central East"]
[31177,"ST HELIERS BAY RD","Central East"]
[22461,"ST IVES TCE","North Urban East"]
[10892,"ST JAMES AVE","North Rural"]
[31178,"ST JAMES ST","Central"]
[47077,"ST JEROME AVE","West"]
[31179,"ST JOHNS RD","Central East"]
[31592,"ST JOHNS/COLLEGE RAB","Central East"]
[31180,"ST JUDE ST","West"]
[53021,"ST LEGER CLOSE","South East Urban"]
[20203,"ST LEONARDS RD - DEVONPORT","North Urban East"]
[20087,"ST LEONARDS RD - TAKAPUNA","North Urban East"]
[31181,"ST LEONARDS RD (EPSOM)","Central"]
[40400,"ST LEONARDS RD (WAITAKERE)","West"]
[22584,"ST LUCIA PL","North Urban West"]
[15337,"ST LUKES CARPARK/FERGUSSON RESERVE LINK CYWAY","Central"]
[31182,"ST LUKES RD","Central"]
[30465,"ST LUKES RD (NORTHBOUND)","Central"]
[34869,"ST LUKES/WAGENER SLIP","Central"]
[40399,"ST MARGARET PL","West"]
[48277,"ST MARGARET PL WWAY","West"]
[31183,"ST MARKS RD","Central"]
[53371,"ST MAROUN RISE","South West Urban"]
[30761,"ST MARTINS LANE","Central"]
[31184,"ST MARTINS LANE EXTN","Central"]
[35646,"ST MARTINS WALK (PVT)","Central"]
[36061,"ST MARYS CLOSE (PVT)","Central"]
[31185,"ST MARYS RD","Central"]
[31186,"ST MICHAELS AVE","Central"]
[34380,"ST OSWALDS RD","Central East"]
[31187,"ST PATRICKS SQ","Central"]
[31188,"ST PAUL ST","Central"]
[21079,"ST PETERS ST","North Urban West"]
[52389,"ST SIMON PL","South East Urban"]
[31189,"ST STEPHENS AVE","Central"]
[22682,"ST THOMAS MORE LANE","North Urban West"]
[31190,"ST VINCENT AVE","Central East"]
[31263,"STABLE LANE","Central"]
[80676,"STABLES LANE","North Urban East"]
[31264,"STACK ST","Central"]
[71371,"STADIUM DR","South Rural"]
[70143,"STADIUM/FRANKLIN SLIP","South Rural"]
[31265,"STAFFA ST","Central"]
[52390,"STAFFORD AVE","South West Urban"]
[21081,"STAFFORD RD","North Urban West"]
[40398,"STAFSON LANE","West"]
[40397,"STAINCROSS ST","West"]
[52391,"STAINES AVE","South West Urban"]
[52392,"STAINTON PL","South West Urban"]
[53959,"STAINTON PL-EAST TAMAKI RD","South West Urban"]
[40396,"STALEY RD","West"]
[40395,"STALLARD PL","West"]
[54111,"STAMFORD CRES","South East Urban"]
[34443,"STAMFORD PARK RD","Central"]
[15292,"STAMFORD PARK RD LINK CYWAY","Central"]
[70563,"STAN WRIGHT RD","South Rural"]
[21082,"STANAWAY ST","North Urban West"]
[52393,"STANCOMBE RD","South East Urban"]
[54432,"STANCOMBE RD EXTN (RP1505 LHS)","South East Urban"]
[41206,"STANDAGE LANE","West"]
[41207,"STANDAGE LANE HAMMERHEAD","West"]
[31266,"STANDEN AVE","Central East"]
[20478,"STANDISH PL","North Urban West"]
[22677,"STANFORD ST","North Urban West"]
[34444,"STANHOPE RD","Central East"]
[10893,"STANIFORTH RD","North Rural"]
[20217,"STANLEY AVE","North Urban East"]
[22532,"STANLEY POINT RD","North Urban East"]
[22533,"STANLEY POINT RD (NORTH)","North Urban East"]
[15000,"STANLEY POINT RD/STANLEY BAY PARK CYWAY","North Urban East"]
[20044,"STANLEY RD GLENFIELD","North Urban West"]
[31267,"STANLEY ST (SH 16)","Central"]
[10894,"STANMORE BAY RD","North Urban East"]
[11271,"STANMORE BAY RD 65 - 83","North Urban East"]
[31268,"STANMORE RD","Central"]
[52394,"STANNILAND ST","South East Urban"]
[52395,"STANSFIELD PL","South East Urban"]
[34445,"STANTON TCE","Central"]
[35017,"STANWAY PL","Central East"]
[31269,"STANWELL ST","Central"]
[22459,"STAPLEFORD CRES","North Urban East"]
[53292,"STAR PL (PVT)","South East Urban"]
[53669,"STARDON PL","South West Urban"]
[40394,"STARFORTH PL","West"]
[41369,"STARLIGHT COVE","North Urban West"]
[40393,"STARLING PL","West"]
[34446,"STATE AVE","Central East"]
[35684,"STATE/GAMBIA WWAY (RP185 RHS)","Central East"]
[53605,"STATEN PL","South West Urban"]
[40392,"STATESMAN ST","West"]
[10895,"STATION RD (HUAPAI)","North Rural"]
[52397,"STATION RD (MANUREWA)","South West Urban"]
[34454,"STATION RD (OTAHUHU)","South West Urban"]
[52396,"STATION RD (PAPATOETOE)","South West Urban"]
[34447,"STATION RD (PENROSE)","Central East"]
[71035,"STATION RD (PUKEKOHE)","South Rural"]
[60371,"STATION RD (TAKANINI)","South West Urban"]
[10896,"STATION RD 2 (WELLSFORD)","North Rural"]
[54739,"STATION RD CARPARK (RP142 RHS)","South West Urban"]
[54798,"STATION RD CARPARK ACCESS (RP391)","South West Urban"]
[54799,"STATION RD PARK AND RIDE CARPARK","South West Urban"]
[54800,"STATION RD SERVICE LANE (RP142 RHS)","South West Urban"]
[15455,"STATION RD/JAMES RD CYWAY","South West Urban"]
[54561,"STATION RD/WYLLIE RD SLIP","South West Urban"]
[47377,"STATION ST","North Urban West"]
[47378,"STATION ST-RD 10","North Urban West"]
[54313,"STATION/MAICH RAB","South West Urban"]
[34449,"STAVELEY AVE","Central"]
[52398,"STAVERTON CRES","South West Urban"]
[53960,"STAVERTON CRES-NORTON PL","South West Urban"]
[40391,"STEAM HAULER TRACK","West"]
[22907,"STEAMER PL","North Urban West"]
[80229,"STEAMER RD","North Urban East"]
[31270,"STEDMAN PL","West"]
[40390,"STEED RD (PVT)","West"]
[70568,"STEEL RD","South Rural"]
[31271,"STEELE ST","Central East"]
[52399,"STEEN PL","South West Urban"]
[52400,"STEEPLE RISE","South East Urban"]
[34450,"STEINS AVE (PVT)","Central"]
[70570,"STELLA DR","South Rural"]
[80278,"STELLA MARIS LANE","North Urban East"]
[52401,"STELLA PL","South West Urban"]
[53197,"STELLAMARIS WAY","South East Urban"]
[53366,"STELLATA CRT","South West Urban"]
[54338,"STELLATA CRT LOOP","South West Urban"]
[71036,"STEMBRIDGE AVE","South Rural"]
[22728,"STEPHANIE CLOSE","North Urban West"]
[40389,"STEPHEN AVE","West"]
[34451,"STEPHEN LYSNAR PL","Central"]
[52402,"STERLING AVE","South West Urban"]
[52403,"STERLING ST","South West Urban"]
[52404,"STEVEN ST","South West Urban"]
[70571,"STEVENS RD","South Rural"]
[70572,"STEVENSON RD","South Rural"]
[52405,"STEVENSON WAY","South East Urban"]
[20725,"STEVENSONS CRES","North Urban West"]
[41370,"STEVIES LANE","West"]
[34452,"STEWART AVE","Central East"]
[52956,"STEWART GIBSON PL","South West Urban"]
[52406,"STEWART PL","South West Urban"]
[34453,"STEWART RD","Central"]
[11140,"STEWART ST (HELENSVILLE)","North Rural"]
[60266,"STEWART ST (RED HILL)","South West Urban"]
[80660,"STILE PL","South Rural"]
[10897,"STILLWATER CRES","North Urban East"]
[34455,"STILWELL RD","Central"]
[31272,"STIRLING ST","Central East"]
[22460,"STITCHBIRD CLOSE","North Urban East"]
[40114,"STOCK ST","West"]
[71515,"STOCKMANS LANE","South Rural"]
[41249,"STOCKTON PL","West"]
[71535,"STOCKYARD CRES","South Rural"]
[34456,"STODDARD PL","Central"]
[31273,"STODDARD RD","Central"]
[35956,"STODDARD RD CARPARK (RP1552 RHS)","Central"]
[35837,"STODDARD/MAY RAB","Central"]
[40387,"STOKES AVE","West"]
[31274,"STOKES RD","Central"]
[47106,"STOLFORD CRES","West"]
[52407,"STOLL PL","South West Urban"]
[70573,"STONE RD","South Rural"]
[20121,"STONE ST","North Urban East"]
[53453,"STONEBROOK LANE","South East Urban"]
[80494,"STONEDALE DR","South Rural"]
[80495,"STONEDALE DR (SOUTH)","South Rural"]
[22764,"STONEDGE LANE","North Urban West"]
[52408,"STONEDON DR","South East Urban"]
[35983,"STONEFIELDS AVE","Central East"]
[31701,"STONEFIELDS/STONEMASON RAB","Central East"]
[31700,"STONEFIELDS/TIHI RAB","Central East"]
[47188,"STONEGATE CLOSE","West"]
[54822,"STONEHILL DR","South West Urban"]
[70881,"STONEHURST AVE","South Rural"]
[22686,"STONELEIGH CRT","North Urban East"]
[35982,"STONEMASON AVE","Central East"]
[52409,"STONEX RD","South West Urban"]
[11354,"STONEY CREEK DR","West"]
[10898,"STONEY CREEK RD","North Rural"]
[31275,"STONEYROYD GARDENS","Central East"]
[35632,"STORMONT PL","Central"]
[53411,"STORNAWAY DR","South East Urban"]
[22188,"STOTT AVE","North Urban West"]
[40386,"STOTTHOLM RD","West"]
[47352,"STOW PL","West"]
[20687,"STRABO PL","North Urban West"]
[34458,"STRANOLAR DR","Central"]
[53591,"STRANRAER CRES","South West Urban"]
[15753,"STRANRAER CRES LINK CYWAY(RP230)","South West Urban"]
[15752,"STRANRAER CRES LINK CYWAY(RP483)","South West Urban"]
[20247,"STRATFORD AVE","North Urban East"]
[52410,"STRATFORD RD","South West Urban"]
[31276,"STRATFORD ST","Central"]
[31688,"STRATFORD ST LLA (#18 - #20)","Central"]
[80519,"STRATHAVEN RD","South West Urban"]
[52879,"STRATHFIELD LANE","South Rural"]
[22535,"STRATHMOOR DR (L FORK)(PVT)","North Urban East"]
[24117,"STRATHMOOR DR (PVT)","North Urban East"]
[22536,"STRATHMOOR DR (R FORK)(PVT)","North Urban East"]
[34459,"STRATHNAVER CRES","Central"]
[31277,"STRATTON LANE","Central East"]
[10899,"STREAMLANDS SWAMP RD","North Rural"]
[22462,"STREDWICK DR","North Urban East"]
[40385,"STRID RD","West"]
[31278,"STRONG ST","Central East"]
[47337,"STROUD PL","West"]
[47338,"STROUD PL EXTN","West"]
[52411,"STRUAN PL","South East Urban"]
[53534,"STRUNDEEN CLOSE","South East Urban"]
[70575,"STUART RD (PAPARATA)","South Rural"]
[70576,"STUART RD (PUKEKOHE)","South Rural"]
[31279,"STUART ST","Central"]
[23061,"STUBBS PL","North Urban West"]
[31616,"STUD WAY","Central East"]
[52412,"STUDFALL ST","South East Urban"]
[31280,"STUDHOLME ST","Central"]
[52413,"STURDEE RD","South West Urban"]
[53962,"STURDEE RD-GIBBS RD","South West Urban"]
[31281,"STURDEE ST","Central"]
[34460,"STURGES AVE","South West Urban"]
[47370,"STURGES RAIL STATION CARPARK","West"]
[40187,"STURGES RD","West"]
[41195,"STURGES/SAN BERNADINO RAB","West"]
[47209,"STURGES/SUMMERLAND RAB","West"]
[40384,"STURM AVE","West"]
[48288,"STURM AVE WWAY","West"]
[48287,"STURM AVE WWAY - STURM #20 WWAY","West"]
[41390,"STURM/QUEEN NATALIE RAB","West"]
[35988,"STYAK ST","Central East"]
[40383,"STYCA PL","West"]
[34461,"SUBRITZKY AVE","Central"]
[52414,"SUBSTATION RD (PVT)","South West Urban"]
[60230,"SUBWAY RD (PAPAKURA)","South West Urban"]
[71037,"SUBWAY RD (PUKEKOHE)","South Rural"]
[11101,"SUCCESS CRT","North Rural"]
[22812,"SUCKLING'S LANE","North Urban West"]
[34462,"SUDA PL","Central East"]
[20243,"SUDAN AVE","North Urban East"]
[35627,"SUDBURY TCE (PVT)","Central"]
[31282,"SUDELEY ST","Central East"]
[31283,"SUFFOLK ST","Central"]
[35040,"SUGARLOAF RD","Hauraki Islands"]
[34463,"SUITER ST","Central"]
[52415,"SULLIVAN AVE","South West Urban"]
[53963,"SULLIVAN AVE-KOWHAI AVE","South West Urban"]
[21083,"SULPHUR BEACH RD","North Urban West"]
[35925,"SULTAN LANE (PVT)","Central East"]
[34465,"SULTAN ST","Central East"]
[40382,"SUMICH PL","West"]
[22529,"SUMMER ST (DEVONPORT)","North Urban East"]
[31284,"SUMMER ST (PONSONBY)","Central"]
[22787,"SUMMERFIELD LANE","North Urban West"]
[35065,"SUMMERHILL PL","Central East"]
[47107,"SUMMERLAND DR","West"]
[40120,"SUMMERLAND/HARVEST RAB","West"]
[52416,"SUMMERMIST DR","South East Urban"]
[34466,"SUMMIT DR (MT ALBERT)","Central"]
[22463,"SUMMIT DR (TORBAY)","North Urban East"]
[52417,"SUMNER ST","South West Urban"]
[47126,"SUN PL","West"]
[10900,"SUN VALLEY","North Urban East"]
[10901,"SUNBURST AVE","North Rural"]
[22464,"SUNBURST LANE","North Urban East"]
[60231,"SUNBURST ST","South West Urban"]
[41250,"SUNCREST DR","North Urban West"]
[48234,"SUNCREST DRV WWAY","North Urban West"]
[80643,"SUNDERLAND AVE","North Urban West"]
[34467,"SUNDERLAND ST (PVT)","Central"]
[52418,"SUNDERLANDS RD","South East Urban"]
[10902,"SUNDOWN AVE","North Urban East"]
[51421,"SUNGLADE GR","South East Urban"]
[40381,"SUNGROVE RISE","West"]
[20421,"SUNHAVEN PL","North Urban West"]
[40380,"SUNHILL RD","West"]
[52419,"SUNKIST BAY RD","South Rural"]
[52420,"SUNLANDS DR","South West Urban"]
[10903,"SUNLIGHT PROMENADE","North Rural"]
[40379,"SUNLINE AVE","West"]
[48312,"SUNLINE AVE WWAY","West"]
[52421,"SUNNINGDALE ST","South West Urban"]
[15645,"SUNNINGDALE ST WATERSIDE CYWAY","South West Urban"]
[31285,"SUNNY BRAE CRES","Central"]
[11337,"SUNNY CRES","North Rural"]
[20023,"SUNNYBRAE RD","North Urban West"]
[20858,"SUNNYBRAE RD SERVICE LANE","North Urban West"]
[22827,"SUNNYDALE PL","North Urban West"]
[20501,"SUNNYFIELD CRES","North Urban West"]
[22189,"SUNNYHAVEN AVE","North Urban West"]
[20841,"SUNNYHAVEN AVE SERVICE LANE","North Urban West"]
[10904,"SUNNYHEIGHTS RD","North Urban East"]
[52422,"SUNNYHILL CRES","South East Urban"]
[15815,"SUNNYHILL CRES/BLUE GUM RISE CYWAY","South East Urban"]
[40050,"SUNNYLAW PL","West"]
[31286,"SUNNYMEAD RD","Central East"]
[35877,"SUNNYMEAD/TANIWHA WWAY (RP180)","Central East"]
[23050,"SUNNYNOOK BUS STATION ACCESS","North Urban East"]
[25006,"SUNNYNOOK BUSWAY","North Urban East"]
[20052,"SUNNYNOOK RD (EAST)","North Urban East"]
[80446,"SUNNYNOOK RD (WEST)","North Urban West"]
[26026,"SUNNYNOOK RD CARPARK DP 124455","North Urban East"]
[26031,"SUNNYNOOK RESERVE CARPARK","North Urban East"]
[60232,"SUNNYPARK AVE","South West Urban"]
[34468,"SUNNYRIDGE PL","Central"]
[52423,"SUNNYSIDE CRES","South West Urban"]
[10905,"SUNNYSIDE RD (COATESVILLE)","North Rural"]
[40378,"SUNNYSIDE RD (SUNNYVALE)","West"]
[15105,"SUNNYSIDE RD LINK CYWAY","West"]
[47211,"SUNNYSIDE/SEYMOUR RAB","West"]
[31287,"SUNNYVALE RD (GREENLANE)","Central"]
[10472,"SUNNYVALE RD (KUMEU)","West"]
[40188,"SUNNYVALE RD (WAITAKERE)","West"]
[15144,"SUNNYVALE TRAIN STATION LINK CYWAY","West"]
[52424,"SUNNYVIEW AVE","South East Urban"]
[20607,"SUNNYVIEW RD","North Urban West"]
[47306,"SUNPARK PL","West"]
[40377,"SUNRAY AVE","West"]
[22465,"SUNRISE AVE","North Urban East"]
[10906,"SUNRISE BOULEVARD","North Rural"]
[40376,"SUNRISE LANE","West"]
[71329,"SUNSET DR","South Rural"]
[80447,"SUNSET RD (EAST)","North Urban East"]
[20053,"SUNSET RD (WEST)","North Urban West"]
[23018,"SUNSET RD BUS RAMP","North Urban West"]
[22596,"SUNSET RD LLA (#120 - #130)","North Urban West"]
[22593,"SUNSET RD LLA (#14 - #26)","North Urban West"]
[22594,"SUNSET RD LLA (#162 - #168)","North Urban West"]
[22595,"SUNSET RD LLA (#289 - #299)","North Urban East"]
[34470,"SUNSET VIEW RD (EAST)","Central East"]
[36096,"SUNSET VIEW RD (WEST)","Central East"]
[80042,"SUNSHINE BOULEVARD","West"]
[51559,"SUNSHINE LANE","South East Urban"]
[60233,"SUNSHINE PL","South West Urban"]
[22930,"SUNVISTA AVE","North Urban West"]
[40375,"SUNVUE RD","West"]
[48066,"SUNVUE RD WWAY","West"]
[20537,"SUNWARD RISE","North Urban West"]
[54761,"SUPERCLINIC RD (EASTBOUND)","South West Urban"]
[54760,"SUPERCLINIC RD (WESTBOUND)","South West Urban"]
[40147,"SURAT PL","West"]
[48045,"SURAT PL WWAY","West"]
[10907,"SURF RD","North Urban East"]
[34471,"SURFDALE RD","Hauraki Islands"]
[40008,"SURMAN PL","West"]
[31288,"SURREY CRES","Central"]
[52425,"SURREY ST","South West Urban"]
[22466,"SURVILLE PL","North Urban East"]
[52426,"SUSANNE PL","South East Urban"]
[31289,"SUSSEX ST","Central"]
[10908,"SUSSEX TCE","North Rural"]
[52427,"SUTCLIFFE PL","South West Urban"]
[31290,"SUTHERLAND RD","Central"]
[34472,"SUTTIES LANE (PVT)","Central East"]
[52428,"SUTTON AVE","South West Urban"]
[60234,"SUTTON CRES (PAPAKURA)","South West Urban"]
[52429,"SUTTON CRES (PAPATOETOE)","South West Urban"]
[52430,"SUTTON RD (BROOKBY)","South Rural"]
[60374,"SUTTON RD (DRURY)","South West Urban"]
[60711,"SUTTON RD (OPAHEKE) (SR)","South Rural"]
[52431,"SUWYN PL","South West Urban"]
[53964,"SUWYN PL-WAIMAI AVE","South West Urban"]
[52432,"SUZETTA PL","South East Urban"]
[71555,"SVENDSEN ST","South Rural"]
[52433,"SWAFFIELD RD","South West Urban"]
[54181,"SWAFFIELD RD CARPARK (RP189 LHS)","South West Urban"]
[31291,"SWAINSTON RD","Central East"]
[52434,"SWALLOW DR","South West Urban"]
[80391,"SWAMP KAURI GR NORTH","South West Urban"]
[80390,"SWAMP KAURI GR SOUTH","South West Urban"]
[52435,"SWAN CRES","South East Urban"]
[47280,"SWAN HILL DR","West"]
[40374,"SWAN LANE","West"]
[10909,"SWANN BEACH RD","North Urban East"]
[11272,"SWANN BEACH RD 3 - 9","North Urban East"]
[11273,"SWANN BEACH RD 63 - 71","North Urban East"]
[41430,"SWANSON OAKS","West"]
[40373,"SWANSON RD (HENDERSON)","West"]
[53012,"SWANSON RD (MANGERE)","South West Urban"]
[48120,"SWANSON RD WWAY","West"]
[31292,"SWANSON ST","Central"]
[47210,"SWANSON/METCALFE RAB","West"]
[40372,"SWANSON/UNIVERSAL RAB","West"]
[71387,"SWEETCORN PL","South Rural"]
[31293,"SWIFT AVE","Central"]
[31294,"SWINBURNE ST","West"]
[54814,"SWINDON CLOSE","South East Urban"]
[36063,"SWINTON CLOSE (PVT)","Central East"]
[53181,"SWORDFISH PL","South Rural"]
[20345,"SYCAMORE DR","North Urban East"]
[54188,"SYCAMORE ST","South East Urban"]
[34473,"SYDENHAM RD","Central"]
[70580,"SYDNEY OWEN RD","South Rural"]
[20122,"SYDNEY ST","North Urban East"]
[10910,"SYKES AVE","North Urban East"]
[15438,"SYKES R/MOUNTFORT PARK CYWAY(RP434)","South West Urban"]
[52436,"SYKES RD","South West Urban"]
[54352,"SYKES RD CARPARK (RP186 LHS)","South West Urban"]
[54353,"SYKES RD CARPARK (RP234 LHS)","South West Urban"]
[54354,"SYKES RD CARPARK (RP293 LHS)","South West Urban"]
[54355,"SYKES RD CARPARK (RP356 LHS)","South West Urban"]
[15437,"SYKES RD/DR PICKERING AVE CYWAY (RP677)","South West Urban"]
[54324,"SYKES/MOUNTFORT PARK RAB","South West Urban"]
[21084,"SYLVAN AVE","North Urban West"]
[34474,"SYLVAN AVE EAST","Central"]
[34475,"SYLVAN AVE WEST","Central"]
[40371,"SYLVAN CRES","West"]
[40370,"SYLVAN GL","West"]
[20186,"SYLVAN PARK AVE","North Urban East"]
[22551,"SYLVAN PARK AVE LOWER","North Urban East"]
[22552,"SYLVAN PARK AVE UPPER","North Urban East"]
[40369,"SYLVAN VALLEY AVE","West"]
[34476,"SYLVANIA CRES","Central"]
[34477,"SYLVESTER AVE","Central"]
[34478,"SYLVIA AVE (PVT)","Central East"]
[34479,"SYLVIA PARK RD","Central East"]
[21085,"SYLVIA RD (NORTHCOTE)","North Urban West"]
[31295,"SYLVIA RD (ST HELIERS)","Central East"]
[31296,"SYMONDS ST (CITY)","Central"]
[30831,"SYMONDS ST (CITY/NORTHBOUND)","Central"]
[34480,"SYMONDS ST (ONEHUNGA)","Central East"]
[31665,"SYMONDS ST EXTN (ONEHUNGA)","Central East"]
[31534,"SYMONDS/WELLESLEY EAST RAMP","Central"]
[60373,"SYNTAX PL","South West Urban"]
[22773,"SYRACUSE PL","North Urban West"]
[22813,"SYRACUSE PL HAMMERHEAD","North Urban West"]
[80289,"SYRAH CRES","West"]
[53107,"TAATAHI ST","South West Urban"]
[52437,"TABAGO PL","South East Urban"]
[40368,"TABITHA CRES","West"]
[20366,"TABLEAU PL","North Urban West"]
[20365,"TACITUS PL","North Urban West"]
[52438,"TACOMA RD","South West Urban"]
[52439,"TACON PL","South West Urban"]
[52440,"TADLEY CRT","South West Urban"]
[31297,"TAGALAD RD","Central East"]
[54232,"TAGATA WAY","South West Urban"]
[40367,"TAGOR ST","West"]
[10911,"TAHA RD","North Rural"]
[40366,"TAHA RD (TE ATATU)","West"]
[31299,"TAHAPA CRES","Central East"]
[20007,"TAHAROTO RD","North Urban East"]
[34482,"TAHATAI RD","Hauraki Islands"]
[34481,"TAHATAI ST","South West Urban"]
[10912,"TAHEKEROA RD","North Rural"]
[34483,"TAHI RD","Hauraki Islands"]
[40064,"TAHI TCE","West"]
[53687,"TAHINGA DR (PVT)","South West Urban"]
[21086,"TAHINGA ST","North Urban West"]
[31300,"TAHORA AVE","Central East"]
[20357,"TAHU CRES","North Urban East"]
[70581,"TAHUNA PA RD","South Rural"]
[31301,"TAHUNA ST","Central"]
[70584,"TAHURANGATIRA RD","South Rural"]
[34484,"TAHURI RD","Central"]
[10913,"TAIAPA RD","North Rural"]
[11580,"TAIAWA PL","North Rural"]
[34485,"TAIERE TCE","Central East"]
[70582,"TAIHIKI RD","South Rural"]
[40365,"TAIKATA RD","West"]
[52830,"TAIKO CRT","South East Urban"]
[70583,"TAINUI RD (AWHITU)","South Rural"]
[22091,"TAINUI RD (DEVONPORT)","North Urban East"]
[52441,"TAINUI RD (HOWICK)","South East Urban"]
[33011,"TAINUI RD (ST JOHNS)","Central East"]
[40364,"TAINUI RD (WAITAKERE)","West"]
[22467,"TAINUI ST","North Urban East"]
[52442,"TAINUI TCE","South West Urban"]
[40363,"TAIOMA CRES","West"]
[60450,"TAIPAN PL","South West Urban"]
[40362,"TAIPARI RD","West"]
[60235,"TAIRERE CRES","South West Urban"]
[10914,"TAIRERE RD","North Rural"]
[22613,"TAIT PL","North Urban West"]
[31302,"TAIT ST","West"]
[33142,"TAIT ST HLA (#5 - #21)","West"]
[40361,"TAITAPU ST","West"]
[52443,"TAITIMU DR","South West Urban"]
[31303,"TAITOKERAU WAY","Central East"]
[40360,"TAITUA DR","West"]
[48137,"TAITUA DRV WWAY","West"]
[60379,"TAKA ST","South West Urban"]
[15422,"TAKA ST/MARU RD CYWAY","South West Urban"]
[80576,"TAKAHE AVE (NORTHBOUND)","South West Urban"]
[80575,"TAKAHE AVE (SOUTHBOUND)","South West Urban"]
[40359,"TAKAHE RD","West"]
[60376,"TAKANINI RD","South West Urban"]
[60380,"TAKANINI SCHOOL RD","South West Urban"]
[40358,"TAKAPU ST","West"]
[80614,"TAKAPU WAY","North Urban East"]
[23045,"TAKAPUNA LANDING","North Urban East"]
[23047,"TAKAPUNA LANDING DEC","North Urban East"]
[23046,"TAKAPUNA LANDING INC","North Urban East"]
[26032,"TAKAPUNA LIBRARY UNDERGRND CARPARK","North Urban East"]
[22093,"TAKARUNGA RD","North Urban East"]
[60521,"TAKATU PL","South West Urban"]
[10915,"TAKATU RD","North Rural"]
[31304,"TAKAU ST","Central"]
[31305,"TAKITIMU ST","Central East"]
[52444,"TAKUTAI AVE","South East Urban"]
[31307,"TAKUTAI ST","Central"]
[31687,"TAKUTAI ST LLA (#32 - #20)","Central"]
[54658,"TAKUTAI/SEA SPRAY RAB","South East Urban"]
[40357,"TALAVERA PL","West"]
[15414,"TALGA CRT/BROCKTON AVE CYWAY","South West Urban"]
[60451,"TALGA PL","South West Urban"]
[22468,"TALLINGTON CRES","North Urban East"]
[40356,"TALMAR PL","West"]
[41254,"TAMA QUADRANT (PVT)","North Urban West"]
[20521,"TAMAHERE DR","North Urban West"]
[80183,"TAMAHERE DR HAMMERHEAD","North Urban West"]
[80184,"TAMAHERE-KAIPATIKI  WWAY","North Urban West"]
[11596,"TAMAHUNGA DR","North Rural"]
[34487,"TAMAKI AVE","South West Urban"]
[52445,"TAMAKI BAY DR","South East Urban"]
[54744,"TAMAKI BAY DR CARPARK (RP338 RHS)","South East Urban"]
[31309,"TAMAKI DR","Central East"]
[31596,"TAMAKI DR BUS LOOP (RP5507 LHS)","Central East"]
[15547,"TAMAKI STRAIT RESERVE LAKE LINK CYWAY","South East Urban"]
[35869,"TAMAKI/MARAU WWAY (RP5437 RHS)","Central East"]
[52446,"TAMAR PL","South West Urban"]
[40355,"TAMARIKI AVE (KELSTON)","West"]
[10916,"TAMARIKI AVE (OREWA)","North Urban East"]
[11268,"TAMARIKI DR SERVICE LANE","North Urban East"]
[31310,"TAMATEA AVE","Central East"]
[10917,"TAMATEA DR","North Rural"]
[10918,"TAMERLANE RD","North Rural"]
[52448,"TAMPIN RD","South West Urban"]
[52449,"TAMWORTH CLOSE","South West Urban"]
[54330,"TAMWORTH CLOSE HAMMERHEAD (NORTH)","South West Urban"]
[54331,"TAMWORTH CLOSE HAMMERHEAD (SOUTH)","South West Urban"]
[60493,"TANAH MERAH DR","South West Urban"]
[40354,"TANE RD","West"]
[40352,"TANE RD EXTN #1","West"]
[40353,"TANE RD EXTN #2","West"]
[40098,"TANE ST","West"]
[40351,"TANEKAHA RD","West"]
[34489,"TANEKAHA ST","Central"]
[31311,"TANGAROA ST","Central East"]
[52450,"TANGELO PL","South East Urban"]
[35574,"TANGIHUA ST (NORTHBOUND)","Central"]
[31442,"TANGIHUA ST (SOUTHBOUND)","Central"]
[52451,"TANGLEWOOD PL","South East Urban"]
[40350,"TANGO PL","West"]
[31312,"TANIA PL","West"]
[31313,"TANIWHA ST","Central East"]
[31582,"TANIWHA/APIRANA BUS LOOP","Central East"]
[31557,"TANIWHA/ELSTREE RAB","Central East"]
[34763,"TANIWHA/FELTON MATHEW WWAY","Central East"]
[35829,"TANIWHA/LINE RAB","Central East"]
[35878,"TANIWHA/LYNDHURST WWAY (RP2067)","Central East"]
[31558,"TANIWHA/SHOPPING CENTRE RAB","Central East"]
[52452,"TANNERS RD","South West Urban"]
[52453,"TANNOCK PL","South West Urban"]
[54570,"TANNOCK PL HAMMERHEAD","South West Urban"]
[40349,"TANOA PL","West"]
[34872,"TANSLEY AVE","Central"]
[60236,"TAONUI ST","South West Urban"]
[35289,"TAPORA ST","Central"]
[10919,"TAPU BUSH RD","North Rural"]
[10920,"TAPU RD","North Rural"]
[10921,"TARA PL","North Rural"]
[40348,"TARA RD","West"]
[21087,"TARAHANGA ST","North Urban West"]
[80588,"TARAIRE PL","North Urban East"]
[40347,"TARAIRE RD","West"]
[34495,"TARAIRE ST","Hauraki Islands"]
[31314,"TARAMEA ST","West"]
[31315,"TARANAKI RD","Central East"]
[31316,"TARANTO PL","Central East"]
[40346,"TARANUI PL","West"]
[48088,"TARANUI PL WWAY","West"]
[60640,"TARAPIROE AVE","South West Urban"]
[80407,"TARAPIROE AVE (WESTBOUND)","South West Urban"]
[52454,"TARATA CRES","South West Urban"]
[53965,"TARATA CRES-MILLER RD","South West Urban"]
[34496,"TARATA ST","Central"]
[31318,"TARATOA ST","Central East"]
[35876,"TARATOA/TORINO WWAY (RP249 RHS)","Central East"]
[10922,"TARAWERA RD","North Rural"]
[31317,"TARAWERA TCE","Central East"]
[40200,"TAREMARO PL","West"]
[20577,"TARGET CRT","North Urban West"]
[22588,"TARGET CRT LINK","North Urban West"]
[20051,"TARGET RD","North Urban West"]
[31319,"TARGET ST","Central"]
[22720,"TARNDALE GR","North Urban West"]
[52455,"TARNICA RD","South East Urban"]
[15482,"TARNICA RD/BOWSCALE PL CYWAY","South East Urban"]
[22688,"TAROKA CLOSE","North Urban West"]
[10923,"TARRANT RD","North Rural"]
[31320,"TASMAN AVE (MT ALBERT)","Central"]
[41270,"TASMAN AVE (WAITAKERE)","West"]
[60237,"TASMAN DR","South West Urban"]
[71038,"TASMAN ST","South Rural"]
[80510,"TASMAN VIEW ESPLANADE","West"]
[40345,"TASMAN VIEW RD","West"]
[40198,"TASMAN VIEW RD EXTN","West"]
[60238,"TATARIKI ST","South West Urban"]
[40344,"TATAU WAY","West"]
[52456,"TATE GR (PVT)","South East Urban"]
[52457,"TATE PL (OTARA)","South West Urban"]
[10924,"TATES CRT","North Urban East"]
[11192,"TATHAM RD","North Rural"]
[60377,"TATUA PL","South West Urban"]
[40343,"TATYANA PL","West"]
[40342,"TAUHARA ST","West"]
[20056,"TAUHINU RD","North Urban West"]
[15026,"TAUHINU RD/SQUADRON DR CYWAY","North Urban West"]
[10925,"TAUHOA RD","North Rural"]
[11467,"TAUMATA RD (OMAHA)","North Rural"]
[34491,"TAUMATA RD (SANDRINGHAM)","Central"]
[20231,"TAUMATA ST","North Urban East"]
[31322,"TAUNTON TCE (EAST)","West"]
[31321,"TAUNTON TCE (WEST)","West"]
[35744,"TAUNTON/ENDEAVOUR WWAY (RP280)","West"]
[36112,"TAUOMA CRES","Central East"]
[10926,"TAUPAKI RD","North Rural"]
[34492,"TAUPATA ST","Central"]
[40340,"TAUPIKO PL","West"]
[40339,"TAUPO ST","West"]
[11450,"TAURANGA PL","North Urban East"]
[11451,"TAURANGA PL SIDE RD (PVT)","North Urban East"]
[70585,"TAURANGARURU RD","South Rural"]
[31323,"TAURARUA TCE","Central"]
[31324,"TAURIMA AVE","Central East"]
[35889,"TAURIMA/ANDERSON WWAY (RP94 RHS)","Central East"]
[22192,"TAURUS CRES","North Urban West"]
[31325,"TAUTARI ST","Central East"]
[35849,"TAUTARI/APIHAI WWAY (RP561 RHS)","Central East"]
[80330,"TAUTINI PL","North Urban East"]
[80505,"TAUWAKA CRESENT","North Rural"]
[52458,"TAVERN LANE","South West Urban"]
[54575,"TAVERN LANE CARPARK (RP278 RHS)","South West Urban"]
[10927,"TAVERN RD","North Urban East"]
[52459,"TAVISTOCK ST","South West Urban"]
[52460,"TAWA CRES","South West Urban"]
[22606,"TAWA DR","North Urban West"]
[70889,"TAWA PL","South Rural"]
[80587,"TAWA PL (OREWA)","North Urban East"]
[10928,"TAWA RD (KUMEU)","North Rural"]
[34498,"TAWA RD (ONEHUNGA)","Central East"]
[40338,"TAWA RD (WAITAKERE)","West"]
[34497,"TAWA ST","Hauraki Islands"]
[31716,"TAWA ST EXTN (RP520 LHS)","Hauraki Islands"]
[60641,"TAWAKI AVE","South West Urban"]
[40337,"TAWARI RD","West"]
[34499,"TAWARI ST","Central"]
[31326,"TAWARIKI ST","Central"]
[35773,"TAWARIKI/MOIRA WWAY (RP217 RHS)","Central"]
[20375,"TAWAVALE CRES","North Urban West"]
[34500,"TAWERA RD","Central"]
[10929,"TAWHANA CRES","North Urban East"]
[70586,"TAWHERO RD","South Rural"]
[80662,"TAWHIA DR","West"]
[34501,"TAWHIRI RD","Central East"]
[40336,"TAWINI RD","West"]
[31327,"TAY ST","Central"]
[36064,"TAYLOR CLOSE (PVT)","West"]
[34502,"TAYLOR CRT (PVT)","West"]
[52461,"TAYLOR RD (MANGERE)","South West Urban"]
[70587,"TAYLOR RD (PATUMAHOE)","South Rural"]
[10930,"TAYLOR RD (WAIMAUKU)","North Rural"]
[31328,"TAYLOR ST","West"]
[30092,"TAYLOR/BOLTON RAB","West"]
[30096,"TAYLOR/BUSBY RAB","West"]
[34503,"TAYLORS RD (EAST)","Central"]
[30468,"TAYLORS RD (WEST)","Central"]
[20508,"TAYNITH PL","North Urban West"]
[40335,"TE AHUAHU RD","West"]
[52462,"TE AKAU CRES","South East Urban"]
[52463,"TE ANAU PL","South East Urban"]
[34504,"TE APUNGA PL","Central East"]
[54838,"TE ARA KAHIKATEA CARPARK 1 (RP349)","South East Urban"]
[54836,"TE ARA KAHIKATEA CARPARK 2 (RP33)","South East Urban"]
[54742,"TE ARA KAHIKATEA RAB","South East Urban"]
[54741,"TE ARA KAHIKATEA RD","South East Urban"]
[80473,"TE ARA KAHIKATEA RD (NORTHBOUND)","South East Urban"]
[10932,"TE ARAI POINT RD","North Rural"]
[22696,"TE ARAROA RD","North Urban West"]
[31330,"TE ARAWA ST","Central East"]
[34505,"TE AROHA AVE (PVT)","Hauraki Islands"]
[40334,"TE ATATU RD","West"]
[47231,"TE ATATU RD (SOUTHBOUND)","West"]
[47223,"TE ATATU RD HLA (#354 - #360)","West"]
[15167,"TE ATATU RD LINK CYWAY","West"]
[48140,"TE ATATU RD WWAY","West"]
[41326,"TE ATATU/EDMONTON RAB","West"]
[47212,"TE ATATU/GLORIA RAB","West"]
[40927,"TE ATATU/TAIKATA RAB","West"]
[40333,"TE AUTE RIDGE RD (EAST)","West"]
[40332,"TE AUTE RIDGE RD (WEST)","West"]
[80615,"TE AWA PL","North Urban East"]
[34506,"TE HANA RD","Central East"]
[40331,"TE HENGA RD","West"]
[22697,"TE HOE GR","North Urban West"]
[22698,"TE HOE GR SIDE RD","North Urban West"]
[80493,"TE HORETA RD (EASTBOUND)","Central East"]
[80492,"TE HORETA RD (WESTBOUND)","Central East"]
[53205,"TE IRIRANGI DR (EAST BOUND/MANUKAU) (SW)","South West Urban"]
[54802,"TE IRIRANGI DR (EAST BOUND/TAMAKI) (SE)","South East Urban"]
[54803,"TE IRIRANGI DR (WEST BOUND/MANUKAU) (SW)","South West Urban"]
[53204,"TE IRIRANGI DR (WEST BOUND/TAMAKI) (SE)","South East Urban"]
[15474,"TE IRIRANGI DR/REINHEIMER PL CYWAY (RP2969)","South East Urban"]
[15472,"TE IRIRANGI DR/SAMBROOKE CRES CYWAY(RP5113)","South East Urban"]
[15473,"TE IRIRANGI DR/SPEYSIDE CRES CYWAY(RP2808)","South East Urban"]
[15475,"TE IRIRANGI DR/WILIAM WOODS CT CYWAY (RP2245)","South East Urban"]
[60628,"TE KAHU PL","South West Urban"]
[10933,"TE KANAE RD","North Rural"]
[40330,"TE KANAWA CRES","West"]
[48174,"TE KANAWA CRES WWAY","West"]
[10934,"TE KAPA PL","North Rural"]
[11513,"TE KAURI PL","North Rural"]
[22583,"TE KAWA PASS","North Urban West"]
[34507,"TE KAWA RD","Central East"]
[35902,"TE KAWA/NGATIAWA WWAY (RP777)","Central East"]
[22721,"TE KEA PL","North Urban West"]
[34742,"TE KOA RD","Central East"]
[53686,"TE KOHA RD","South East Urban"]
[53109,"TE KOHA RD (PVT)","South East Urban"]
[31331,"TE KOWHAI PL","Central East"]
[34744,"TE MAKIRI RD","Hauraki Islands"]
[80598,"TE MAKURU LANE","South Rural"]
[11555,"TE MANA PL","North Rural"]
[34743,"TE MARAMA RD","Central East"]
[36065,"TE MATUKU POINT LANE (PVT)","Hauraki Islands"]
[11556,"TE MAURI PL","North Rural"]
[35261,"TE MIRO LANE (PVT)","Hauraki Islands"]
[10935,"TE MOAU AVE","North Rural"]
[51712,"TE MOTU WAY","South West Urban"]
[10936,"TE NGAIO POINT RD","North Rural"]
[80326,"TE ONEROA WAY (NB)","North Urban East"]
[80499,"TE ONEROA WAY (SB)","North Urban East"]
[40329,"TE PAI PL","West"]
[48189,"TE PAI PL WWAY","West"]
[52464,"TE PAPA RD","South Rural"]
[52465,"TE PENE RD","South Rural"]
[10937,"TE PUA SCHOOL RD","North Rural"]
[11249,"TE PUA SCHOOL RD ACCESS RD","North Rural"]
[54132,"TE PURU DR","South Rural"]
[15619,"TE PURU PARK EASTERN CYWAY","South Rural"]
[15621,"TE PURU PARK WESTERN CYWAY","South Rural"]
[31333,"TE RA RD","Central"]
[35667,"TE RANGITAWHIRI RD","Hauraki Islands"]
[11601,"TE RURU WAY","North Urban East"]
[35291,"TE TAOU CRES","Central"]
[34745,"TE TOKI RD","Hauraki Islands"]
[70590,"TE TORO RD","South Rural"]
[80698,"TE TUHI TCE","South East Urban"]
[22886,"TE WHARAU DR","North Urban West"]
[35015,"TE WHAU DR","Hauraki Islands"]
[31334,"TE WIATA PL","West"]
[52466,"TEAK GR","South West Urban"]
[22193,"TEAL CRES","North Urban West"]
[80401,"TEAL WAY","North Urban West"]
[70588,"TEAROE RD","South Rural"]
[34746,"TECOMA ST","Central East"]
[31329,"TED WILLIAM ST","West"]
[80325,"TEE POINT RD","North Urban East"]
[24042,"TEED LANE (PVT)","North Urban West"]
[34747,"TEED ST","Central"]
[53093,"TEELIN PL","South East Urban"]
[60424,"TEGAL RD","South Rural"]
[23025,"TEKAPO RISE","North Urban West"]
[22194,"TELEPHONE RD","North Urban West"]
[34749,"TELFORD AVE","Central"]
[41371,"TELLIN CLOSE","West"]
[35675,"TELPHER ST (PVT)","Central"]
[22195,"TELSTAR PL","North Urban West"]
[31332,"TEMPLE ST","Central East"]
[52468,"TEMPLETON PL","South West Urban"]
[22469,"TEMPO PL","North Urban East"]
[35273,"TEMUKA GARDENS","West"]
[40328,"TEMURI PL","West"]
[48132,"TEMURI PL WWAY","West"]
[22755,"TENBLESS RD","North Urban West"]
[10938,"TENDER RD","North Rural"]
[10939,"TENETAHI RD","North Rural"]
[52798,"TENNESSEE AVE","South West Urban"]
[31685,"TENNIS LANE","Central"]
[20149,"TENNYSON AVE","North Urban East"]
[34509,"TENNYSON ST (BALMORAL)","Central"]
[21088,"TENNYSON ST (NORTHCOTE)","North Urban West"]
[60239,"TENSING PL","South West Urban"]
[34510,"TENTERDEN AVE","Central"]
[10940,"TENZING LANE","North Urban East"]
[52470,"TEO LANE  (PVT)","South West Urban"]
[35996,"TEPHRA BLVD","Central East"]
[52471,"TERCEL PL","South East Urban"]
[15747,"TERCEL PL/SUNNYHILLS PRIMARY SCHOOL CYWAY","South East Urban"]
[22670,"TERN PL","North Urban West"]
[40049,"TERRA NOVA ST","West"]
[35274,"TERRACOTTA DR","West"]
[54789,"TERRASINI DR (NORTH)","South East Urban"]
[53660,"TERRASINI DR (SOUTH)","South East Urban"]
[53662,"TERRASINI/AMARETTO RAB","South East Urban"]
[52472,"TERRY PL","South West Urban"]
[11398,"TERRY SMYTH DR","North Rural"]
[31335,"TERRY ST","West"]
[31726,"TERRY/WHITNEY SLIP","West"]
[20282,"TERRYLYN DR","North Urban West"]
[20364,"TESLA PL","North Urban West"]
[47275,"TETBURY PL","West"]
[80365,"TETE LANE","South West Urban"]
[34511,"TETLEY RD","Hauraki Islands"]
[20363,"TETRARCH PL","North Urban West"]
[20385,"TEVIOT PL","North Urban West"]
[20369,"THALIA PL","North Urban West"]
[71039,"THAMES PL","South Rural"]
[34512,"THAMES ST","Central"]
[34513,"THANET AVE","Central"]
[31336,"THATCHER ST","Central East"]
[11602,"THE ANCHORAGE (GULF HARBOUR)","North Urban East"]
[52473,"THE ANCHORAGE (SUNNYHILLS)","South East Urban"]
[20638,"THE AVENUE (ALBANY)","North Urban West"]
[34514,"THE AVENUE (LYNFIELD)","Central"]
[11422,"THE AVENUE (WELLSFORD)","North Rural"]
[35677,"THE BOARDWALK (PVT)","Central"]
[52474,"THE BOULEVARD","South East Urban"]
[52475,"THE BRAE","South Rural"]
[10941,"THE BULLOCK TRACK","North Rural"]
[10942,"THE CIRCLE","North Urban East"]
[22683,"THE CLOSE","North Urban West"]
[40327,"THE CONCOURSE","West"]
[34905,"THE CRESCENT (PARNELL/EAST)","Central"]
[31686,"THE CRESCENT (PARNELL/WEST)","Central"]
[10943,"THE CRESCENT (TINDALLS BAY)","North Urban East"]
[52476,"THE CREST","South East Urban"]
[31337,"THE DRIVE (EPSOM)","Central"]
[40326,"THE DRIVE (WAITAKERE)","West"]
[53286,"THE ENCLAVE","South West Urban"]
[22302,"THE ESPLANADE (CAMPBELLS BAY)","North Urban East"]
[20210,"THE ESPLANADE (CASTOR BAY)","North Urban East"]
[22537,"THE ESPLANADE (CASTOR BAY) ACCESSWAY","North Urban East"]
[34515,"THE ESPLANADE (HURUHI BAY)","Hauraki Islands"]
[35577,"THE ESPLANADE (HURUHI BAY/EAST)","Hauraki Islands"]
[35021,"THE ESPLANADE (HURUHI BAY/WEST)","Hauraki Islands"]
[10944,"THE ESPLANADE (MANLY)","North Urban East"]
[52477,"THE ESPLANADE (PAKURANGA)","South East Urban"]
[35578,"THE ESPLANADE (PALM BEACH)","Hauraki Islands"]
[15829,"THE ESPLANADE/BLEAKHOUSE RD CYWAY","South East Urban"]
[15834,"THE ESPLANADE/MACLEANS RD CYWAY","South East Urban"]
[60375,"THE FURLONG","South West Urban"]
[10945,"THE GLADE (ALGIES BAY)","North Rural"]
[71040,"THE GLADE (PUKEKOHE)","South Rural"]
[70007,"THE GLADE LOOP","South Rural"]
[71041,"THE GLADE NORTH","South Rural"]
[52478,"THE GLEBE","South East Urban"]
[31338,"THE GLEN","Central East"]
[52479,"THE GREEN","South East Urban"]
[15631,"THE GREEN SOUTH LINK CYWAY","South East Urban"]
[15632,"THE GREEN/PUTTER PL CYWAY","South East Urban"]
[40325,"THE GROVE","West"]
[22692,"THE KNOLL","North Urban West"]
[80415,"THE LANDING","North Rural"]
[34517,"THE LANE","Hauraki Islands"]
[60240,"THE LEA","South West Urban"]
[52480,"THE LINK","South East Urban"]
[24081,"THE MEWS (ALBANY) (PVT)","North Urban East"]
[52878,"THE MEWS (HOWICK)","South East Urban"]
[10946,"THE NOOK","North Rural"]
[35004,"THE OAKS (PVT)","Central East"]
[34516,"THE OASIS (PVT)","Central East"]
[24018,"THE OVAL (PVT)","North Urban West"]
[52481,"THE PARADE (PAKURANGA)","South East Urban"]
[31339,"THE PARADE (ST HELIERS)","Central East"]
[40324,"THE PARADE (WAITAKERE)","West"]
[54659,"THE PARADE CARPARK (RP532 RHS)","South East Urban"]
[15795,"THE PARADE/HATTAWAY AVE CYWAY (RP367)","South East Urban"]
[15794,"THE PARADE/HATTAWAY AVE CYWAY (RP728)","South East Urban"]
[54840,"THE PARADE-HATTAWAY NORTH #1","South East Urban"]
[54841,"THE PARADE-HATTAWAY NORTH #2","South East Urban"]
[54842,"THE PARADE-HATTAWAY SOUTH","South East Urban"]
[11576,"THE PROM","North Rural"]
[80536,"THE PROMENADE CARPARK","North Urban East"]
[20160,"THE PROMENADE CENTRAL","North Urban East"]
[11565,"THE RISE (HOBBS/GULF HBR)","North Urban East"]
[24038,"THE RISE (ROSEDALE) (PVT)","North Urban West"]
[35926,"THE RISE (ST HELIERS)(PVT)","Central East"]
[11509,"THE RISE (WAIMAUKU)","North Rural"]
[11389,"THE RITZ","North Urban East"]
[52482,"THE ROSEBOWL","South East Urban"]
[80341,"THE SETTLEMENT","North Urban East"]
[10947,"THE SOUTHERN ISLE","North Rural"]
[60241,"THE SPINNEY","South West Urban"]
[24052,"THE STATION CRES (PVT)","North Urban West"]
[20144,"THE STRAND (EAST)","North Urban East"]
[31340,"THE STRAND (PARNELL)","Central"]
[20142,"THE STRAND (TAKAPUNA)","North Urban East"]
[34518,"THE STRAND (WAIHEKE)","Hauraki Islands"]
[10948,"THE STRAND (WAIWERA)","North Urban East"]
[33143,"THE STRAND LLA (ST GEORGES BAY-END)","Central"]
[20158,"THE TERRACE (TAKAPUNA)","North Urban East"]
[40323,"THE TERRACE (WAITAKERE)","North Urban West"]
[60584,"THE TRACK","South West Urban"]
[22774,"THE WAREHOUSE WAY","North Urban West"]
[53294,"THE WAY (PVT)","South Rural"]
[20362,"THEBAN PL","North Urban West"]
[22470,"THELMA CRES","North Urban East"]
[22471,"THEODORA PL","North Urban East"]
[34520,"THIRD AVE (KINGSLAND)","Central"]
[52483,"THIRD AVE (ORERE POINT)","South Rural"]
[34519,"THIRD AVE (WAIHEKE)","Hauraki Islands"]
[52484,"THIRD VIEW AVE","South Rural"]
[54732,"THIRD VIEW AVE CARPARK (RP545 RHS)","South Rural"]
[54731,"THIRD VIEW AVE CARPARK (RP552 LHS)","South Rural"]
[54730,"THIRD VIEW AVE CARPARK (RP644 LHS)","South Rural"]
[54555,"THIRD VIEW/SHELLY BAY RAB","South Rural"]
[52897,"THIRLMERE RISE","South East Urban"]
[53573,"THISTLE CLOSE","South Rural"]
[10949,"THISTLE TCE","North Rural"]
[20482,"THISTLEDEW PL","North Urban West"]
[40093,"THOM ST","West"]
[48021,"THOM ST WWAY","West"]
[34521,"THOMAS AVE (MT ALBERT)","Central"]
[40322,"THOMAS AVE (WAITAKERE)","West"]
[22954,"THOMAS HAMER PL","North Urban West"]
[24107,"THOMAS HUNTER LANE (PVT)","North Urban West"]
[71459,"THOMAS MOORE PL","South Rural"]
[31341,"THOMAS PEACOCK PL","Central East"]
[34522,"THOMAS RD (GBI)","Hauraki Islands"]
[52485,"THOMAS RD (MANGERE)","South West Urban"]
[52486,"THOMAS RD (MANUKAU HEIGHTS)","South East Urban"]
[54150,"THOMAS RD SERVICE LANE (RP74 LHS)","South East Urban"]
[40321,"THOMAS REA PL","West"]
[34873,"THOMPSON PARK RD","Central East"]
[34524,"THOMPSON RD","Central East"]
[10950,"THOMPSON RD (NORTH)","North Rural"]
[52487,"THOMPSON ST","South West Urban"]
[52488,"THOMPSON TCE","South West Urban"]
[10951,"THOMSON RD (KAIPARA FLATS)","North Rural"]
[34523,"THOMSON ST","Central"]
[10952,"THORBURN AVE","North Urban East"]
[34525,"THORLEY ST","Central"]
[52489,"THORN PL","South West Urban"]
[20708,"THORNBILL RISE","North Urban West"]
[53473,"THORNBURY CRES","South East Urban"]
[31342,"THORNHILL PL","Central East"]
[71491,"THORNLEA GR","South Rural"]
[40320,"THORNLOW ST","West"]
[48129,"THORNLOW ST WWAY","West"]
[60619,"THORNTON GREEN","South West Urban"]
[20252,"THORNTON RD","North Urban East"]
[31343,"THORP ST","Central East"]
[52490,"THORPS QUARRY RD","South Rural"]
[34874,"THREE KINGS GR (PVT)","Central"]
[11356,"THREE OAKS DR","North Rural"]
[40319,"THUJA ST","West"]
[48010,"THUJA ST WWAY","West"]
[52786,"THURSO LANE","South West Urban"]
[52491,"THURSTON PL","South East Urban"]
[53506,"THYME CRT","South East Urban"]
[40172,"TI NANA CRES","West"]
[10953,"TI POINT RD","North Rural"]
[52492,"TI RAKAU DR (EASTBOUND)","South East Urban"]
[54735,"TI RAKAU DR (WESTBOUND)","South East Urban"]
[54534,"TI RAKAU DR/AMERA PL SLIP","South East Urban"]
[54750,"TI RAKAU DR/AYLESBURY ST LINK","South East Urban"]
[80580,"TIA RD","South East Urban"]
[52493,"TIAKA PL","South East Urban"]
[52494,"TIARI PL","South West Urban"]
[20304,"TIBER RD","North Urban East"]
[52495,"TIDAL RD","South West Urban"]
[35286,"TIDE CLOSE","Central East"]
[34527,"TIDEY RD","Central East"]
[52898,"TIFFANY CLOSE","South East Urban"]
[53119,"TIGER DR","South East Urban"]
[53968,"TIGER DR-SPALDING RISE","South East Urban"]
[41443,"TIGER MOTH ST","North Urban West"]
[35985,"TIHI ST","Central East"]
[31344,"TIKA ST","Central"]
[31345,"TIKI ST (REMUERA)","Central East"]
[40097,"TIKI ST (WAITAKERE)","West"]
[53257,"TILBERG ST","South West Urban"]
[60242,"TILBROOK PL","South West Urban"]
[31346,"TILBURY PL","West"]
[20554,"TILDEN AVE","North Urban West"]
[31347,"TILDEN ST","Central"]
[52496,"TILIA PL","South West Urban"]
[11362,"TILLER CRT","North Urban East"]
[80690,"TILLY LANE","North Rural"]
[40318,"TIMANDRA PL","West"]
[35602,"TIMARU PL","Central East"]
[80037,"TIMBER PL","North Rural"]
[80334,"TIMBERLAND DR","North Urban East"]
[53674,"TIMBERLY RD","South West Urban"]
[53675,"TIMBERLY/VERRISIMO RAB","South West Urban"]
[71042,"TIMES PL","South Rural"]
[52497,"TIMEWELL LANE","South West Urban"]
[80565,"TIMMER RD","South East Urban"]
[31348,"TIMOTHY PL","West"]
[52498,"TINA PL","South East Urban"]
[53969,"TINA PL-BUTLEY DR","South East Urban"]
[80695,"TINAKU RD","South East Urban"]
[52499,"TINDALL CRES","South West Urban"]
[70592,"TINDALL RD","South Rural"]
[10954,"TINDALLS BAY RD","North Urban East"]
[52812,"TINGTON AVE","South West Urban"]
[54073,"TINGTON AVE CARPARK (RP13 LHS)","South West Urban"]
[54360,"TINGTON/GLENROSS RAB #1","South West Urban"]
[54361,"TINGTON/GLENROSS RAB #2","South West Urban"]
[52501,"TINKLER PL","South West Urban"]
[31349,"TINLEY ST","Central"]
[40317,"TINOPAI RD","West"]
[53552,"TINTURN PL","South East Urban"]
[53970,"TINTURN PL-MULTOSE DR","South East Urban"]
[11465,"TIO LANE","North Rural"]
[52502,"TIORO LANE  (PVT)","South West Urban"]
[22472,"TIPAU ST","North Urban East"]
[31350,"TIPENE PL","Central East"]
[71320,"TIPPERARY LANE","South Rural"]
[35964,"TIPPETT ST","Central East"]
[80697,"TIPU RD","South East Urban"]
[53095,"TIR CONAILL AVE","South East Urban"]
[80373,"TIRAU PL","South West Urban"]
[52503,"TIRAUMEA DR","South East Urban"]
[54727,"TIRAUMEA DR CARPARK (RP532 LHS)","South East Urban"]
[34951,"TIRI PL","Central East"]
[10955,"TIRI RD (MANLY)","North Urban East"]
[20182,"TIRI RD (TAKAPUNA)","North Urban East"]
[34528,"TIRI RD (WAIHEKE)","Hauraki Islands"]
[22196,"TIRI TIRI RD","North Urban West"]
[22473,"TIRI VIEW PL","North Urban East"]
[34529,"TIRI VIEW RD","Hauraki Islands"]
[40316,"TIRIMOANA RD","West"]
[48134,"TIRIMOANA RD WWAY","West"]
[47341,"TIRIWA DR","West"]
[80557,"TIRIWA DR (NORTH)","West"]
[31351,"TIROHANGA AVE","Central East"]
[40315,"TIROHUNGA DR","West"]
[48094,"TIROHUNGA DRV WWAY","West"]
[60272,"TIRONUI RD","South West Urban"]
[60005,"TIRONUI RD EXTN (RP20 RHS)","South West Urban"]
[60443,"TIRONUI STATION RD EAST","South West Urban"]
[60444,"TIRONUI STATION RD WEST","South West Urban"]
[40314,"TIROROA AVE","West"]
[31352,"TIROTAI CRES","Central"]
[31353,"TISDALL CRES","Central East"]
[34530,"TITAHI ST","Central East"]
[31354,"TITAI ST","Central East"]
[10956,"TITAN PL","North Urban East"]
[47361,"TITCH PL","West"]
[41177,"TITCH/FOUNDATION RAB","West"]
[40313,"TITCHENER ST","West"]
[53251,"TITCHMARSH CRES","South East Urban"]
[54438,"TITCHMARSH CRES HAMMERHEAD","South East Urban"]
[80612,"TITI LANE","North Urban East"]
[70593,"TITI RD","South Rural"]
[52504,"TITI ST","South West Urban"]
[40312,"TITIRANGI BEACH RD","West"]
[40310,"TITIRANGI RD","West"]
[48064,"TITIRANGI RD WWAY","West"]
[41323,"TITIRANGI/GOLF RAB","West"]
[40191,"TITIRANGI/PLEASANT SLIP","West"]
[40311,"TITIRANGI/SCENIC RAB","West"]
[22197,"TITIWAI PL","North Urban West"]
[52505,"TITOKI AVE","South West Urban"]
[22608,"TITOKI PL","North Urban West"]
[31355,"TITOKI ST (NEWMARKET)","Central"]
[40309,"TITOKI ST (WAITAKERE)","West"]
[31356,"TIVERTON RD","West"]
[30765,"TIVERTON RD HLA (PINEWOOD - #48)","West"]
[33144,"TIVERTON RD HLA (PITCAIRN - #32)","West"]
[30763,"TIVERTON RD LLA (#127 - #111)","West"]
[30764,"TIVERTON RD LLA (#83 - #23)","West"]
[54136,"TIVOLI CRT","South East Urban"]
[34531,"TIWAI RD","Central East"]
[22198,"TIZARD RD","North Urban West"]
[22518,"TIZARD RD HLA (NORTH END)","North Urban West"]
[22519,"TIZARD RD LLA (SOUTH END)","North Urban West"]
[52506,"TOATOA PL","South West Urban"]
[22725,"TOBAGO PL","North Urban East"]
[71043,"TOBIN ST","South Rural"]
[71435,"TOBIN ST CARPARK (RP65 LHS)","South Rural"]
[71429,"TOBIN ST SERVICE LANE (RP102 RHS)","South Rural"]
[70179,"TOBIN ST SERVICE LANE CARPARK","South Rural"]
[71255,"TOBIN/SEDDON RAB","South Rural"]
[20244,"TOBRUK CRES","North Urban East"]
[34532,"TOBRUK RD (PANMURE)","Central East"]
[10957,"TOBRUK RD (WELLSFORD)","North Rural"]
[34533,"TODD PL","South West Urban"]
[47375,"TOHEROA ST","North Urban West"]
[11546,"TOHORA CRESENT","North Rural"]
[31357,"TOHUNGA CRES","Central"]
[21089,"TOI TOI PL","North Urban West"]
[80730,"TOIA LANE (PVT)","North Urban East"]
[11193,"TOKAY PL","North Rural"]
[70097,"TOKERAU CRES","South Rural"]
[31358,"TOKOMARU ST","Central East"]
[52953,"TOLBEN PL","South East Urban"]
[31359,"TOLE ST","Central"]
[47277,"TOLEDO AVE","West"]
[41372,"TOLICH PL","West"]
[47196,"TOLLANA RD","West"]
[52815,"TOLVAH PL","South West Urban"]
[80134,"TOM CLARK LANE","West"]
[52507,"TOM PEARCE DR (AIRPORT)","South West Urban"]
[10959,"TOMARATA VALLEY RD","North Rural"]
[10960,"TOMAS ST","North Rural"]
[53379,"TOMES LANE","South West Urban"]
[52508,"TOMINTOUL PL","South East Urban"]
[52509,"TOMLIN PL","South West Urban"]
[52510,"TOMLINSON ST","South West Urban"]
[40061,"TOMO ST","West"]
[34534,"TOMURI PL","Central East"]
[21090,"TONAR ST","North Urban West"]
[34681,"TONGARIRO ST","Central"]
[60706,"TONGEREN SQ","South West Urban"]
[10961,"TONGUE FARM RD","North Rural"]
[20338,"TONKIN DR","North Urban East"]
[70595,"TONKIN PL","South Rural"]
[31360,"TONKS ST","Central East"]
[52909,"TONSON PL","South West Urban"]
[80479,"TONUITANGA ST","South West Urban"]
[53165,"TONU'U CRT","South East Urban"]
[54422,"TONU'U CRT HAMMERHEAD","South East Urban"]
[31361,"TONY SEGEDIN DR","West"]
[41426,"TONY ST","West"]
[31362,"TOOLEY ST","Central"]
[53203,"TOOMER PL","South Rural"]
[71497,"TOP RD (PUKEKOHE)","South Rural"]
[10962,"TOP RD (REDVALE)","North Rural"]
[52511,"TOPAZ PL","South West Urban"]
[53511,"TOPLAND DR","South East Urban"]
[15498,"TOPLAND DR/LISA-MARIE CRT CYWAY","South East Urban"]
[53549,"TOPLAND/JERPOINT RAB","South East Urban"]
[53561,"TOPLAND/MALAHIDE RAB","South East Urban"]
[53548,"TOPLAND/SKELLIGS RAB","South East Urban"]
[22474,"TOPLISS DR","North Urban East"]
[22475,"TORBAY HEIGHTS","North Urban East"]
[10963,"TOREA RD","North Rural"]
[80631,"TOREA TAI RD","North Urban West"]
[47215,"TORELESSE RD","West"]
[31363,"TORINO ST","Central East"]
[70596,"TORKAR RD","South Rural"]
[71464,"TORKAR RD LOOP #1 (RP741 LHS)","South Rural"]
[71465,"TORKAR RD LOOP #2 (RP798 LHS)","South Rural"]
[71466,"TORKAR RD LOOP #3 (RP1078 LHS)","South Rural"]
[71467,"TORKAR RD LOOP #4 (RP1142 LHS)","South Rural"]
[71468,"TORKAR RD LOOP #5 (RP1346 LHS)","South Rural"]
[71469,"TORKAR RD LOOP #6 (RP1581 LHS)","South Rural"]
[41302,"TORNADO PL","North Urban West"]
[48250,"TORNADO PL WWAY","North Urban West"]
[53410,"TORNISH DR","South East Urban"]
[22476,"TOROA ST","North Urban East"]
[34535,"TOROA TCE","Central"]
[34536,"TOROKINA PL","Central East"]
[35685,"TOROKINA/STATE WWAY (RP77 END)","Central East"]
[22836,"TORQUAY","North Urban East"]
[34537,"TORRANCE ST","Central"]
[52796,"TORRENS RD","South East Urban"]
[31364,"TORRINGTON CRES","Central East"]
[35883,"TORRINGTON/WEST TAMAKI WWAY","Central East"]
[40308,"TORU ST","West"]
[40137,"TORU/TITOKI RAB","West"]
[34539,"TORY ST","Central"]
[35565,"TOSCA LANE (PVT)","Central East"]
[52512,"TOSCA PL","South West Urban"]
[60595,"TOSCANA DR","South West Urban"]
[60602,"TOSCANA/CAPRIANI RAB","South West Urban"]
[52513,"TOSO WAY","South West Urban"]
[54646,"TOSO WAY CARPARK (RP56 RHS)","South East Urban"]
[71044,"TOTARA AVE (PUKEKOHE)","South Rural"]
[80137,"TOTARA AVE (WAITAKERE)","West"]
[21091,"TOTARA GR","North Urban West"]
[15556,"TOTARA PARK CARPARK LINK CYWAY","South West Urban"]
[15554,"TOTARA PARK EQUESTRIAN CENTRE CYWAY","South West Urban"]
[71045,"TOTARA PL","South Rural"]
[10964,"TOTARA RD (LEIGH)","North Rural"]
[52514,"TOTARA RD (MANUREWA)","South West Urban"]
[70597,"TOTARA RD (PAPARATA)","South Rural"]
[40306,"TOTARA RD (TE ATATU)","West"]
[34540,"TOTARA RD (WAIHEKE ISLAND)","Hauraki Islands"]
[41157,"TOTARA RD (WHENUAPAI)","North Urban West"]
[10965,"TOTARA RD 2 (STANMORE BAY)","North Urban East"]
[70876,"TOTARA ST","South Rural"]
[10966,"TOTARA VIEW","North Rural"]
[11486,"TOTARA VIEWS DR","North Urban East"]
[15034,"TOTARA VIEWS DR NO EXIT CYWAY","North Urban East"]
[15032,"TOTARA VIEWS DR/LONGMORE LN CYWAY","North Urban East"]
[20374,"TOTARAVALE DR","North Urban West"]
[80434,"TOUHOU ROAD","North Urban West"]
[52515,"TOURIST RD","South Rural"]
[52516,"TOURMALIN PL","South West Urban"]
[60462,"TOWAI RD","South West Urban"]
[31365,"TOWAI ST","Central East"]
[52517,"TOWBRIDGE PL","South East Urban"]
[10967,"TOWER HILL","North Urban East"]
[70599,"TOWERS RD","South Rural"]
[31366,"TOWLE PL","Central East"]
[15269,"TOWLE PL/WAIATARUA RESERVE LINK CYWAY","Central East"]
[52833,"TOWN HALL LANE","South West Urban"]
[52518,"TOWNLEY PL","South West Urban"]
[53971,"TOWNLEY PL-TE IRIRANGI DR","South West Urban"]
[40305,"TOWNSHIP RD","West"]
[52519,"TOWNSON RD","South Rural"]
[52520,"TOWRA PL","South East Urban"]
[40304,"TRACEY TCE","West"]
[48135,"TRACEY TCE WWAY","West"]
[22200,"TRADER ST","North Urban West"]
[40303,"TRADING PL","West"]
[24097,"TRAFALGAR DR (PVT)","North Urban East"]
[20254,"TRAFALGAR RD","North Urban East"]
[34541,"TRAFALGAR ST","Central East"]
[31633,"TRAFALGAR ST (EAST)","Central East"]
[34893,"TRAFALGAR ST LLA (#17 - #29)","Central East"]
[20618,"TRAFFIC RD","North Urban West"]
[70600,"TRAIL RD","South Rural"]
[52853,"TRALEE TCE","South East Urban"]
[54551,"TRALEE TCE LOOP","South East Urban"]
[70601,"TRAM GULLY RD","South Rural"]
[40302,"TRAM VALLEY RD","West"]
[22199,"TRAMWAY RD (BIRKENHEAD)","North Urban West"]
[70602,"TRAMWAY RD (PUKEKOHE)","South Rural"]
[52521,"TRANENT RD","South West Urban"]
[53972,"TRANENT RD-FRIESIAN DR","South West Urban"]
[34542,"TRANMERE RD","Central"]
[20549,"TRANQUIL GLADE","North Urban West"]
[53667,"TRANQUILITY RISE","South East Urban"]
[53073,"TRANSPORT PL","South East Urban"]
[52795,"TRAVERS PL","South East Urban"]
[22987,"TRAVIS VIEW DR","North Urban West"]
[52522,"TREAGON PL","South West Urban"]
[34543,"TREASURY PL","Central East"]
[60620,"TRECARNE ST","South West Urban"]
[24011,"TREE FERN TRAIL (PVT)","North Urban East"]
[20523,"TREE VIEW AVE","North Urban West"]
[80654,"TREESTUMP RD","South West Urban"]
[22729,"TREETOPS WAY","North Urban West"]
[52523,"TREEWAY","South East Urban"]
[52524,"TRELAWN PL","South East Urban"]
[20539,"TRELAWNY PL","North Urban West"]
[52525,"TREMBATH AVE","South West Urban"]
[71046,"TREMEN PL","South Rural"]
[53563,"TRENEARY LANE","South East Urban"]
[40301,"TRENGOVE PL","West"]
[34544,"TRENT RD","Central East"]
[31611,"TRENT RD HAMMERHEAD","Central East"]
[31367,"TRENT ST","West"]
[60243,"TRENTHAM RD","South West Urban"]
[34545,"TRENWITH ST","South West Urban"]
[24108,"TREVAUGHN GLADE (PVT)","North Urban East"]
[52526,"TREVISO PL","South West Urban"]
[31368,"TREVOLA ST","West"]
[20317,"TREVONE PL","North Urban East"]
[52527,"TREVOR HOSKEN DR","South West Urban"]
[54300,"TREVOR HOSKEN DR CARPARK (RP279)","South West Urban"]
[71445,"TREVORS PL","South Rural"]
[34546,"TRIANGLE RD (MT WELLINGTON)","Central East"]
[40300,"TRIANGLE RD (WAITAKERE)","West"]
[47145,"TRIANGLE RD HLA (#147 - #159)","West"]
[47147,"TRIANGLE RD HLA (#32 - #12)","West"]
[41169,"TRIANGLE RD HLA (#36 - #38)","West"]
[47148,"TRIANGLE RD HLA (#40 - #58)","West"]
[41319,"TRIANGLE/WAIMUMU RAB","West"]
[20360,"TRIAS RD","North Urban West"]
[52528,"TRIDENT PL","South East Urban"]
[34547,"TRIG HILL RD","Hauraki Islands"]
[10968,"TRIG RD (SOUTH HEAD KAIPARA)","North Rural"]
[40299,"TRIG RD (WHENUAPAI)","North Urban West"]
[52529,"TRIG RD (WHITFORD)","South Rural"]
[10969,"TRIGG RD","North Rural"]
[11518,"TRIMARAN DR","North Urban East"]
[52530,"TRIMDON ST","South West Urban"]
[52531,"TRIMMER TCE","South West Urban"]
[20336,"TRINIDAD RD","North Urban East"]
[31369,"TRINIDAD ST","West"]
[35596,"TRINITY CLOSE (PVT)","Central"]
[22704,"TRINITY PL","North Urban West"]
[31370,"TRINITY ST","Central"]
[31371,"TRIPOLI RD","Central East"]
[35872,"TRIPOLI/ROPATA WWAY (RP80 LHS)","Central East"]
[20029,"TRISTRAM AVE (EAST)","North Urban East"]
[80448,"TRISTRAM AVE (WEST)","North Urban West"]
[34548,"TRITON AVE","Central"]
[22793,"TRITON DR","North Urban West"]
[54023,"TRIUMPH RD","South East Urban"]
[40073,"TROJAN CRES","West"]
[52533,"TROMIE PL","South East Urban"]
[52534,"TROON PL","South West Urban"]
[34549,"TROPICANA DR","Central"]
[52918,"TROSSACH PL","South West Urban"]
[10970,"TROTTING COURSE DR","North Rural"]
[22880,"TROTTING TCE","North Urban West"]
[52535,"TROUNSON AVE","South West Urban"]
[53038,"TROVARE PL","South East Urban"]
[31372,"TROY PL","Central East"]
[35785,"TROY/ASHBY WWAY (RP120 RHS)","Central East"]
[60704,"TROYS LINK","South West Urban"]
[52536,"TRUGOOD DR","South East Urban"]
[31373,"TRUMAN ST","Central East"]
[34550,"TRURO RD","Central"]
[40298,"TRUSCOTT PL","West"]
[52537,"TRUST PL","South East Urban"]
[15746,"TRUST PL/MEADWAY CYWAY","South East Urban"]
[53450,"TSAR CRT","South East Urban"]
[54445,"TSAR CRT EXTN","South East Urban"]
[52854,"TUA PL","South West Urban"]
[31374,"TUAKANA ST","Central East"]
[70605,"TUAKAU RD","South Rural"]
[31375,"TUAKIRI ST","Central East"]
[52538,"TUAKURA WAY","South West Urban"]
[80420,"TUANGI STREET","North Urban East"]
[31376,"TUARANGI RD","Central"]
[35631,"TUARANGI RD HLA (BARRINGTON - #42)","Central"]
[30770,"TUARANGI RD LLA (#68 - #48)","Central"]
[34553,"TUATA RD","Central East"]
[35904,"TUATA/ALIFORD WWAY (RP119 LHS)","Central East"]
[11460,"TUATUA LANE","North Rural"]
[80637,"TUATUA RD","North Urban West"]
[47342,"TUCK NATHAN DR","West"]
[52849,"TUDOR PARK DR","South Rural"]
[22477,"TUDOR PL","North Urban East"]
[40297,"TUDOR RD","West"]
[20535,"TUDOR ST","North Urban East"]
[20273,"TUDWARD GLADE","North Urban West"]
[31377,"TUHAERE ST","Central East"]
[70607,"TUHIMATA RD","South Rural"]
[31378,"TUHIMATA ST","Central East"]
[10971,"TUHIRANGI RD","North Rural"]
[53293,"TUI BRAE","South Rural"]
[52539,"TUI CRES (MANUREWA)","South West Urban"]
[40296,"TUI CRES (WAIATARUA)","West"]
[20557,"TUI GLEN RD","North Urban West"]
[41410,"TUI PL (WAITAKERE) (PVT)","North Urban West"]
[70880,"TUI PL (WAIUKU)","South Rural"]
[52540,"TUI RD","South West Urban"]
[20103,"TUI ST - BELMONT","North Urban East"]
[22558,"TUI ST - BELMONT HAMMERHEAD","North Urban East"]
[22092,"TUI ST - DEVONPORT","North Urban East"]
[22479,"TUI ST - TORBAY","North Urban East"]
[60381,"TUI ST (DRURY)","South West Urban"]
[52541,"TUI ST (OTAHUHU)","South West Urban"]
[31379,"TUI ST (PT CHEVALIER)","Central"]
[34555,"TUI ST (WAIHEKE)","Hauraki Islands"]
[52542,"TUI VALE RD","South East Urban"]
[31380,"TULAGI PL","Central East"]
[35811,"TULAGI/BADDELEY WWAY (RP95 END)","Central East"]
[11343,"TULIP CLOSE","North Urban East"]
[52820,"TULLIS PL","South East Urban"]
[60378,"TULLOCH PL","South West Urban"]
[15420,"TULLOCH PL LINK CYWAY","South West Urban"]
[40295,"TUMANAKA PL","West"]
[52894,"TUMBRIDGE PL","South East Urban"]
[52543,"TUNA PL (MANUREWA)","South West Urban"]
[11489,"TUNA PL (OMAHA)","North Rural"]
[34556,"TUNIS RD","Central East"]
[35713,"TUNIS/BELLONA WWAY (RP102 RHS)","Central East"]
[35714,"TUNIS/MCCULLOCH WWAY (RP300 LHS)","Central East"]
[10973,"TUNNEL RD","North Rural"]
[52544,"TUPAKI PL","South East Urban"]
[54712,"TUPAKI PL HAMMERHEAD","South East Urban"]
[10974,"TUPAREKURA RD","North Rural"]
[34558,"TUPERIRI RD","Central"]
[31381,"TURAKINA ST","Central"]
[34559,"TURAMA RD","Central East"]
[40294,"TURANGA RD (HENDERSON VALLEY)","West"]
[52545,"TURANGA RD (WHITFORD)","South Rural"]
[52546,"TUREI RD","South Rural"]
[52547,"TURIN PL","South West Urban"]
[24053,"TURITEA PL (PVT)","North Urban West"]
[10975,"TURLEY RD","North Rural"]
[53598,"TURNBERRY DR","South West Urban"]
[15429,"TURNBERRY DR/ABERDEEN CRES CYWAY","South West Urban"]
[53599,"TURNBERRY/BELFRY RAB","South West Urban"]
[53600,"TURNBERRY/SCOTSMOOR RAB","South West Urban"]
[20599,"TURNBULL RD","North Urban East"]
[71047,"TURNER PL (PUKEKOHE)","South Rural"]
[71471,"TURNER PL (WATTLE BAY)","South Rural"]
[70611,"TURNER RD","South Rural"]
[31382,"TURNER ST","Central"]
[80541,"TURPIN RD","North Rural"]
[60637,"TURUA RISE","South West Urban"]
[31383,"TURUA ST","Central East"]
[20392,"TUSAC PL","North Urban West"]
[52548,"TUSCAN PL","South East Urban"]
[47079,"TUSCANY WAY","West"]
[53335,"TUSSOCK AVE","South West Urban"]
[54601,"TUSSOCK/CINNAMON RAB","South West Urban"]
[31384,"TUTANEKAI ST","Central"]
[52549,"TUTERE RD","South West Urban"]
[31385,"TUTUKI ST","Central"]
[35900,"TUTUKI/GT NORTH WWAY (RP234 LHS)","Central"]
[80609,"TUTUWHATU CR","South West Urban"]
[31386,"TWEED ST","Central"]
[10977,"TWILIGHT BAY","North Rural"]
[52550,"TWILIGHT RD","South Rural"]
[22868,"TWIN CRT","North Urban West"]
[11353,"TWIN SPRINGS RD","North Rural"]
[10978,"TWIN STREAM RD","North Rural"]
[40293,"TWIN WHARF RD","North Urban West"]
[71447,"TWOMEY DR","South Rural"]
[22690,"TYBURN LANE","North Urban West"]
[34750,"TYBURNIA AVE","Central"]
[10979,"TYBURNIA PL","North Rural"]
[20285,"TYE RD","North Urban West"]
[52551,"TYLDENS RD","South Rural"]
[31387,"TYLER ST (EAST)","Central"]
[31464,"TYLER ST (WEST)","Central"]
[11511,"TYNDEL RD","West"]
[52552,"TYNDRUM PL","South East Urban"]
[15759,"TYNDRUM PL LINK CYWAY","South East Urban"]
[20305,"TYNE RD","North Urban East"]
[34561,"TYNOR PL","Central"]
[52553,"TYRIAN CLOSE","South East Urban"]
[54665,"TYRIAN CLOSE EXTN #1","South East Urban"]
[54664,"TYRIAN CLOSE EXTN #2","South East Urban"]
[22700,"TYRICO CLOSE","North Urban West"]
[52554,"TYRONE ST","South West Urban"]
[60468,"TYTUS PL","South West Urban"]
[52555,"UDALL PL","South East Urban"]
[52556,"UDYS RD","South East Urban"]
[52557,"ULAY PL","South West Urban"]
[52900,"ULDALE PL","South East Urban"]
[52558,"ULLSWATER PL","South East Urban"]
[31388,"ULSTER RD","West"]
[52559,"ULTIMA PL","South West Urban"]
[53528,"UMBRIA LANE","South East Urban"]
[36044,"UMBRIEL LANE (PVT)","West"]
[34562,"UMERE CRES","Central East"]
[53229,"UMU PL","South West Urban"]
[60382,"UNA ST","South West Urban"]
[60481,"UNA ST SERVICE LANE (RP84 LHS)","South West Urban"]
[10980,"UNDERWOOD RD","North Rural"]
[54751,"UNDERWOOD ST (NORTHBOUND)","South East Urban"]
[54490,"UNDERWOOD ST (SOUTHBOUND)","South East Urban"]
[80686,"UNDERWOOD ST (SOUTHBOUND) SERVICE LANE (RP 218)","South East Urban"]
[54748,"UNDERWOOD ST/HIGHBROOK DR SE SERVICE LANE (RP 353) RAB","South East Urban"]
[54487,"UNDERWOOD ST/UNDERWOOD ST (SOUTHBOUND) SERVICE LANE (RP 218)  RAB","South East Urban"]
[52560,"UNDINE ST","South East Urban"]
[53974,"UNDINE ST-OSPREY ST","South East Urban"]
[52562,"UNION RD (HOWICK)","South East Urban"]
[70614,"UNION RD (PATUMAHOE)","South Rural"]
[71462,"UNION RD EXTN (RP4438 LHS)","South Rural"]
[31529,"UNION ST (CITY/NORTH)","Central"]
[31389,"UNION ST (CITY/SOUTH)","Central"]
[31531,"UNION ST (CITY/SOUTHBOUND)","Central"]
[60244,"UNION ST (PAPAKURA)","South West Urban"]
[36006,"UNION ST CARPARK (RP548 LHS)","Central"]
[31530,"UNION/SAM WRIGLEY SLIP","Central"]
[20719,"UNITY DR","North Urban West"]
[22815,"UNITY DR NORTH","North Urban West"]
[40292,"UNITY RD","West"]
[40291,"UNIVERSAL DR","West"]
[47240,"UNIVERSAL DR (WESTBOUND)","West"]
[20699,"UNSWORTH DR","North Urban West"]
[34563,"UPHAM RD","Central East"]
[40289,"UPLAND RD","West"]
[31390,"UPLAND RD (REMUERA)","Central East"]
[34565,"UPLAND RD (WAIHEKE)","Hauraki Islands"]
[31682,"UPLAND RD HLA (#90 - #98)","Central East"]
[15325,"UPLAND RD LINK CYWAY","Central East"]
[33145,"UPLAND RD LLA (#58 - #84)","Central East"]
[31563,"UPLAND/BENSON RAB","Central East"]
[35002,"UPLAND/GLEN BROOK WWAY (RP289)","Hauraki Islands"]
[31561,"UPLAND/TONKS SLIP","Central East"]
[11236,"UPPER DUCK CREEK RD","North Urban East"]
[25004,"UPPER HARBOUR DR","North Urban West"]
[25003,"UPPER HARBOUR HIGHWAY - SH18","North Urban West"]
[15014,"UPPER HARBOUR HIGHWAY/PAUL MATTHEWS RD CYWAY","North Urban West"]
[15015,"UPPER HARBOUR HIGHWAY/ROOK PL CYWAY","North Urban West"]
[11505,"UPPER HULL RD","North Rural"]
[34566,"UPPER MUNICIPAL PL","Central East"]
[10982,"UPPER OREWA RD","North Rural"]
[31391,"UPPER QUEEN ST","Central"]
[70615,"UPPER QUEEN ST (PUKEKOHE)","South Rural"]
[10983,"UPPER WAIWERA RD","North Rural"]
[10984,"UPPER WHANGATEAU RD","North Rural"]
[21092,"UPPINGHAM CRESENT","North Urban West"]
[31392,"UPTON ST","Central"]
[52564,"UPWOOD PL","South West Urban"]
[40288,"URBAN GR","West"]
[40287,"URLICH DR","West"]
[80323,"URNEY DR","South East Urban"]
[70616,"URQUHART RD","South Rural"]
[52565,"URSULA PL","South East Urban"]
[52566,"USSHER PL","South East Urban"]
[54725,"USSHER PL CARPARK (RP15 LHS)","South East Urban"]
[22203,"UTTING ST","North Urban West"]
[52567,"UXBRIDGE RD","South East Urban"]
[54129,"UXBRIDGE RD CARPARK (RP78 LHS)","South East Urban"]
[47320,"VADAM RD","West"]
[34567,"VAGUS PL","Central"]
[31393,"VAILIMA WAY","Central"]
[40286,"VALDALE RD","West"]
[48217,"VALDALE RD WWAY","West"]
[24104,"VALDENA AVE (PVT)","North Urban West"]
[52568,"VALDER AVE","South West Urban"]
[53659,"VALDERAMA DR","South East Urban"]
[54052,"VALDERAMA DR- SAVINA CRT","South East Urban"]
[54558,"VALDERAMA/ARGENTO RAB","South East Urban"]
[22480,"VALDESE RISE","North Urban East"]
[31394,"VALE RD","Central East"]
[20572,"VALECREST PL","North Urban West"]
[52569,"VALENCIA PL","South West Urban"]
[60245,"VALENTINE ST","South West Urban"]
[35927,"VALENTINES LANE (PVT)","Central"]
[11220,"VALERIE CLOSE","North Rural"]
[20740,"VALERIE CRES","North Urban East"]
[52570,"VALETTA PL","South West Urban"]
[22206,"VALHALLA DR","North Urban West"]
[52571,"VALIANT ST","South West Urban"]
[22207,"VALKYRIA PL","North Urban West"]
[40285,"VALLANCE PL","West"]
[71406,"VALLEY FIELDS PL","South Rural"]
[71499,"VALLEY HEIGHTS LANE","South Rural"]
[22482,"VALLEY RD - BROWNS BAY","North Urban East"]
[21093,"VALLEY RD - NORTHCOTE","North Urban West"]
[34569,"VALLEY RD (MT EDEN)","Central"]
[71049,"VALLEY RD (PUKEKOHE)","South Rural"]
[40284,"VALLEY RD (TITIRANGI)","West"]
[34568,"VALLEY RD (WAIHEKE)","Hauraki Islands"]
[10985,"VALLEY RD (WAIMUKU)","North Rural"]
[70853,"VALLEY RD (WAIUKU)","South Rural"]
[11497,"VALLEY RD 2 (SOUTH)","North Rural"]
[10987,"VALLEY RD 2 (WAITOKI)","North Rural"]
[26089,"VALLEY RD CARPARK - BROWNS BAY","North Urban East"]
[40283,"VALLEY VIEW RD (FRENCH BAY)","West"]
[20516,"VALLEY VIEW RD (GLENFIELD)","North Urban West"]
[52572,"VALNERA CLOSE","South East Urban"]
[31395,"VALONIA ST","West"]
[40282,"VALRON RD","West"]
[40281,"VAN DYKE PL","West"]
[47327,"VAN HEST WAY","West"]
[80719,"VAN RIXEL DRIVE","North Rural"]
[52573,"VANBRUGH PL","South East Urban"]
[34570,"VANCOUVER AVE","Central"]
[20531,"VANDELEUR AVE","North Urban West"]
[40280,"VANDEN PL","West"]
[22702,"VANDERBILT PDE (NORTH)","North Urban West"]
[22674,"VANDERBILT PDE (SOUTH)","North Urban West"]
[34917,"VANESSA CRES","Central East"]
[40279,"VANGUARD RD","West"]
[40278,"VARDON RD","West"]
[20489,"VARI PL","North Urban West"]
[20334,"VARLENE TCE","North Urban East"]
[22483,"VAUGHAN CRES","North Urban East"]
[20737,"VAUGHANS RD","North Urban East"]
[34571,"VAUSE ST","Central East"]
[22150,"VAUXHALL RD","North Urban East"]
[80551,"VAZEY WAY","North Urban West"]
[52574,"VEAGH PL","South East Urban"]
[20680,"VEGA PL","North Urban West"]
[70617,"VELA PL","South Rural"]
[20286,"VELMA RD","North Urban West"]
[52575,"VELVET CRES","South West Urban"]
[54105,"VELVET CRES SERVICE LANE (RP49 LHS)","South West Urban"]
[80563,"VENETA CLOSE","South East Urban"]
[24099,"VENETO AVE (PVT)","North Urban West"]
[31397,"VENTNOR RD","Central East"]
[52576,"VENTURA ST","South West Urban"]
[52577,"VENUS PL","South East Urban"]
[80021,"VERA CRT","North Urban East"]
[40277,"VERA RD","West"]
[22208,"VERBENA RD","North Urban West"]
[34572,"VERCOE ST","Central"]
[47281,"VERDALE CIRCLE","West"]
[52578,"VERDI ST","South West Urban"]
[40276,"VERENA PL","West"]
[53677,"VERISSIMO DR","South West Urban"]
[54041,"VERLEY RISE","South East Urban"]
[41315,"VERMEER PL","North Urban West"]
[35597,"VERMONT PL (PVT)","Central"]
[31398,"VERMONT ST","Central"]
[60383,"VERNER PL","South West Urban"]
[10988,"VERNON SHAW PL","North Rural"]
[31399,"VERNON ST (CITY)","Central"]
[60246,"VERNON ST (PAPAKURA)","South West Urban"]
[34574,"VERONA AVE","Central"]
[60627,"VERONA PL","South West Urban"]
[11507,"VERONICA CLOSE","North Urban East"]
[40112,"VERONICA ST","West"]
[41240,"VERONICA/TOTARA RAB","West"]
[22209,"VERRAN RD","North Urban West"]
[52766,"VESCA PL","South East Urban"]
[15771,"VESCA PL/ASTORIA PL CYWAY","South East Urban"]
[15772,"VESCA PL/PAJARO PL CYWAY","South East Urban"]
[35063,"VESTEY DR","Central East"]
[52579,"VETORI PL","South West Urban"]
[35298,"VIADUCT HARBOUR AVE","Central"]
[15232,"VIADUCT HARBOUR AVE/CUSTOMS ST WEST CYWAY","Central"]
[31702,"VIALOU LANE","Central East"]
[34575,"VIC BUTLER ST","Central"]
[40018,"VIC WATSON WAY","West"]
[23000,"VICENTE PL","North Urban West"]
[52580,"VICKERMAN ST","South West Urban"]
[52581,"VICKERS CRES","South West Urban"]
[31400,"VICTOR ST","West"]
[31401,"VICTORIA AVE (REMUERA)","Central East"]
[70841,"VICTORIA AVE (WAIUKU)","South Rural"]
[31559,"VICTORIA AVE LLA (RP2050 LHS)","Central East"]
[36069,"VICTORIA GARDENS (PVT)","Central East"]
[35928,"VICTORIA LANE (PVT)","Central East"]
[35598,"VICTORIA MEWS (PVT)","Central East"]
[15220,"VICTORIA PARK LOOP CYWAY","Central"]
[15226,"VICTORIA PARK VIADUCT CYWAY","Central"]
[15227,"VICTORIA PARK VICTORIA ST WEST CYWAY","Central"]
[80233,"VICTORIA PARK WWAY 1","Central"]
[80234,"VICTORIA PARK WWAY 2","Central"]
[80235,"VICTORIA PARK WWAY 3","Central"]
[80236,"VICTORIA PARK WWAY 4","Central"]
[20597,"VICTORIA RD (DEVONPORT)","North Urban East"]
[52582,"VICTORIA RD (PAPATOETOE)","South West Urban"]
[34576,"VICTORIA RD NORTH","Hauraki Islands"]
[34577,"VICTORIA RD SOUTH","Hauraki Islands"]
[60420,"VICTORIA ST (DRURY)","South West Urban"]
[34579,"VICTORIA ST (ONEHUNGA)","Central East"]
[34578,"VICTORIA ST (OTAHUHU)","South West Urban"]
[71050,"VICTORIA ST (PUKEKOHE)","South Rural"]
[10990,"VICTORIA ST 2 (RIVERHEAD)","North Rural"]
[10991,"VICTORIA ST 3 (WARKWORTH)","North Rural"]
[31402,"VICTORIA ST EAST","Central"]
[31403,"VICTORIA ST WEST","Central"]
[71051,"VICTORIA ST WEST (PUKEKOHE)","South Rural"]
[15228,"VICTORIA ST WEST/VIC PARK LINK CYWAY (RP1073)","Central"]
[15229,"VICTORIA ST WEST/VIC PARK LINK CYWAY (RP1150)","Central"]
[15230,"VICTORIA ST WEST/VIC PARK LINK CYWAY (RP986)","Central"]
[31560,"VICTORIA/SONIA BUS SLIP","Central East"]
[40275,"VICTORY RD (LAINGHOLM)","West"]
[52583,"VICTORY RD (PAPATOETOE)","South West Urban"]
[52584,"VIDA PL","South East Urban"]
[54018,"VIDAL WAY","South East Urban"]
[53089,"VIDIRI CRT","South East Urban"]
[54423,"VIDIRI CRT HAMMERHEAD","South East Urban"]
[22210,"VIENNA PL","North Urban West"]
[35564,"VIENNA ROW (PVT)","Central East"]
[54224,"VIERA DR","South East Urban"]
[22485,"VIEW RD - CAMPBELLS BAY","North Urban East"]
[22486,"VIEW RD - CAMPBELLS BAY ACCWAY","North Urban East"]
[20398,"VIEW RD - GLENFIELD","North Urban West"]
[52585,"VIEW RD (MANGERE)","South West Urban"]
[34580,"VIEW RD (MT EDEN)","Central"]
[24029,"VIEW RD (NORTHSHORE) (PVT)","North Urban West"]
[60247,"VIEW RD (PAPAKURA)","South West Urban"]
[52586,"VIEW RD (SHELLY PARK)","South East Urban"]
[34581,"VIEW RD (WAIHEKE)","Hauraki Islands"]
[40274,"VIEW RD (WAITAKERE)","West"]
[70864,"VIEW RD (WAIUKU)","South Rural"]
[10992,"VIEW RD (WARKWORTH)","North Rural"]
[47245,"VIEW RIDGE DR (EAST)","West"]
[40693,"VIEW RIDGE DR (WEST)","West"]
[41231,"VIEW/JAMES LAURIE RAB","West"]
[34582,"VIEWLAND AVE","Central East"]
[52587,"VIGO PL","South West Urban"]
[34583,"VIKING AVE","Central"]
[54243,"VILLA CRT (PVT)","South East Urban"]
[52588,"VILLAGE DR (PVT)","South East Urban"]
[71380,"VILLAGE FIELDS RD","South Rural"]
[60464,"VILLAGE WAY","South Rural"]
[22884,"VILLANOVA PL","North Urban West"]
[53507,"VILLAROSA LANE","South East Urban"]
[53433,"VILLINO PL","South West Urban"]
[52589,"VILMA PL","South West Urban"]
[52590,"VIMY PL","South West Urban"]
[53646,"VIN ALTO DR","South East Urban"]
[40410,"VIN SANTO LANE","West"]
[40273,"VINA PL","West"]
[48299,"VINA PL WWAY","West"]
[80498,"VINCENT LANE","North Urban West"]
[21094,"VINCENT RD","North Urban West"]
[31404,"VINCENT ST (AUCKLAND)","Central"]
[52591,"VINCENT ST (HOWICK)","South East Urban"]
[54210,"VINCENT ST CARPARK (RP660 LHS)","South East Urban"]
[54704,"VINCENT ST CARPARK (RP709 LHS)","South East Urban"]
[40272,"VINCEROY PL","West"]
[54033,"VINCI CRT","South West Urban"]
[52592,"VINE ST (MANGERE)","South West Urban"]
[31405,"VINE ST (PONSONBY)","Central"]
[54167,"VINE ST CARPARK (RP698 LHS)","South West Urban"]
[80556,"VINEGAR LANE","Central"]
[22822,"VINEWOOD DR","North Urban West"]
[40271,"VINEYARD RD","West"]
[40785,"VINO CINA HGTS","West"]
[47080,"VINOGRAD DR","West"]
[40031,"VINTAGE DR","West"]
[15108,"VINTAGE DR/WILSHER CRES CARPARK CYWAY","West"]
[35262,"VINTAGE LANE","Hauraki Islands"]
[34584,"VINTER TCE","Central"]
[10993,"VINTNERS CLOSE","North Rural"]
[52593,"VIOLA AVE","South West Urban"]
[60248,"VIOLA PL","South West Urban"]
[34585,"VIOLET ST","Central"]
[10994,"VIPOND RD (STANMORE BAY)","North Urban East"]
[11577,"VIPOND RD 2 (MANGAWHAI)","North Rural"]
[10995,"VIPOND RD 2 (TOPUNI)","North Rural"]
[11279,"VIPOND RD 281 - 297","North Urban East"]
[52917,"VIREYA CRT","South West Urban"]
[32953,"VIRGINIA AVE EAST","Central"]
[31406,"VIRGINIA AVE WEST","Central"]
[10996,"VIRGINIA CIRCUS","North Rural"]
[47286,"VIRGINIA ST","West"]
[40152,"VIRGO PL","West"]
[23063,"VIRIDIAN LANE","North Urban West"]
[52594,"VISCOUNT ST","South West Urban"]
[53567,"VISION PL","South West Urban"]
[31407,"VISTA CRES","Central East"]
[10997,"VISTA MOTU","North Urban East"]
[52595,"VISTA PL","South West Urban"]
[40270,"VITASOVICH AVE","West"]
[47197,"VITEX LANE","West"]
[54559,"VITTORIA TCE","South East Urban"]
[11532,"VIV DAVIE-MARTIN DR","North Rural"]
[35013,"VIVALDI PL","Central"]
[80025,"VIVIAN RD","North Urban East"]
[52596,"VIVIAN WILSON DR","South East Urban"]
[54667,"VIVIAN WILSON DR EXTN","South East Urban"]
[71549,"VIVIEN PL","South Rural"]
[40269,"VODANOVICH RD","West"]
[35073,"VOGEL LANE","Central"]
[53474,"VOGLER DR","South West Urban"]
[52597,"VOLANTE AVE","South West Urban"]
[15435,"VOLANTE AVE/INNISMARA AVE CYWAY","South West Urban"]
[34586,"VOLCANIC ST","Central"]
[22841,"VOLKNER PL","North Urban West"]
[52598,"VOLTA PL","South West Urban"]
[52599,"VOLTAIRE CRT","South East Urban"]
[52600,"VON STURMER ST","South West Urban"]
[20529,"VONNELL PL","North Urban West"]
[11393,"VOYAGER DR","North Urban East"]
[31408,"VULCAN LANE","Central"]
[40268,"WAARI AVE","West"]
[31409,"WADDELL AVE","Central East"]
[52601,"WADDON PL","South West Urban"]
[18003,"WADDON PL NORTHERN CARPARK","South West Urban"]
[18002,"WADDON PL SOUTHERN CARPARK","South West Urban"]
[34587,"WADE AVE","Central East"]
[10998,"WADE RIVER RD","North Urban East"]
[11241,"WADE RIVER RD CARPARK","North Urban East"]
[31410,"WADE ST","West"]
[52602,"WADES RD","South Rural"]
[40267,"WADIER PL","West"]
[40266,"WAERENGA PL","West"]
[34588,"WAGENER PL","Central"]
[34589,"WAHANUI RD","Central East"]
[35903,"WAHANUI/EWENSON WWAY (RP97 LHS)","Central East"]
[52748,"WAI ITI PL","South West Urban"]
[54380,"WAI ITI PL EXTN","South West Urban"]
[22487,"WAIAKE ST","North Urban East"]
[52603,"WAIANA AVE","South West Urban"]
[31411,"WAI-ANIWA PL","West"]
[34590,"WAIAPU LANE","Central East"]
[35948,"WAIAPU LANE CARPARK","Central East"]
[60387,"WAIARI RD","South West Urban"]
[80303,"WAIAROHIA PL","North Urban West"]
[80304,"WAIAROHIA PL HAMMERHEAD","North Urban West"]
[31412,"WAIATA AVE","Central East"]
[34591,"WAIATA RD","Hauraki Islands"]
[35250,"WAIATARAU PL (PVT)","Central"]
[31413,"WAIATARUA RD","Central East"]
[15260,"WAIATARUA RESERVE LOOP CYWAY","Central East"]
[15271,"WAIATARUA RESERVE NORTHEAST DEAD END CYWAY","Central East"]
[15262,"WAIATARUA RESERVE NTH LINK (STH - NTH) CYWAY","Central East"]
[15263,"WAIATARUA RESERVE NTH LINK (WST - EAST) CYWAY","Central East"]
[15270,"WAIATARUA RESERVE PLAYGROUND LINK CYWAY","Central East"]
[15261,"WAIATARUA RESERVE SOUTHEAST DEAD END CYWAY","Central East"]
[15272,"WAIATARUA RESERVE WEST DEAD END CYWAY","Central East"]
[15267,"WAIATARUA RESERVE WESTERN LOOP CYWAY","Central East"]
[70619,"WAIAU PA RD","South Rural"]
[22488,"WAIAU ST","North Urban East"]
[34592,"WAIHEKE RD","Hauraki Islands"]
[53538,"WAIHI WAY","South East Urban"]
[53547,"WAIHI WAY/OPITO WAY LINK","South East Urban"]
[60390,"WAIHOEHOE RD (DRURY)","South West Urban"]
[60712,"WAIHOEHOE RD (RUNCIMAN) (SR)","South Rural"]
[35022,"WAIKARAKA RD","Central East"]
[34594,"WAIKARE RD (OTAHUHU)","South West Urban"]
[34593,"WAIKARE RD (WAIHEKE)","Hauraki Islands"]
[36101,"WAIKARE RD ACCESSWAY (WAIHEKE)","Hauraki Islands"]
[40265,"WAIKAREKARE LANE","West"]
[52604,"WAIKAREMOANA PL","South East Urban"]
[31414,"WAIKATO PL","Central East"]
[35868,"WAIKATO/COLLEGE WWAY (RP78 RHS)","Central East"]
[40167,"WAIKAUKAU RD","West"]
[52605,"WAIKOPUA RD","South Rural"]
[10999,"WAIKOUKOU VALLEY RD","North Rural"]
[15304,"WAIKOWHAI INTERMEDIATE/MOTORWAY CYWAY","Central"]
[34595,"WAIKOWHAI RD","Central"]
[40038,"WAIKUMETE RD","West"]
[47081,"WAIKURA DR","West"]
[40264,"WAIMA CRES","West"]
[31415,"WAIMA ST","Central"]
[52606,"WAIMAHIA AVE","South West Urban"]
[54061,"WAIMAHIA AVE CARPARK (RP6 RHS)","South West Urban"]
[54390,"WAIMAHIA AVE HAMMERHEAD","South West Urban"]
[54383,"WAIMAHIA/WAIMARINO RAB","South West Urban"]
[52607,"WAIMAI AVE","South West Urban"]
[54391,"WAIMAI AVE CARPARK (RP475 RHS)","South West Urban"]
[53980,"WAIMAI AVE-BOOKER PL","South West Urban"]
[21095,"WAIMANA AVE","North Urban West"]
[60386,"WAIMANA RD","South West Urban"]
[71319,"WAIMANAWA LANE","South Rural"]
[34999,"WAIMANGU RD","Hauraki Islands"]
[47082,"WAIMANU BAY DR","West"]
[11000,"WAIMANU PL","North Rural"]
[11001,"WAIMANU RD","North Rural"]
[40168,"WAIMANU/SPINNAKER RAB","West"]
[40263,"WAIMARIE RD","North Urban West"]
[31416,"WAIMARIE ST","Central East"]
[53108,"WAIMARINO RD","South West Urban"]
[52785,"WAIMATE ST","South West Urban"]
[11002,"WAIMAUKU STATION RD","North Rural"]
[31417,"WAIMEA LANE","Central East"]
[41307,"WAIMOKO GLEN","West"]
[40262,"WAIMUMU RD","West"]
[47088,"WAIMURI CLOSE","West"]
[80720,"WAINA DRIVE","North Rural"]
[31418,"WAINONI AVE","Central"]
[20610,"WAINONI HEIGHTS","North Urban West"]
[11003,"WAINONI PL","North Rural"]
[31419,"WAINUI AVE","Central"]
[11004,"WAINUI RD (EAST)","North Urban East"]
[80449,"WAINUI RD (RURAL)","North Rural"]
[11244,"WAINUI RD SERVICE LANE(INIT HOMES","North Rural"]
[34597,"WAINWRIGHT AVE","Central"]
[15288,"WAINWRIGHT AVE/UNDERWOOD PARK LINK CYWAY","Central"]
[34598,"WAIOHUA RD","Central East"]
[34022,"WAIOHUA RD EXTN (RP139 LHS)","Central East"]
[40261,"WAIONE AVE","West"]
[60496,"WAIONE CRT","South West Urban"]
[11005,"WAIORA RD","North Urban East"]
[54791,"WAIOURU RD","South East Urban"]
[15551,"WAIOURU RD LINK CYWAY (RP540)","South East Urban"]
[22213,"WAIPA ST","North Urban West"]
[40260,"WAIPANI RD","West"]
[48177,"WAIPANI RD WWAY","West"]
[52610,"WAIPAPA CRES","South West Urban"]
[54649,"WAIPAPA CRES CARPARK (RP149 LHS)","South East Urban"]
[40259,"WAIPAREIRA AVE","West"]
[40528,"WAIPAREIRA RAB","West"]
[70621,"WAIPIPI WHARF RD","South Rural"]
[80617,"WAIPOKAPU PL (PVT)","South West Urban"]
[52611,"WAIPOURI RD","South West Urban"]
[20614,"WAIPUIA PL","North Urban West"]
[34601,"WAIPUNA RD","Central East"]
[34600,"WAIPUNA RD EAST","Central East"]
[34912,"WAIPUNA RD EXTN (RP100 RHS)","Central East"]
[35899,"WAIPUNA/WAIPUNA EAST WWAY (RP1130)","Central East"]
[31420,"WAIRAKEI ST","Central"]
[31421,"WAIRANGI ST","Central"]
[40258,"WAIRATA PL","West"]
[31422,"WAIRAU AVE","West"]
[20008,"WAIRAU RD (EAST)","North Urban East"]
[80450,"WAIRAU RD (WEST)","North Urban West"]
[23089,"WAIRAU RD LLA (#235 - #253)","North Urban West"]
[22579,"WAIRAU RD LLA (#284 - #304)","North Urban West"]
[22578,"WAIRAU RD LLA (#389 - #397)","North Urban West"]
[23056,"WAIRAU TO SHAKESPEARE RD SLIP LAN","North Urban East"]
[34602,"WAIRERE AVE","Central"]
[52612,"WAIRERE RD (MANUREWA)","South West Urban"]
[22489,"WAIRERE RD (TORBAY)","North Urban East"]
[11111,"WAIRERE RD (WAITAKERE)","West"]
[34603,"WAIRIKI RD","Central"]
[22179,"WAIROA RD","North Urban East"]
[15002,"WAIROA RD STH/WAIROA RD NTH CYWAY (RP690)","North Urban East"]
[15004,"WAIROA RD/SEABREEZE RD CYWAY (RP227)","North Urban East"]
[71502,"WAIRUA PL","South Rural"]
[31423,"WAIRUA RD (REMUERA)","Central East"]
[34605,"WAIRUA RD (WAIHEKE)","Hauraki Islands"]
[34991,"WAIRUA RD EXTN (RP60 RHS)","Hauraki Islands"]
[34606,"WAITAI RD","Hauraki Islands"]
[41223,"WAITAKERE LANE","West"]
[40257,"WAITAKERE RD (SWANSON)","West"]
[11007,"WAITAKERE RD (TAUPAKI)","North Rural"]
[40256,"WAITAKI ST","West"]
[48168,"WAITAKI ST WWAY","West"]
[70622,"WAITANGI FALLS RD","South Rural"]
[34607,"WAITANGI RD","Central East"]
[35905,"WAITANGI/BOW WWAY (RP99 LHS)","Central East"]
[34608,"WAITAPU RD","Central"]
[31424,"WAITARA RD","Central East"]
[31425,"WAITATI PL","West"]
[60512,"WAITAUA AVE","South West Urban"]
[34609,"WAITE AVE","Central"]
[11008,"WAITEA RD","North Rural"]
[11009,"WAITEITEI RD","North Rural"]
[40255,"WAITEMATA DR","West"]
[41289,"WAITEMATA DR WEST","West"]
[20117,"WAITEMATA RD","North Urban East"]
[31426,"WAITEMATA ST","Central"]
[40662,"WAITEMATA/LUANDA RAB","West"]
[54804,"WAITI BAY CARPARK","South Rural"]
[31427,"WAITOA ST (PARNELL)","Central"]
[71302,"WAITOA ST (WAIUKU)","South Rural"]
[11010,"WAITOKI RD","North Rural"]
[34610,"WAITOMO AVE","Central"]
[70623,"WAIUKU RD","South Rural"]
[70088,"WAIUKU/FOY SLIP","South Rural"]
[70625,"WAIUKU-OTAUA RD","South Rural"]
[11011,"WAIWERA AVE","North Rural"]
[11012,"WAIWERA PL","North Urban East"]
[11013,"WAIWERA RD","North Urban East"]
[11014,"WAIWHIU RD","North Rural"]
[60659,"WAKA ST","South West Urban"]
[24009,"WAKAKURA CRES (PVT)","North Urban East"]
[22214,"WAKANUI ST","North Urban West"]
[47255,"WAKAROA AVE","West"]
[31428,"WAKATIPU ST","Central"]
[11015,"WAKE RD","North Rural"]
[52613,"WAKEFIELD RD","South West Urban"]
[31429,"WAKEFIELD ST","Central"]
[34875,"WAKEFIELD/SYMONDS SLIP","Central"]
[52614,"WAKELIN RD (BEACHLANDS)","South Rural"]
[52615,"WAKELIN RD (MANGERE)","South West Urban"]
[54733,"WAKELIN RD CARPARK (RP394 LHS)","South Rural"]
[54734,"WAKELIN RD CARPARK (RP489 RHS)","South Rural"]
[54805,"WAKELIN RD CARPARK (RP800 LHS)","South Rural"]
[40254,"WAKELING AVE","West"]
[48142,"WAKELING AVE WWAY","West"]
[11016,"WALBROOK RD","North Urban East"]
[52616,"WALDEN PL","South West Urban"]
[53981,"WALDEN PL-TOMLIN PL","South West Urban"]
[11194,"WALDORF CRES","North Urban East"]
[53417,"WALDOS WAY","South West Urban"]
[31430,"WALFORD RD","Central"]
[60391,"WALKER RD (DRURY)","South Rural"]
[31431,"WALKER RD (PT CHEVALIER)","Central"]
[40253,"WALKER RD (WAITAKERE)","West"]
[71184,"WALLACE DR","South Rural"]
[80282,"WALLACE RD (HOBSONVILLE)","North Urban West"]
[52617,"WALLACE RD (MANGERE)","South West Urban"]
[52618,"WALLACE RD (PAPATOETOE)","South West Urban"]
[40252,"WALLACE RD (WAITAKERE)","West"]
[54620,"WALLACE RD CARPARK (RP234 RHS)","South West Urban"]
[54905,"WALLACE RD CARPARK (RP95 RHS)","South West Urban"]
[15540,"WALLACE RD/AMBURY REGIONAL PARK LINK CYWAY","South West Urban"]
[53983,"WALLACE RD-HAYWARD RD","South West Urban"]
[53982,"WALLACE RD-MILES AVE","South West Urban"]
[31432,"WALLACE ST","Central"]
[34611,"WALLATH RD","Central East"]
[52619,"WALLER AVE","South East Urban"]
[15796,"WALLER AVE/HATTAWAY AVE CYWAY","South East Urban"]
[53984,"WALLER AVE-HATTAWAY AVE","South East Urban"]
[70627,"WALLER RD","South Rural"]
[34612,"WALLER ST","Central East"]
[35576,"WALLINGFORD AVE","Hauraki Islands"]
[31433,"WALLINGFORD ST","Central"]
[31169,"WALLINGFORD ST EXTN","Central"]
[15251,"WALLINGFORD ST/GREY LYNN PARK LINK CYWAY","Central"]
[41261,"WALLINGFORD WAY (PVT)","North Urban West"]
[34613,"WALLS RD","Central East"]
[40251,"WALLY NOLA PL","West"]
[48083,"WALLY NOLA PL WWAY","West"]
[31434,"WALMER RD","Central"]
[52620,"WALMSLEY RD (MANGERE)","South West Urban"]
[34614,"WALMSLEY RD (OTAHUHU)","South West Urban"]
[31435,"WALMSLEY RD (ST HELIERS)","Central East"]
[54637,"WALMSLEY RD CARPARK (RP764 LHS) (PVT)","South West Urban"]
[22490,"WALNUT LANE","North Urban East"]
[80545,"WALNUT RD","North Rural"]
[52621,"WALPOLE AVE","South West Urban"]
[53985,"WALPOLE AVE-GREAT SOUTH RD","South West Urban"]
[31436,"WALPOLE ST","Central East"]
[31437,"WALSALL ST","West"]
[52622,"WALSH BROTHERS PL (PVT)","South West Urban"]
[80381,"WALSH RD","South West Urban"]
[35041,"WALTER BLACKWELL RD","Hauraki Islands"]
[80030,"WALTER CRES 1","North Urban East"]
[80231,"WALTER CRES 2","North Urban East"]
[36097,"WALTER FRANK DR","Hauraki Islands"]
[53429,"WALTER HADDRELL CRES","South East Urban"]
[53166,"WALTER LITTLE WAY","South East Urban"]
[52623,"WALTER MACDONALD ST","South East Urban"]
[52624,"WALTER ST (MANGERE)","South West Urban"]
[20123,"WALTER ST (TAKAPUNA)","North Urban East"]
[22548,"WALTER ST LLA","North Urban East"]
[60388,"WALTER STREVENS DR","South West Urban"]
[60573,"WALTER STREVENS/BRYLEE RAB","South West Urban"]
[15407,"WALTER STREVENS/REYNARD TCE CYWAY (RP2215)","South West Urban"]
[70629,"WALTERS RD (AWHITU)","South Rural"]
[70628,"WALTERS RD (KARAKA)","South Rural"]
[34615,"WALTERS RD (KINGSLAND)","Central"]
[34616,"WALTERS RD (MT WELLINGTON)","Central East"]
[60385,"WALTERS RD (PAPAKURA)","South West Urban"]
[47324,"WALTHAM ST","West"]
[11017,"WALTON AVE","North Rural"]
[11018,"WALTON ST (RED BEACH)","North Urban East"]
[31438,"WALTON ST (REMUERA)","Central East"]
[52625,"WALWORTH AVE","South East Urban"]
[53986,"WALWORTH AVE-HARFORD PL","South East Urban"]
[52626,"WANAKA PL","South East Urban"]
[53339,"WANDO LANE","South East Urban"]
[34617,"WANGANELLA PL","Central"]
[22215,"WANGANELLA ST","North Urban West"]
[31439,"WANGANUI AVE","Central"]
[20383,"WANITA PL","North Urban West"]
[52627,"WANSTEAD WAY","South West Urban"]
[52628,"WAOKAURI PL","South West Urban"]
[34619,"WAPITI AVE","Central"]
[22216,"WARATAH ST","North Urban West"]
[34620,"WARBOROUGH AVE","Central"]
[40250,"WARD CRES","West"]
[11019,"WARD RD","North Rural"]
[71052,"WARD ST (PUKEKOHE)","South Rural"]
[40108,"WARD ST (WAITAKERE)","West"]
[34621,"WARD TCE","Central"]
[15301,"WARD TCE/KING EDWARD ST CYWAY","Central"]
[71556,"WARD/WELLINGTON RAB","South Rural"]
[52629,"WARDEN PL","South West Urban"]
[52630,"WARE PL","South East Urban"]
[35074,"WARIMU PL (PVT)","Central"]
[10652,"WARIN PL","North Rural"]
[11020,"WARKWORTH ST","North Rural"]
[11425,"WARKWORTH ST (EAST)","North Rural"]
[24086,"WARMAN RD (PVT)","North Urban East"]
[23059,"WARNBOET LANE","North Urban West"]
[40249,"WARNER PARK AVE","West"]
[31440,"WARNOCK ST","Central"]
[34622,"WARREN AVE","Central"]
[54244,"WARREN WAY (PVT)","South East Urban"]
[31441,"WARRINGTON RD","Central East"]
[70852,"WARRISTON AVE","South Rural"]
[11349,"WARU NUI CRT","North Urban East"]
[15046,"WARU NUI CT LINK CYWAY","North Urban East"]
[52631,"WARWICK AVE (PAPATOETOE)","South West Urban"]
[40248,"WARWICK AVE (WAITAKERE)","West"]
[31443,"WARWICK AVE (WESTMERE)","Central"]
[34623,"WARWICK ST","Central"]
[31444,"WASHINGTON AVE (GLENDOWIE)","Central East"]
[11021,"WASHINGTON AVE (SNELLS BEACH)","North Rural"]
[60433,"WASTNEY RD","South West Urban"]
[52632,"WATCHFIELD CLOSE","South West Urban"]
[40247,"WATCHMANS RD","West"]
[34624,"WATEA RD (SANDRINGHAM)","Central"]
[22491,"WATEA RD (TORBAY)","North Urban East"]
[31445,"WATENE CRES","Central East"]
[34625,"WATENE RD","Central East"]
[34626,"WATER ST (MT EDEN)","Central"]
[34627,"WATER ST (OTAHUHU)","South West Urban"]
[31446,"WATERBANK CRES","Central"]
[53440,"WATERBURY PL","South West Urban"]
[24043,"WATERFORD LANE (PVT)","North Urban West"]
[52634,"WATERFORD WAY (PVT)","South Rural"]
[54825,"WATERFRONT RD","South West Urban"]
[52635,"WATERFRONT RD EXTN (RP49 RHS)","South West Urban"]
[52636,"WATERLEA AVE","South West Urban"]
[31447,"WATERLOO QUADRANT","Central"]
[20250,"WATERLOO RD (MILFORD)","North Urban East"]
[11023,"WATERLOO RD (SILVERDALE)","North Urban East"]
[52637,"WATERLOO ST","South East Urban"]
[40127,"WATERS PL","West"]
[48054,"WATERS PL WWAY","West"]
[53106,"WATERSFIELD PL","South East Urban"]
[11400,"WATERSIDE CRES","North Urban East"]
[47220,"WATERSTONE WAY","West"]
[31448,"WATERTON PL","West"]
[35276,"WATERVIEW DOWNS (PVT)","Central"]
[15158,"WATERVIEW DOWNS CYWAY","Central"]
[20696,"WATERVIEW RD (DEVONPORT)","North Urban East"]
[52638,"WATERVIEW RD (MANGERE)","South West Urban"]
[60250,"WATERVIEW RD (WEST)","South West Urban"]
[60384,"WATERVIEW RD EAST","South West Urban"]
[35637,"WATERVIEW/PATIKI CYWAY","Central"]
[53217,"WATERVISTA PL","South West Urban"]
[52639,"WATFORD ST","South West Urban"]
[80729,"WATKINSON ROAD","North Urban East"]
[31449,"WATLING ST","Central"]
[34628,"WATSON AVE","Central"]
[52640,"WATSON PL (PAPATOETOE)","South West Urban"]
[11104,"WATSON PL (WELLSFORD)","North Rural"]
[53987,"WATSON PL-CENTRAL AVE","South West Urban"]
[34629,"WATSON RD","Hauraki Islands"]
[31450,"WATT ST","Central"]
[70632,"WATTIE RD","South Rural"]
[71163,"WATTLE BAY RD","South Rural"]
[15749,"WATTLE DOWNS ESPLANADE RESERVE LAKE CYWAY","South West Urban"]
[52641,"WATTLE FARM RD","South West Urban"]
[15751,"WATTLE FARM RD LINK CYWAY","South West Urban"]
[15432,"WATTLE FARM RD/ABERDEEN CRES CYWAY","South West Urban"]
[15436,"WATTLE FARM RD/VOLANTE AVE CYWAY","South West Urban"]
[53478,"WATTLE FARM/BLACKWOOD RAB","South West Urban"]
[54365,"WATTLE FARM/GLENCALDER RAB","South West Urban"]
[54366,"WATTLE FARM/MUIRFIELD RAB","South West Urban"]
[40246,"WATTLE RD (SUNNYVALE)","West"]
[34630,"WATTLE RD (WAIHEKE)","Hauraki Islands"]
[40126,"WATTLE ST","West"]
[52642,"WATTS RD","South West Urban"]
[53988,"WATTS RD-BROWNS RD","South West Urban"]
[80423,"WAUTAITI DRIVE","North Rural"]
[20504,"WAVERLEY AVE","North Urban West"]
[31451,"WAVERLEY ST","Central"]
[60622,"WAWATAI DR","South West Urban"]
[60699,"WAWATAI/KUHANUI RAB","South West Urban"]
[11025,"WAYBY STATION RD","North Rural"]
[11026,"WAYBY VALLEY RD","North Rural"]
[52816,"WAYLEN PL","South East Urban"]
[52643,"WAYNE DR","South West Urban"]
[53223,"WAYNE FRANCIS DR","South East Urban"]
[54453,"WAYNE FRANCIS/ALVRE RAB","South East Urban"]
[53323,"WAYNE FRANCIS/BANVILLE RAB","South East Urban"]
[54454,"WAYNE FRANCIS/MORDANE RAB","South East Urban"]
[34631,"WAYNE PL","Central"]
[71490,"WAYNES PL","South Rural"]
[53578,"WEATHERLY DR","South Rural"]
[22492,"WEATHERLY RD","North Urban East"]
[34632,"WEAVER AVE","Central"]
[20241,"WEBB PL","North Urban East"]
[71053,"WEBB ST","South Rural"]
[11027,"WEBBER RD","North Rural"]
[33016,"WEBBER ST","Central"]
[15212,"WEBBER ST LINK CYWAY","Central"]
[34633,"WEBSTER AVE","Central"]
[52644,"WEBSTER LANE","South West Urban"]
[11028,"WECH ACCESS","North Rural"]
[11029,"WECH DR","North Rural"]
[60453,"WEDDING PL","South Rural"]
[52645,"WEDGWOOD AVE","South West Urban"]
[22493,"WEETMAN DR","North Urban East"]
[11030,"WEITI RD","North Urban East"]
[34635,"WEKA RD","Hauraki Islands"]
[36107,"WEKA RD CARPARK","Hauraki Islands"]
[34634,"WEKA ST","South West Urban"]
[52646,"WELBY PL","South West Urban"]
[41373,"WELCOME PL","West"]
[31453,"WELD ST","Central"]
[20405,"WELDENE AVE","North Urban West"]
[20546,"WELLAND PL","North Urban West"]
[30599,"WELLESLEY EAST/MAYORAL SLIP","Central"]
[52647,"WELLESLEY RD","South West Urban"]
[31454,"WELLESLEY ST EAST","Central"]
[31533,"WELLESLEY ST EAST (NORTHBOUND)","Central"]
[31708,"WELLESLEY ST EAST (PRINCES-STANLEY)","Central"]
[31455,"WELLESLEY ST WEST","Central"]
[30805,"WELLESLEY/VICTORIA SLIP","Central"]
[34636,"WELLGARTH ST","Central"]
[34637,"WELLINGTON RD","Hauraki Islands"]
[31456,"WELLINGTON ST (FREEMANS BAY)","Central"]
[52648,"WELLINGTON ST (HOWICK)","South East Urban"]
[60251,"WELLINGTON ST (PAPAKURA)","South West Urban"]
[71054,"WELLINGTON ST (PUKEKOHE)","South Rural"]
[54084,"WELLINGTON ST CARPARK (RP10 RHS)","South East Urban"]
[71274,"WELLINGTON ST LOOP","South Rural"]
[54703,"WELLINGTON ST LOWER CARPARK (RP50)","South East Urban"]
[52840,"WELLINGTON ST SERVICE LANE (RP1104)","South East Urban"]
[31727,"WELLINGTON ST SLIP","Central"]
[54083,"WELLINGTON ST UPPER CARPARK (RP50)","South East Urban"]
[54687,"WELLINGTON/NELSON RAB","South East Urban"]
[35777,"WELLINGTON/SHERIDAN WWAY (RP491)","Central"]
[54595,"WELLINGTON/VINCENT RAB","South East Urban"]
[31457,"WELLPARK AVE","Central"]
[52649,"WELLS RD","South East Urban"]
[54661,"WELLS RD SCHOOL LOOP","South East Urban"]
[15781,"WELLS RD/THURSTON PL CYWAY","South East Urban"]
[11031,"WELLSFORD VALLEY RD","North Rural"]
[40245,"WELSH HILLS RD","West"]
[34638,"WELSH ST","Central"]
[34639,"WEMBLEY RD","Central"]
[34641,"WENDELL PL","Central East"]
[31458,"WENDOVER RD","Central East"]
[40244,"WENDY RD","West"]
[52651,"WENLOCK PL","South West Urban"]
[54308,"WENLOCK PL CARPARK (RP18 LHS)","South West Urban"]
[22667,"WENTWOOD PL","North Urban East"]
[52652,"WENTWORTH AVE","South West Urban"]
[22768,"WENTWORTH PARK","North Urban West"]
[11032,"WENZ BAYER RD","North Rural"]
[11033,"WENZLICK RD","North Rural"]
[31459,"WEONA PL","Central"]
[11034,"WERANUI RD (EAST)","North Urban East"]
[80451,"WERANUI RD (RURAL)","North Rural"]
[22217,"WERNHAM PL","North Urban West"]
[34642,"WESLEY AVE","Central"]
[34876,"WESLEY BAY GL (PVT)","Central"]
[22205,"WESLEY ST (DEVONPORT)","North Urban East"]
[71055,"WESLEY ST (PUKEKOHE)","South Rural"]
[60252,"WESLEYDALE PL","South West Urban"]
[60574,"WESLEYDALE PL HAMMERHEAD","South West Urban"]
[41432,"WEST COAST RD #425 (PVT)","West"]
[70634,"WEST COAST RD (AWHITU)","South Rural"]
[40204,"WEST COAST RD (WAITAKERE)","West"]
[11035,"WEST COAST RD (WOODCOCKS)","North Rural"]
[48067,"WEST COAST RD WWAY 1","West"]
[48068,"WEST COAST RD WWAY 2","West"]
[48069,"WEST COAST RD WWAY 3","West"]
[80246,"WEST COAST RD/GLENVIEW RD CARPARK","West"]
[41214,"WEST COAST/PARKER SLIP","West"]
[41320,"WEST COAST/PARRS CROSS RAB","West"]
[47213,"WEST COAST/WESTWARD HO RAB","West"]
[34757,"WEST END RD","Central"]
[15214,"WEST END RD/COXS BAY PARK CYWAY","Central"]
[15209,"WEST END RD/KINGSLEY ST CYWAY (RP697)","Central"]
[15213,"WEST END RD/RICHMOND RD CYWAY (RP577)","Central"]
[52653,"WEST FAIRWAY","South East Urban"]
[22218,"WEST GLADE CRES","North Urban West"]
[40242,"WEST HARBOUR DR","West"]
[48254,"WEST HARBOUR DR - RENA WWAY","West"]
[48226,"WEST HARBOUR DR - WORTHINGTON PL WWAY","West"]
[41165,"WEST HARBOUR DR LOOP","West"]
[48255,"WEST HARBOUR DR WWAY","West"]
[48225,"WEST HARBOUR DR WWAY -WEST HARBOUR DR","West"]
[11433,"WEST HOE HEIGHTS","North Urban East"]
[11036,"WEST HOE RD","North Urban East"]
[40241,"WEST LYNN RD","West"]
[70065,"WEST PALMS WAY","South Rural"]
[52654,"WEST RD (CLEVEDON)","South Rural"]
[11038,"WEST RD (KAUKAPAKAPA)","North Rural"]
[54587,"WEST RD CARPARK (RP39 RHS)","South Rural"]
[11039,"WEST ST (HVILLE)","North Rural"]
[31460,"WEST ST (NEWTON)","Central"]
[60253,"WEST ST (PAPAKURA)","South West Urban"]
[71056,"WEST ST (PUKEKOHE)","South Rural"]
[11040,"WEST ST 2 (MAH EAST)","North Rural"]
[31472,"WEST TAMAKI RD","Central East"]
[35881,"WEST TAMAKI/LEYBOURNE WWAY (RP1626)","Central East"]
[31461,"WEST TCE","Central"]
[31473,"WEST VIEW RD","Central"]
[41203,"WEST VIEW RESERVE ACCESS RD","West"]
[15146,"WEST WAVE CARPARK/HENDERSON CREEK RES CYWAY","West"]
[15147,"WEST WAVE NTH LINK CYWAY","West"]
[71367,"WEST/HELVETIA RAB","South Rural"]
[71256,"WEST/TOBIN RAB","South Rural"]
[40069,"WESTALL RD","West"]
[31462,"WESTBOURNE RD","Central East"]
[22494,"WESTBOURNE RD (EAST)","North Urban East"]
[22567,"WESTBOURNE RD (WEST)","North Urban East"]
[60389,"WESTBROOK AVE","South West Urban"]
[31463,"WESTBURY CRES","Central East"]
[40007,"WESTECH PL","West"]
[41218,"WESTECH PL HAMMERHEAD","West"]
[40239,"WESTERGROVE PL","North Urban West"]
[52960,"WESTERHAM DR","South East Urban"]
[15675,"WESTERHAM DR LINK CYWAY","South East Urban"]
[80369,"WESTERLEY PL","North Urban East"]
[40240,"WESTERN RD","West"]
[15039,"WESTERN RESERVE LINK CYWAY","North Urban East"]
[31465,"WESTERN SPRINGS RD","Central"]
[15307,"WESTERN SPRINGS RD/MOTORWAY LINK CYWAY","Central"]
[35064,"WESTFIELD PL","Central East"]
[47372,"WESTGATE  ACCESS RD","West"]
[47373,"WESTGATE ACCESS RAB # 1","West"]
[47374,"WESTGATE ACCESS RAB # 2","West"]
[41374,"WESTGATE DR","West"]
[48297,"WESTGATE DR - LAZUIRITE WWAY","West"]
[80354,"WESTGATE DR FOOTBRIDGE","West"]
[48295,"WESTGATE DR WWAY - CINABAR #17 WWAY","West"]
[48294,"WESTGATE DR WWAY - WESTGATE DR WWAY","West"]
[48296,"WESTGATE DR WWAY - WESTGATE OPP NAT B","West"]
[48293,"WESTGATE DRV WWAY","West"]
[41200,"WESTGATE/FERNHILL RAB","West"]
[41110,"WESTGLEN PL","West"]
[48242,"WESTGROOVE PL WWAY","North Urban West"]
[31466,"WESTHAVEN DR","Central"]
[15327,"WESTHAVEN DR CYWAY","Central"]
[70635,"WESTHEAD RD","South Rural"]
[60254,"WESTHOLM WAY","South West Urban"]
[31467,"WESTMERE CRES","Central"]
[31468,"WESTMERE PARK AVE","Central"]
[22669,"WESTMINSTER GARDENS","North Urban West"]
[11444,"WESTMINSTER GLEN","North Rural"]
[34644,"WESTMINSTER RD","Central"]
[31469,"WESTMINSTER ST","West"]
[15256,"WESTMINSTER ST LINK CYWAY","West"]
[31470,"WESTMORELAND ST EAST","Central"]
[31471,"WESTMORELAND ST WEST","Central"]
[31083,"WESTMORELAND ST WEST HAMMERHEAD","Central"]
[15237,"WESTMORELAND ST WEST/HAKANOA ST CYWAY","Central"]
[52655,"WESTNEY RD","South West Urban"]
[54623,"WESTNEY RD CARPARK (RP248 RHS)","South West Urban"]
[34645,"WESTON AVE (MT ALBERT)","Central"]
[52656,"WESTON AVE (PAPATOETOE)","South West Urban"]
[40238,"WESTPARK DR","North Urban West"]
[11037,"WESTPARK GLEN","North Rural"]
[49997,"WESTPARK MARINA CARPARK","North Urban West"]
[40237,"WESTRIDGE RD","West"]
[47083,"WESTVALE AVE","West"]
[52657,"WESTVIEW CRT","South East Urban"]
[54698,"WESTVIEW CRT EXTN","South East Urban"]
[40006,"WESTWARD HO","West"]
[20085,"WESTWELL RD","North Urban East"]
[31474,"WESTWOOD TCE","Central"]
[80634,"WETA RD","North Urban West"]
[31475,"WEXFORD RD","Central"]
[31476,"WEYBRIDGE CRES","Central East"]
[15442,"WEYMOUTH RAB CYWAY","South West Urban"]
[15441,"WEYMOUTH RAB LINK CYWAY","South West Urban"]
[15440,"WEYMOUTH RAB/WEYMOUTH RD CYWAY","South West Urban"]
[52658,"WEYMOUTH RD","South West Urban"]
[54058,"WEYMOUTH RD CARPARK (RP1104 LHS)","South West Urban"]
[54062,"WEYMOUTH RD CARPRK (RP568 RHS)","South West Urban"]
[54089,"WEYMOUTH RD SERVICE LANE (RP1108)","South West Urban"]
[54740,"WEYMOUTH RD SERVICE LANE (RP250)","South West Urban"]
[15745,"WEYMOUTH RD/MAHIA RD CYWAY","South West Urban"]
[15439,"WEYMOUTH RD/MOUNTFORT PARK CYWAY","South West Urban"]
[80610,"WEYMOUTH/KAIMOANA RAB","South West Urban"]
[52734,"WEYMOUTH/ROSCOMMON RAB","South West Urban"]
[54785,"WEYMOUTH/SELWYN RAB","South West Urban"]
[54322,"WEYMOUTH/WAIMAHIA RAB","South West Urban"]
[54323,"WEYMOUTH/WORDSWORTH RAB","South West Urban"]
[11041,"WEZA LANE (NORTH)","North Rural"]
[11320,"WEZA LANE (SOUTH)","North Rural"]
[15027,"WEZA LN/CRAFER WAY CYWAY","North Rural"]
[35756,"WHAITI LANE WWAY","Central"]
[11042,"WHAKAPIRAU RD","North Rural"]
[34646,"WHAKARITE RD","Hauraki Islands"]
[11043,"WHALE COVE","North Urban East"]
[80459,"WHALEY GREENS (NORTHBOUND)","North Urban East"]
[80460,"WHALEY GREENS (SOUTHBOUND)","North Urban East"]
[15051,"WHANGAPARAOA COLLEGE/RIMU RD LINK CYWAY","North Urban East"]
[11239,"WHANGAPARAOA HALL ENTRANCE","North Urban East"]
[11044,"WHANGAPARAOA RD","North Urban East"]
[11256,"WHANGAPARAOA RD 210 - 214","North Urban East"]
[11257,"WHANGAPARAOA RD 272 - 278","North Urban East"]
[11258,"WHANGAPARAOA RD 292 - 298","North Urban East"]
[11259,"WHANGAPARAOA RD 404 - 420","North Urban East"]
[11260,"WHANGAPARAOA RD 436 - 442","North Urban East"]
[11261,"WHANGAPARAOA RD 476 - 492","North Urban East"]
[11262,"WHANGAPARAOA RD 499 - 517","North Urban East"]
[11263,"WHANGAPARAOA RD 536 - 560","North Urban East"]
[11264,"WHANGAPARAOA RD 626 - 634","North Urban East"]
[11255,"WHANGAPARAOA RD 78 - 126","North Urban East"]
[11265,"WHANGAPARAOA RD 948 - 954","North Urban East"]
[11266,"WHANGAPARAOA RD 973 - 971","North Urban East"]
[11267,"WHANGAPARAOA RD 982 - 992","North Urban East"]
[11181,"WHANGAPARAOA RD LLA (#210 - #214)","North Urban East"]
[11182,"WHANGAPARAOA RD LLA (#248 - #278)","North Urban East"]
[15019,"WHANGAPARAOA RD/REGENCY PARK DR CYWAY","North Urban East"]
[34647,"WHANGAPARAPARA RD","Hauraki Islands"]
[70638,"WHANGAPOURI RD","South Rural"]
[11045,"WHANGARIPO VALLEY RD","North Rural"]
[34648,"WHARANGI ST","Central East"]
[11046,"WHAREHINE RD","North Rural"]
[22784,"WHAREPAPA PL","North Urban West"]
[11047,"WHAREPAPA RD","North Rural"]
[24085,"WHARERATA PL (PVT)","North Urban West"]
[80019,"WHARES CRT","North Urban East"]
[20637,"WHARF RD (ALBANY)","North Urban West"]
[70640,"WHARF RD (CLARKS BEACH)","South Rural"]
[31478,"WHARF RD (HERNE BAY)","Central"]
[52659,"WHARF RD (PAKURANGA)","South East Urban"]
[11048,"WHARF RD (PORT ALBERT)","North Rural"]
[34649,"WHARF RD (WAIHEKE)","Hauraki Islands"]
[40235,"WHARF RD (WAITAKERE)","West"]
[11050,"WHARF RD 2 (RIVERHEAD)","North Rural"]
[34992,"WHARF RD EXTN (RP1826 LHS)","Hauraki Islands"]
[15219,"WHARF RD/PARAWAI CRES CYWAY","Central"]
[15273,"WHARF RD/WILMA RD CYWAY","Central East"]
[60255,"WHARF ST (PAPAKURA)","South West Urban"]
[11051,"WHARF ST (WARKWORTH)","North Rural"]
[11052,"WHARFE RD","North Rural"]
[31479,"WHARUA RD","Central East"]
[70641,"WHATAPAKA RD","South Rural"]
[40234,"WHATIPU RD","West"]
[52660,"WHEATLEY AVE","South East Urban"]
[47134,"WHEATON PL","West"]
[80408,"WHEKAU DR","South West Urban"]
[80409,"WHEKAU DR (NORTHBOUND)","South West Urban"]
[80721,"WHENUAPAI DRIVE","North Urban West"]
[53214,"WHETSTONE RD","South East Urban"]
[22586,"WHETU PL","North Urban West"]
[34650,"WHETURANGI RD","Central"]
[31480,"WHITAKER PL","Central"]
[30762,"WHITAKER PL EXTN","Central"]
[11056,"WHITAKER RD","North Rural"]
[53484,"WHITBOURNE HGTS","South West Urban"]
[22495,"WHITBY CRES","North Urban East"]
[52661,"WHITCOMBE RD","South East Urban"]
[40233,"WHITE HERON DR","West"]
[70643,"WHITE RD (HUNUA)","South Rural"]
[52662,"WHITE RD (MANUREWA)","South West Urban"]
[31481,"WHITE ST","Central"]
[34651,"WHITE SWAN RD","Central"]
[52663,"WHITEACRES DR","South East Urban"]
[71197,"WHITECLIFFS DR","South Rural"]
[31482,"WHITEHAVEN RD","Central East"]
[33146,"WHITEHAVEN RD HLA (#34 - #48)","Central East"]
[31577,"WHITEHAVEN RD HLA (#35 - #47)","Central East"]
[11053,"WHITEHILLS RD","North Rural"]
[52664,"WHITES RD","South Rural"]
[34652,"WHITES WAY","Central East"]
[52665,"WHITESIDE LANE","South Rural"]
[31673,"WHITFORD AVE (EASTBOUND)","Central East"]
[34653,"WHITFORD AVE (WESTBOUND)","Central East"]
[15620,"WHITFORD MARAETAI RD LINK CYWAY (RP10103)","South Rural"]
[52666,"WHITFORD PARK RD","South Rural"]
[51573,"WHITFORD PARK/SANDSTONE RAB","South Rural"]
[52667,"WHITFORD RD (BOTANY) (SE)","South East Urban"]
[54806,"WHITFORD RD (WHITFORD) (SR)","South Rural"]
[15705,"WHITFORD RD UPASS CYWAY (RP799)","South East Urban"]
[15775,"WHITFORD RD UPASS EAST LINK CYWAY","South East Urban"]
[15706,"WHITFORD RD UPASS WEST LINK CYWAY","South East Urban"]
[15778,"WHITFORD RD/MEADOWLAND DR CYWAY","South East Urban"]
[53989,"WHITFORD RD-BELGATE PL","South East Urban"]
[53990,"WHITFORD RD-FIELDSTONE CRT","South East Urban"]
[52668,"WHITFORD WHARF RD","South Rural"]
[54807,"WHITFORD/CHAPEL RAB","South East Urban"]
[54459,"WHITFORD/MILLHOUSE RAB","South East Urban"]
[54457,"WHITFORD/SOMERVILLE RAB","South East Urban"]
[54450,"WHITFORD/WHITFORD PARK RAB","South Rural"]
[52669,"WHITFORD-MARAETAI RD","South Rural"]
[15792,"WHITFORD-MARAETAI RD RES CARPARK LINK CYWAY","South East Urban"]
[15793,"WHITFORD-MARAETAI RD RES LOOP CYWAY(RP392)","South East Urban"]
[15791,"WHITFORD-MARAETAI RD RES SOUTH CYWAY (RP282)","South East Urban"]
[54222,"WHITFORD-MARAETAI/BEACHLANDS RAB","South Rural"]
[70644,"WHITHAM RD","South Rural"]
[40232,"WHITING GR","North Urban West"]
[52670,"WHITLEY CRES","South West Urban"]
[11055,"WHITMORE RD","North Rural"]
[34654,"WHITMORE RD (MT ROSKILL)","Central"]
[31483,"WHITNEY ST","West"]
[47315,"WHITSHIRE MEWS","West"]
[35673,"WHITSON TCE (PVT)","Central"]
[31484,"WHITTLE PL","West"]
[34655,"WHITWORTH RD","Central"]
[31485,"WHYTEHEAD CRES","Central East"]
[11057,"WI APO PL","North Rural"]
[80520,"WICK PL","South West Urban"]
[11370,"WICKENS PL","North Rural"]
[20632,"WICKLAM LANE","North Urban West"]
[20748,"WICKLOW RD","North Urban East"]
[52671,"WICKMAN WAY","South West Urban"]
[54582,"WICKMAN WAY CARPARK (RP206 LHS)","South West Urban"]
[53991,"WICKMAN WAY-CHADWICK CRES","South West Urban"]
[40231,"WICKSTEAD PL","West"]
[22785,"WIDDISON PL","North Urban West"]
[40230,"WIDMORE DR","West"]
[52672,"WILBUR PL","South East Urban"]
[54819,"WILCO PL","South West Urban"]
[34656,"WILDE PL","Central"]
[31486,"WILDING AVE (EPSOM)","Central"]
[21096,"WILDING AVE (NORTHCOTE)","North Urban West"]
[60256,"WILENCOTE PL","South West Urban"]
[31487,"WILES AVE","Central East"]
[22860,"WILK LANE","North Urban East"]
[36081,"WILKIE LANE (PVT)","Central East"]
[34658,"WILKIE PL","Central East"]
[31674,"WILKIE PL EXTN (RP85 LHS)","Central East"]
[31488,"WILKINS ST","Central"]
[34659,"WILKINSON RD","Central East"]
[22496,"WILKINSON WAY","North Urban East"]
[31679,"WILKINSON/MOTORWAY RAMPS SLIP","Central East"]
[80452,"WILKS RD (EAST)","North Urban East"]
[11058,"WILKS RD (RURAL)","North Rural"]
[11059,"WILKS RD WEST","North Rural"]
[80689,"WILL STREET","North Rural"]
[35661,"WILLCOTT MEWS LANE (PVT)","Central"]
[34660,"WILLCOTT ST","Central"]
[40076,"WILLERTON AVE","West"]
[71537,"WILLIAM ANDREW RD","South Rural"]
[34663,"WILLIAM AVE (GREENLANE)","Central East"]
[52674,"WILLIAM AVE (MANUREWA)","South West Urban"]
[11060,"WILLIAM BAYES PL","North Urban East"]
[34664,"WILLIAM BLOFIELD AVE","Central"]
[20759,"WILLIAM BOND ST","North Urban East"]
[52675,"WILLIAM BRYAN DR","South East Urban"]
[54680,"WILLIAM BRYAN DR CARPARK (RP271)","South East Urban"]
[15782,"WILLIAM BRYAN DR/VENUS PL CYWAY","South East Urban"]
[31489,"WILLIAM DENNY AVE","Central"]
[34661,"WILLIAM DONNELLY TCE","Central"]
[31490,"WILLIAM FRASER CRES","Central East"]
[22951,"WILLIAM GAMBLE DR","North Urban West"]
[11061,"WILLIAM HADLOW PL","North Urban East"]
[34878,"WILLIAM HARVEY PL","Central East"]
[24118,"WILLIAM LAURIE PL (PVT)","North Urban West"]
[20716,"WILLIAM PICKERING DR","North Urban West"]
[20628,"WILLIAM PITCHER PL","North Urban West"]
[71190,"WILLIAM POTTER LANE","South Rural"]
[52676,"WILLIAM ROBERTS RD","South East Urban"]
[20299,"WILLIAM SOUTER ST","North Urban East"]
[52677,"WILLIAM ST (MANGERE)","South West Urban"]
[20147,"WILLIAM ST (TAKAPUNA)","North Urban East"]
[80673,"WILLIAM WALLBANK CRESCENT","West"]
[53381,"WILLIAM WOODS CRT","South East Urban"]
[52678,"WILLIAMS AVE","South East Urban"]
[53995,"WILLIAMS AVE-BROWNS AVE","South East Urban"]
[52679,"WILLIAMS CRES (OTARA)","South West Urban"]
[11062,"WILLIAMS CRES (POINT WELLS)","North Rural"]
[71377,"WILLIAMS RD (GLENBROOK)","South Rural"]
[40229,"WILLIAMS RD (WAITAKERE)","North Urban West"]
[11063,"WILLIAMS ST (MAH EAST)","North Rural"]
[11064,"WILLIAMS ST 2 (SANDSPIT)","North Rural"]
[20018,"WILLIAMSON AVE (DEVONPORT)","North Urban East"]
[31491,"WILLIAMSON AVE (GREY LYNN)","Central"]
[15242,"WILLIAMSON AVE LINK CYWAY (RP730)","Central"]
[11065,"WILLIAMSON RD","North Rural"]
[71057,"WILLIS AVE","South Rural"]
[60257,"WILLIS RD","South West Urban"]
[34665,"WILLIS ST (MT ALBERT)","Central"]
[22497,"WILLIS ST (TORBAY)","North Urban East"]
[11067,"WILLJAMES AVE","North Rural"]
[52680,"WILLOUGHBY AVE","South East Urban"]
[22219,"WILLOW AVE","North Urban West"]
[60636,"WILLOW CAMP RD","South West Urban"]
[11572,"WILLOW LANE (PVT)","North Urban East"]
[60425,"WILLOW RD (RAMARAMA)","South Rural"]
[52681,"WILLOW WAY","South East Urban"]
[53386,"WILLOWBANK CLOSE","South East Urban"]
[71058,"WILLOWBROOK","South Rural"]
[40228,"WILLOWBROOK PL","West"]
[71455,"WILLOWGRANGE PL","South Rural"]
[34666,"WILMA RD","Hauraki Islands"]
[52682,"WILMAY AVE","South West Urban"]
[20579,"WILMINGTON PL","North Urban East"]
[52683,"WILMSHURST AVE","South West Urban"]
[15464,"WILMSHURST AVE/LLOYD AVE CYWAY","South West Urban"]
[40030,"WILSHER CRES","West"]
[15152,"WILSHER CRES CAR PARK EAST LINK CYWAY","West"]
[11068,"WILSON AVE","North Rural"]
[35649,"WILSON CARLILE ST (PVT)","Central"]
[60258,"WILSON PL","South West Urban"]
[60666,"WILSON PL CARPARK (RP9 LHS)","South West Urban"]
[40056,"WILSON RD (GLEN EDEN)","West"]
[11069,"WILSON RD (KOMOKORIKI)","North Rural"]
[70649,"WILSON RD (PAPARIMU)","South Rural"]
[11070,"WILSON RD 2 (REDVALE)","North Rural"]
[11441,"WILSON RD 2 SOUTH (REDVALE)","North Rural"]
[11071,"WILSON RD 3 (STH HEAD)","North Rural"]
[11072,"WILSON RD 4 (WARKWORTH)","North Rural"]
[11073,"WILSON RD 5 (WAYBY VALLEY)","North Rural"]
[34667,"WILSON WAY","Central East"]
[31492,"WILTON ST","Central"]
[35042,"WILTSHIRE LANE","Hauraki Islands"]
[52684,"WILTSHIRE PL","South East Urban"]
[70650,"WILY RD","South Rural"]
[31493,"WIMBLEDON CRES","Central East"]
[31494,"WIMBLEDON WAY","Central East"]
[35859,"WIMBLEDON/FARRINGDON WWAY (RP213)","Central East"]
[52685,"WIMPEY ST","South West Urban"]
[11074,"WIN GR","North Urban East"]
[35559,"WINCH LANE (PVT)","Central"]
[31495,"WINCHESTER ST","Central"]
[31496,"WINDERMERE CRES","West"]
[22626,"WINDFALL PL","North Urban West"]
[60633,"WINDFOLA PARKWAY","South West Urban"]
[11075,"WINDMILL DR","North Rural"]
[11543,"WINDMILL GLEN RD","North Rural"]
[31497,"WINDMILL RD (MT EDEN)","Central"]
[71059,"WINDMILL RD (PUKEKOHE)","South Rural"]
[52686,"WINDOMA CIRCLE","South West Urban"]
[52687,"WINDRUSH CLOSE","South West Urban"]
[52737,"WINDSONG CRT","South East Urban"]
[15702,"WINDSONG CRT LINK CYWAY","South East Urban"]
[15703,"WINDSONG CRT LINK NORTH LINK CYWAY","South East Urban"]
[15704,"WINDSONG CRT LINK SOUTH LINK CYWAY","South East Urban"]
[24082,"WINDSOR CRES (PVT)","North Urban East"]
[20728,"WINDSOR PL (ALBANY)","North Urban East"]
[52688,"WINDSOR PL (OTARA)","South West Urban"]
[24092,"WINDSOR PL (TAKAPUNA) (PVT)","North Urban East"]
[31498,"WINDSOR ST","Central"]
[11076,"WINDWARD TCE","North Rural"]
[20517,"WINDY RIDGE RD","North Urban West"]
[22708,"WINEBERRY PL","North Urban West"]
[47273,"WINERY WAY","West"]
[60259,"WING CRES","South West Urban"]
[31499,"WINGATE ST","West"]
[31500,"WINHALL RISE","Central East"]
[60260,"WINIATA TCE","South West Urban"]
[20466,"WINIFRED AVE","North Urban West"]
[31501,"WINN RD","Central"]
[20086,"WINSCOMBE ST","North Urban East"]
[52689,"WINSFORD ST","South West Urban"]
[54078,"WINSFORD ST CARPARK (RP18 LHS)","South West Urban"]
[60261,"WINSLOW HGTS","South West Urban"]
[31502,"WINSOMERE CRES","Central"]
[52690,"WINSPEAR PL","South West Urban"]
[41375,"WINSTON PL","West"]
[35600,"WINSTONE DR (PVT)","Central East"]
[34668,"WINSTONE RD","Central"]
[52691,"WINTERE RD","South West Urban"]
[34904,"WINTERGARDEN RD","Central"]
[52692,"WINTHROP WAY","South West Urban"]
[52851,"WINTON CRT","South East Urban"]
[11077,"WINTOUR RD","North Rural"]
[34669,"WIREMU ST","Central"]
[52693,"WIRI STATION RD","South West Urban"]
[80305,"WIRI STATION RD  (WESTBOUND)","South West Urban"]
[54397,"WIRI STATION RD (EASTBOUND)","South West Urban"]
[11078,"WIRIANA PL","North Urban East"]
[40227,"WIRIHANA RD","West"]
[48051,"WIRIHANA RD WWAY","West"]
[40226,"WISELEY RD","North Urban West"]
[15117,"WISELEY RD/CLEARWATER COVE CYWAY","North Urban West"]
[47214,"WISELEY/WILLIAMS RAB","North Urban West"]
[11079,"WISHART RD","North Rural"]
[53634,"WISTERIA LANE (HOWICK)","South East Urban"]
[80294,"WISTERIA LANE (SILVERDALE)","North Urban East"]
[22498,"WISTERIA WAY","North Urban East"]
[20571,"WITHEFORD DR","North Urban West"]
[11080,"WITHEFORD RD","North Rural"]
[40224,"WITHERS RD","West"]
[48048,"WITHERS RD WWAY","West"]
[31503,"WITHIEL DR","Central"]
[52694,"WITLA CRT","South West Urban"]
[11081,"WITTEN RD","North Rural"]
[22966,"WITTON PL","North Urban West"]
[52695,"WOBURN ST","South West Urban"]
[31504,"WOLFE ST","Central"]
[31505,"WOLSELEY AVE","Central"]
[34670,"WOLSELEY ST","Central"]
[20213,"WOLSLEY AVE","North Urban East"]
[31506,"WOLVERTON ST","West"]
[11082,"WONDERVIEW RD","North Rural"]
[10137,"WOOD ACCESS RD","North Rural"]
[52697,"WOOD AVE (HOWICK)","South East Urban"]
[52696,"WOOD AVE (MANGERE)","South West Urban"]
[40223,"WOOD BAY RD","West"]
[47224,"WOOD BAY RD LLA (#51 - #55)","West"]
[47221,"WOOD BAY RESERVE RD","West"]
[31507,"WOOD ST (FREEMANS BAY/NORTH)","Central"]
[31547,"WOOD ST (FREEMANS BAY/SOUTH)","Central"]
[60262,"WOOD ST (PAPAKURA)","South West Urban"]
[60672,"WOOD ST CARPARK (RP1051 RHS)","South West Urban"]
[60674,"WOOD ST CARPARK (RP106 LHS)","South West Urban"]
[60673,"WOOD ST CARPARK (RP132 LHS)","South West Urban"]
[20391,"WOODALL PL","North Urban West"]
[47198,"WOODBANK DR","West"]
[53509,"WOODBERRY DR","South East Urban"]
[31508,"WOODBINE AVE","Central"]
[20248,"WOODBRIDGE LANE","North Urban East"]
[47108,"WOODCHESTER RISE","West"]
[11083,"WOODCOCKS RD","North Rural"]
[20443,"WOODCOTE DR","North Urban West"]
[71355,"WOODCROFT WAY","South Rural"]
[40222,"WOODFERN CRES","West"]
[40221,"WOODFORD AVE","West"]
[34671,"WOODFORD RD","Central"]
[52698,"WOODGERS WAY","South East Urban"]
[40161,"WOODGLEN RD","West"]
[15101,"WOODGLEN RD/CLARIDGE ST CYWAY","West"]
[41211,"WOODGLEN/WOODVALE RAB","West"]
[31509,"WOODHALL RD","Central"]
[22220,"WOODHAMS ST","North Urban West"]
[11084,"WOODHILL PARK RD","North Rural"]
[40220,"WOODHOUSE PL","West"]
[48274,"WOODHOUSE PL WWAY","West"]
[48273,"WOODHOUSE PL WWAY -FORESTER #11 WWAY","West"]
[70651,"WOODHOUSE RD","South Rural"]
[11085,"WOODLANDS AVE","North Rural"]
[22499,"WOODLANDS CRES","North Urban East"]
[22507,"WOODLANDS CRES (AC.WAY)","North Urban East"]
[40219,"WOODLANDS PARK RD","West"]
[11086,"WOODLANDS PL","North Rural"]
[71060,"WOODLANDS RD","South Rural"]
[52911,"WOODLARK CLOSE","South West Urban"]
[31510,"WOODLEY AVE","Central East"]
[70652,"WOODLYN DR","South Rural"]
[40218,"WOODMAN PL","West"]
[22850,"WOODRIDGE AVE","North Urban East"]
[80547,"WOODRIDGE DR","North Urban East"]
[40217,"WOODRUFFE AVE","West"]
[11088,"WOODS RIDGE RD","North Rural"]
[21097,"WOODSIDE AVE","North Urban West"]
[35000,"WOODSIDE BAY RD","Hauraki Islands"]
[31511,"WOODSIDE CRES","Central East"]
[52699,"WOODSIDE RD (MANUREWA)","South West Urban"]
[34751,"WOODSIDE RD (MT EDEN)","Central"]
[40216,"WOODSIDE RD (WAITAKERE)","West"]
[48214,"WOODSIDE RD WWAY","West"]
[20393,"WOODSON PL","North Urban West"]
[20331,"WOODSTOCK RD","North Urban East"]
[40159,"WOODVALE RD","West"]
[52700,"WOODVIEW RISE","South East Urban"]
[31512,"WOODVILLE RD","Central East"]
[52701,"WOODWARD AVE","South West Urban"]
[34672,"WOODWARD RD","Central"]
[34965,"WOODY BAY RD (RAK)","Hauraki Islands"]
[11484,"WOOKEY LANE","North Rural"]
[54123,"WOOLASTON PL","South East Urban"]
[52702,"WOOLFIELD RD","South West Urban"]
[34673,"WOOLLAMS RD","Hauraki Islands"]
[40089,"WOOLLEY AVE","West"]
[71516,"WOOLSHED LANE (NORTHBOUND)","South Rural"]
[70144,"WOOLSHED LANE (SOUTHBOUND)","South Rural"]
[11240,"WOOLWORTHS ENTRANCE","North Urban East"]
[40215,"WOONTONS LANE","West"]
[70653,"WOOTTEN RD","South Rural"]
[31513,"WOOTTON RD","Central East"]
[31514,"WORCESTER RD","Central East"]
[52703,"WORDSWORTH RD","South West Urban"]
[54328,"WORDSWORTH RD CARPARK (RP1634 RHS)","South West Urban"]
[53997,"WORDSWORTH RD-NEEMS PL","South West Urban"]
[11089,"WORKER RD","North Rural"]
[11159,"WORKER RD (NTH END)","North Rural"]
[35043,"WORKINGTON RD","Hauraki Islands"]
[31515,"WORLEY PL","Central East"]
[35801,"WORLEY/NORMAN LESSER WWAY (RP139)","Central East"]
[11090,"WORRALL RD","North Rural"]
[11406,"WORSNOP WAY","North Urban East"]
[40214,"WORTHINGTON PL","North Urban West"]
[11091,"WORTHINGTON RD","North Rural"]
[22624,"WREN PL","North Urban West"]
[70656,"WRIGHT RD (KINGSEAT)","South Rural"]
[11092,"WRIGHT RD (MATAKANA)","North Rural"]
[31516,"WRIGHT RD (PT CHEVALIER)","Central"]
[11093,"WRIGHT RD 2 (REDVALE)","North Rural"]
[35626,"WRIGHTS SPUR","Central"]
[52704,"WROUGHTON CRES","South West Urban"]
[54206,"WROUGHTON CRES CARPARK (RP19 RHS)","South West Urban"]
[71415,"WROXTON PL","South Rural"]
[71474,"WROXTON PL EXTN","South Rural"]
[41280,"WYATT PL","West"]
[52705,"WYCHERLEY DR","South East Urban"]
[54656,"WYCHERLEY DR CARPARK (RP291 RHS)","South East Urban"]
[47353,"WYCHWOOD AVE","West"]
[23005,"WYE OAK DR","North Urban West"]
[20439,"WYKEHAM PL","North Urban West"]
[20337,"WYLIE AVE","North Urban East"]
[52706,"WYLLIE RD (PAPATOETOE)","South West Urban"]
[11094,"WYLLIE RD (WARKWORTH)","North Rural"]
[52707,"WYMAN PL","South East Urban"]
[70661,"WYMER RD","South Rural"]
[52708,"WYMONDLEY RD","South West Urban"]
[54204,"WYMONDLEY RD CARPARK (RP38 LHS)","South West Urban"]
[11154,"WYN CLOSE","North Rural"]
[31517,"WYNDHAM ST","Central"]
[52709,"WYNN PL","South East Urban"]
[35984,"WYNNE GRAY AVE","Central East"]
[22719,"WYNONA CLOSE","North Urban West"]
[31518,"WYNSFIELD GARDEN","Central East"]
[52710,"WYNTON PL","South West Urban"]
[34674,"WYNYARD RD","Central"]
[20264,"WYNYARD ST","North Urban East"]
[35075,"WYNYARD ST (PVT)","Central"]
[22500,"WYOMING AVE","North Urban East"]
[52711,"WYONA PL","South West Urban"]
[54466,"WYONA PL HAMMERHEAD","South West Urban"]
[20452,"WYVERN PL","North Urban West"]
[47127,"XENA WAY","West"]
[52712,"YACHT PL","South East Urban"]
[22681,"YALE PL","North Urban West"]
[60497,"YANG PL","South West Urban"]
[60660,"YANG PL CARPARK (RP70 LHS)","South West Urban"]
[31519,"YARBOROUGH ST","Central"]
[52903,"YARLSIDE PL","South East Urban"]
[52713,"YARRA PL","South East Urban"]
[53998,"YARRA PL-MAROUBRA PL","South East Urban"]
[60514,"YARROW LANE (PVT)","South East Urban"]
[52714,"YATES RD (MANGERE)","South West Urban"]
[70662,"YATES RD (PUKEKOHE)","South Rural"]
[54000,"YATES RD-BANBURY PL","South West Urban"]
[53999,"YATES RD-CARNAC PL","South West Urban"]
[34675,"YATES ST","Central East"]
[31520,"YATTENDON RD","Central East"]
[80362,"YATTERINA AVE","South West Urban"]
[52715,"YEARSLEY PL","South West Urban"]
[54001,"YEARSLEY PL-BURBANK AVE","South West Urban"]
[34676,"YEATS WAY","Central"]
[34677,"YEE PL","Central East"]
[35717,"YEE/MT WELLINGTON WWAY (RP112)","Central East"]
[40213,"YELASH RD","West"]
[52716,"YEOMAN PL","South East Urban"]
[54002,"YEOMAN PL-EDGAR PEARCE PL","South East Urban"]
[40212,"YEOVIL RD","West"]
[52717,"YORK RD","South West Urban"]
[40211,"YORK RD (NORTH)","West"]
[47241,"YORK RD (SOUTH)","West"]
[60392,"YORK ST (DRURY)","South West Urban"]
[34683,"YORK ST (NEWMARKET)","Central"]
[31521,"YORK ST (PARNELL)","Central"]
[11095,"YORK TCE","North Rural"]
[52718,"YORKTON RISE","South West Urban"]
[11096,"YOUNG ACCESS","North Rural"]
[60422,"YOUNG CRES","South West Urban"]
[34678,"YOUNG RD","Central East"]
[11097,"YOUNG ST","North Rural"]
[71061,"YOUNGS GR","South Rural"]
[34679,"YOUNGS LANE","Central"]
[60263,"YOUNGS RD","South West Urban"]
[34680,"YOUTH ST","Central"]
[53404,"YSABEL CRES","South West Urban"]
[40210,"YULE PL","West"]
[60582,"ZABEEL CRES","South West Urban"]
[35279,"ZAMBEZI LANE (PVT)","Central"]
[35280,"ZAMORA LANE (PVT)","Central"]
[11098,"ZANDERS RD","North Rural"]
[23011,"ZARA CRT (ALBANY)","North Urban East"]
[53382,"ZARA CRT (DANNEMORA)","South East Urban"]
[11099,"ZEALANDIA RD","North Urban East"]
[11285,"ZEALANDIA RD HAMMERHEAD","North Urban East"]
[47109,"ZEFIRO DR","West"]
[52719,"ZELANIAN DR","South East Urban"]
[52720,"ZELDA AVE","South West Urban"]
[60393,"ZENITH PL","South West Urban"]
[35278,"ZERALTO LANE (PVT)","Central"]
[47129,"ZEUS AVE","West"]
[40209,"ZINGARO PL","West"]
[48307,"ZINGARO PL WWAY","West"]
[22231,"ZION RD","North Urban West"]
[52721,"ZIRCON PL","South West Urban"]
[11100,"ZITA AVE","North Urban East"]
[40208,"ZITA MARIA DR","West"]
[41162,"ZITA MARIA/CLYMA RAB","West"]
[40207,"ZODIAC ST","West"]
[54032,"ZOE CRT","South West Urban"]
[52722,"ZURICH PL","South West Urban"]

{"sheet":"TTM Company list","index":9,"n_rows":160,"n_cols":2,"rows_kept":160,"cut":false,"hidden":false,"merged":[]}
["TTM Companies"]
[]
["(STMS / TTM employer)"]
["TTM Companies","Code"]
["Abernethy Contractors Ltd",138]
["ABO",124]
["Absolute Traffic Solutions Ltd",1]
["Action Traffic Control Ltd",2]
["APS",125]
["Arrow International (NZ) Ltd",3]
["Asphalt & Repairs Ltd",70]
["Asplundh",4]
["Auckland Council",5]
["Auckland Motorway Alliance",6]
["Auckland Traffic Ltd",44]
["Auckland Transport",71]
["AWF Ltd",126]
["Beesafe Traffic Control Ltd",7]
["Best Communications Ltd",143]
["Broadspectrum (New Zealand) Ltd",59]
["Bryce Traffic Solutions Ltd",8]
["C.S.R Ltd",73]
["Cablenet",75]
["CAM NZ Ltd",127]
["Camhut Ltd",9]
["CDS New Zealand Ltd.",72]
["CEW Ltd",10]
["Chevron Traffic Solutions Ltd",11]
["Chicane Traffic Control Ltd",65]
["Chorus",67]
["City Care Ltd",12]
["City Contractors Ltd",13]
["Civic Ltd : Enviro-Mark NZ",83]
["Coastline Markers Ltd",76]
["Community Asset Management NZ Ltd",14]
["Connect",128]
["Counties Power Ltd",15]
["CW Glasgow Contractors Limited",74]
["DDS Ltd",16]
["Dempsey Wood Traffic Ltd",17]
["Directional Drilling Service (Auckland) Ltd",66]
["Directionz Ltd",77]
["DK Signs Ltd",18]
["Downer EDI Ltd",19]
["Drill Tech (Holdings) Ltd",20]
["Dummy",151]
["Earthco Civil Ltd",82]
["Eastend Contracting Limited",81]
["EDDIEPARKER Developments Ltd",157]
["Electrix Ltd",21]
["Envoco Ltd",84]
["Evolution Road Services Group",68]
["Fibre Optic Solutions Ltd",129]
["Fibre Options Nz Ltd",161]
["Flowerday Enterprises Ltd",85]
["Fulton Hogan Ltd",22]
["GB Civil & Roading Contractors Ltd",23]
["Geotechnical Engineering Ltd",86]
["GNC Traffic Ltd",24]
["Gorrie Traffic Management Ltd",25]
["Harrison Grierson Consultants Ltd",144]
["Hawkins Construction Ltd",145]
["Hayek Engineering AG",87]
["HEB Contractors Ltd",26]
["Higgins Contractors Ltd",27]
["Highway Stabilizers Ltd",28]
["Hi-Lift Cranes Ltd",146]
["Home Fibre Solutions Ltd",140]
["Independent Traffic Control Ltd",29]
["Infrastructure & Civilworks Ltd",30]
["Intercivil",80]
["Interclean",79]
["Intergrated Traffic Solutions",78]
["ISS Ltd",31]
["iTraffic",122]
["ITS - Downer Ltd",69]
["J & R Contracting",89]
["J Alexander Civil Ltd",88]
["JB Civil",32]
["JCW Construction Ltd",33]
["Jet Trac Drilling Ltd",34]
["John Fillmore Contracting Ltd",35]
["K.C. Wong Ltd",36]
["Kirby Contracting Ltd",130]
["KMD Services Ltd",131]
["Kordia",90]
["Liveable Streets",37]
["M Keoghan Contractors 2006 LTD",91]
["Maka Civil Contracting Ltd",38]
["Mansons TCLM Limited",93]
["Marais Laying NZ Ltd",160]
["March Cato  Ltd",94]
["Mc Kenzie & Parma Ltd",39]
["MCB Plumbing",92]
["McConnell Dowell",137]
["Mcconnell Dowell Constructors Ltd",95]
["Metaltrix",96]
["Nayler Contractors Ltd",159]
["Naylor Contracting Ltd",40]
["None",41]
["North Arbor Treez",97]
["North Harbour Paving And Construction Ltd",42]
["NorthPower Ltd",98]
["NZ Bore Ltd",43]
["OCL",99]
["On Target Directional Drilling Ltd",100]
["OT Contractors Ltd",45]
["Other",135]
["Phantom Bill Stickers Ltd",46]
["Pipeline & Civil Ltd",101]
["Pipeworks Rehabilitation Solutions Ltd",136]
["Powerhouse Civil Ltd",102]
["Pro-tect (Auck) Ltd",47]
["QDC Works Ltd",103]
["Recreational Services Ltd",132]
["Red Technology Ltd",155]
["Reliable Traffic Control",48]
["Rixon Contracting Ltd",104]
["Roadmarkers NZ Ltd",105]
["Roadworx Infrastructure Ltd",150]
["Rohits Civil & Infrastructure Ltd.",106]
["Scarbro Construction Ltd",107]
["Scott Thrust Ltd",49]
["Sen Ventures Limited",108]
["Simply Siteworks",109]
["Smiths Underground Services Ltd",110]
["Stockman General Contractors",111]
["Straka Construction & Earthmoving Ltd.",112]
["Streetworx Ltd",50]
["Subzone Networks Ltd",113]
["Sureway Civil Limited",114]
["T8 Traffic Control Ltd",51]
["TEBO Services Ltd",52]
["TEK Services",141]
["TEK Services",154]
["Temporary Traffic Control Ltd",53]
["Tiger Traffic Ltd",54]
["Total Infrastructure Ltd",55]
["Total Traffic Control Ltd",115]
["Traffic Management NZ Ltd",56]
["Traffic Safe Ltd",142]
["Traffic Smart Ltd",158]
["Traffic Solutions",116]
["Traffic Systems Ltd",57]
["Traffix Ltd",58]
["Transtasman Civil",117]
["Tree Action Limited",119]
["Tree King",118]
["Tree Scape Ltd",60]
["Ultimate Rally Group Ltd",152]
["United Civil Group Ltd",121]
["Unknown",61]
["Uprite Scaffolding Ltd",148]
["Visionstream Pty Ltd",62]
["W & S Construction",133]
["Waste Management NZ Ltd",156]
["Watercare Services Ltd",63]
["Watts & Hughes Ltd",64]
["Weld Worx Industrial Welding Supplies Ltd",134]
["Wharehine Construction Ltd",123]

{"sheet":"TTM Contractor List","index":10,"n_rows":162,"n_cols":2,"rows_kept":162,"cut":false,"hidden":true,"merged":[]}
["TTM Contractor"]
[]
["(STMS / TTM employer)"]
["TTM Companies","Code"]
["Abernethy Contractors Ltd",138]
["ABO",124]
["Absolute Traffic Solutions Ltd",1]
["Action Traffic Control Ltd",2]
["APS",125]
["Arrow International (NZ) Ltd",3]
["Asphalt & Repairs Ltd",70]
["Asplundh",4]
["Auckland Council",5]
["Auckland Motorway Alliance",6]
["Auckland Traffic Ltd",44]
["Auckland Transport",71]
["AWF Ltd",126]
["Beesafe Traffic Control Ltd",7]
["Best Communications Ltd",143]
["Broadspectrum (New Zealand) Ltd",59]
["Bryce Traffic Solutions Ltd",8]
["C.S.R Ltd",73]
["Cablenet",75]
["CAM NZ Ltd",127]
["Camhut Ltd",9]
["CDS New Zealand Ltd.",72]
["CEW Ltd",10]
["Chevron Traffic Solutions Ltd",11]
["Chicane Traffic Control Ltd",65]
["Chorus",67]
["City Care Ltd",12]
["City Contractors Ltd",13]
["Civic Ltd : Enviro-Mark NZ",83]
["Coastline Markers Ltd",76]
["Community Asset Management NZ Ltd",14]
["Connect",128]
["Counties Power Ltd",15]
["CW Glasgow Contractors Limited",74]
["DDS Ltd",16]
["Dempsey Wood Traffic Ltd",17]
["Directional Drilling Service (Auckland) Ltd",66]
["Directionz Ltd",77]
["DK Signs Ltd",18]
["Downer EDI Ltd",19]
["Drill Tech (Holdings) Ltd",20]
["Dummy",151]
["Earthco Civil Ltd",82]
["Eastend Contracting Limited",81]
["EDDIEPARKER Developments Ltd",157]
["Electrix Ltd",21]
["Envoco Ltd",84]
["Evolution Road Services Group",68]
["Fibre Optic Solutions Ltd",129]
["Fibre Options Nz Ltd",161]
["Flowerday Enterprises Ltd",85]
["Fulton Hogan Ltd",22]
["GB Civil & Roading Contractors Ltd",23]
["Geotechnical Engineering Ltd",86]
["GNC Traffic Ltd",24]
["Gorrie Traffic Management Ltd",25]
["Harrison Grierson Consultants Ltd",144]
["Hawkins Construction Ltd",145]
["Hayek Engineering AG",87]
["HEB Contractors Ltd",26]
["Higgins Contractors Ltd",27]
["Highway Stabilizers Ltd",28]
["Hi-Lift Cranes Ltd",146]
["Home Fibre Solutions Ltd",140]
["Independent Traffic Control Ltd",29]
["Infrastructure & Civilworks Ltd",30]
["Intercivil",80]
["Interclean",79]
["Intergrated Traffic Solutions",78]
["ISS Ltd",31]
["iTraffic",122]
["ITS - Downer Ltd",69]
["J & R Contracting",89]
["J Alexander Civil Ltd",88]
["JB Civil",32]
["JCW Construction Ltd",33]
["Jet Trac Drilling Ltd",34]
["John Fillmore Contracting Ltd",35]
["K.C. Wong Ltd",36]
["Kirby Contracting Ltd",130]
["KMD Services Ltd",131]
["Kordia",90]
["Liveable Streets",37]
["M Keoghan Contractors 2006 LTD",91]
["Maka Civil Contracting Ltd",38]
["Mansons TCLM Limited",93]
["Marais Laying NZ Ltd",160]
["March Cato  Ltd",94]
["Mc Kenzie & Parma Ltd",39]
["MCB Plumbing",92]
["McConnell Dowell",137]
["Mcconnell Dowell Constructors Ltd",95]
["Metaltrix",96]
["Nayler Contractors Ltd",159]
["Naylor Contracting Ltd",40]
["None",41]
["North Arbor Treez",97]
["North Harbour Paving And Construction Ltd",42]
["NorthPower Ltd",98]
["NZ Bore Ltd",43]
["OCL",99]
["On Target Directional Drilling Ltd",100]
["OT Contractors Ltd",45]
["Other",135]
["Phantom Bill Stickers Ltd",46]
["Pipeline & Civil Ltd",101]
["Pipeworks Rehabilitation Solutions Ltd",136]
["Powerhouse Civil Ltd",102]
["Pro-tect (Auck) Ltd",47]
["QDC Works Ltd",103]
["Recreational Services Ltd",132]
["Red Technology Ltd",155]
["Reliable Traffic Control",48]
["Rixon Contracting Ltd",104]
["Roadmarkers NZ Ltd",105]
["Roadworx Infrastructure Ltd",150]
["Rohits Civil & Infrastructure Ltd.",106]
["Scarbro Construction Ltd",107]
["Scott Thrust Ltd",49]
["Sen Ventures Limited",108]
["Simply Siteworks",109]
["Smiths Underground Services Ltd",110]
["Stockman General Contractors",111]
["Straka Construction & Earthmoving Ltd.",112]
["Streetworx Ltd",50]
["Subzone Networks Ltd",113]
["Sureway Civil Limited",114]
["T8 Traffic Control Ltd",51]
["TEBO Services Ltd",52]
["TEK Services",141]
["TEK Services",154]
["Temporary Traffic Control Ltd",53]
["Tiger Traffic Ltd",54]
["Total Infrastructure Ltd",55]
["Total Traffic Control Ltd",115]
["Traffic Management NZ Ltd",56]
["Traffic Safe Ltd",142]
["Traffic Smart Ltd",158]
["Traffic Solutions",116]
["Traffic Systems Ltd",57]
["Traffix Ltd",58]
["Transtasman Civil",117]
["Tree Action Limited",119]
["Tree King",118]
["Tree Scape Ltd",60]
["Ultimate Rally Group Ltd",152]
["United Civil Group Ltd",121]
["Unknown",61]
["Uprite Scaffolding Ltd",148]
["Visionstream Pty Ltd",62]
["W & S Construction",133]
["Waste Management NZ Ltd",156]
["Watercare Services Ltd",63]
["Watts & Hughes Ltd",64]
["Weld Worx Industrial Welding Supplies Ltd",134]
["Wharehine Construction Ltd",123]
["aaaaaaaa"]
["bbbbbbb"]

{"sheet":"Contractor list","index":11,"n_rows":203,"n_cols":2,"rows_kept":203,"cut":false,"hidden":false,"merged":[]}
["Contractors - working space"]
["(Note this is to be the main contractor)"]
["Contractors","Code"]
["A1 Civil Engineering & Construction Ltd",43]
["AAA Excavations & Drainage NZ Ltd",197]
["ASI Signage Ltd",51]
["Aadvark Contractors Ltd",190]
["Abernethy Contractors Ltd",45]
["Adshel",47]
["Advanced Drilling Ltd",171]
["All About Drains Ltd",189]
["Andrew Property Services",48]
["Arrow International",49]
["Aspec Construction",52]
["Asplundh",1]
["Auckland Civil",53]
["Auckland Council",2]
["Auckland Motorway Alliance",54]
["Auckland Transport",55]
["Basset Plumbing and Drainage Ltd",56]
["Best Communications Ltd",57]
["Blue Rock Civil",58]
["Bracewell Construction Ltd",59]
["Brian James Contracting Ltd",178]
["Broadspectrum (New Zealand) Ltd",36]
["Brosnan Construction Ltd",60]
["CAM NZ Ltd",99]
["CDS NZ Ltd",63]
["CL Drainage Limited",67]
["CMP Construction Ltd",68]
["CPB Contractors Pty Ltd",202]
["CPL Engineered Solutions Ltd",169]
["CSL",69]
["CW Glasglow Ltd",70]
["Cable Works Pty Ltd",61]
["Cameron Civil Ltd",62]
["Challenge Construction Ltd",64]
["Chevron NZ",65]
["Chorus",66]
["City Care Ltd",3]
["City Contractors Ltd",4]
["City Parks Services",194]
["Civil Underground",71]
["Clearvision Ltd",72]
["Coast Drilling Services",73]
["Community Asset Management NZ Ltd",5]
["Connectus",183]
["Connell Contractors Ltd",180]
["Conspec Concrete",193]
["Contrax Ltd",74]
["Counties Power Ltd",6]
["Cowperthwaite Roofing Ltd",184]
["Crate Innovation Ltd",199]
["DDS Ltd",7]
["DK Signs Ltd",75]
["Dempsey Wood Civil Ltd",8]
["Directional Drilling Service (Auckland) Ltd",173]
["Directionz Ltd",76]
["Discount Concrete & Drainage",177]
["Dominion Constructors Ltd",77]
["Downer EDI Ltd",9]
["Drill Tech (Holdings) Ltd",10]
["EDDIEPARKER Developments Ltd",200]
["Eagle Plumbing & Drainage Ltd",207]
["Earthco Civil Limited",78]
["Ebert Construction Ltd",79]
["Electrix Ltd",11]
["Enfield",80]
["Evolution Road Services Ltd",46]
["Evolution Traffic Control NZ",81]
["FX Networks Ltd",198]
["Fibre Options NZ Ltd",205]
["Fletcher Construction",82]
["Flowerday Enterprises Ltd",83]
["Fuel Installations Ltd",191]
["Fulton Hogan Ltd",12]
["GB Civil & Roading Contractors Ltd",13]
["GeoTechnical Engineering Ltd",84]
["Geoff White Property Owner",98]
["Gibbons Construction",85]
["Gibson O'Connor Construction",86]
["Gideon Contractors Ltd",87]
["Greenscene NZ",88]
["H R Construction Ltd",89]
["HD Building Ltd",188]
["HEB Contractors Ltd",14]
["Hawkins Construction Ltd",90]
["Henderson RSA",91]
["Hi-Lift Cranes Ltd",176]
["Hick Bros Civil Ltd",92]
["Higgins Contractors Ltd",15]
["Highway Stabilizers Ltd",16]
["Hobsonville Land Development Company",93]
["Hopper Construction Ltd",94]
["HydroTech"]
[" Drainage & Plumbing Ltd",100]
["IPC",111]
["ISS",112]
["Infrastructure & Civil Works Ltd",17]
["Interclean",101]
["Intergroup Ltd",102]
["J & R Contracting Ltd",104]
["J Alexander Civil Limited",103]
["JB Civil",18]
["JCL",113]
["JCW Construction Ltd",19]
["JG Civil Ltd",105]
["JH Joint Venture",106]
["Jesmond Construction Limited",107]
["Jet Trac Drilling Ltd",20]
["John Alexander Construction",95]
["John Fillmore Contracting Ltd",21]
["K.C. Wong Ltd",22]
["KOTR Ltd",114]
["Kidd Contracting",115]
["Lanta Construction Ltd",116]
["Leighs Construction Ltd",192]
["Lend Lease",42]
["Liveable Streets",23]
["M Keoghan Contractors Ltd",117]
["MCB Plumbing",118]
["ML Plumbing and Drainage",206]
["MacKenzie Civil Ltd",170]
["Maka Civil Contracting Ltd",24]
["Mansons TCLM Ltd",120]
["Marais Laying",121]
["March Cato Limited",122]
["Mc Kenzie & Parma Ltd",25]
["Mc Millan Drilling Ltd",126]
["McConnel Dowell Ltd",124]
["McConnel Dowell Ltd",127]
["McConnell Dowell",167]
["Mint Construction",119]
["NZ Bore Ltd",28]
["NZ Crane Hire",128]
["NZ Strong Ltd",129]
["NZ Traffic Ltd",130]
["Nayler Contractors Ltd",203]
["Naylor Contracting Ltd",26]
["North Arbor Treez Ltd",131]
["North Harbour Paving And Construction Ltd",27]
["NorthPower Ltd",108]
["OCL Limited",132]
["OT Contractors Ltd",29]
["Opie Contractors Ltd",133]
["Other",166]
["Pango Ltd",204]
["Phantom Bill Stickers Ltd",30]
["Pipeline & Civil Ltd",109]
["Pipeworks Rehabilitation Solutions Ltd",134]
["Poleline Ltd",185]
["Powerhouse Civil Ltd",135]
["Private",136]
["QDC Works",137]
["RCK Contractors",138]
["RED Contracting",139]
["RJ Contracting",141]
["Red Technology Ltd",195]
["Rixon Ltd",140]
["Rohits Civil",142]
["Ross Reid Contractors Ltd",143]
["SVL",144]
["Scarbro Construction",145]
["Scott Thrust Ltd",31]
["Simply Site works Ltd",146]
["Smiths Underground Services Pty Ltd",147]
["Starz Evil Dead NZ Ltd",148]
["Stockman General Contractors Ltd",149]
["Streetworx Ltd",32]
["Stryde Projects",150]
["Sumo Drainage Ltd",151]
["Sureway Civil Ltd",152]
["TBS Remcon",153]
["TEAK Construction Ltd",201]
["TEBO Services Ltd",33]
["TeAratika Drilling Ltd",154]
["Time and Tide Builders Ltd",155]
["Tom Ryan Cartage Ltd",156]
["Total Infrastructure Ltd",34]
["Traffic Signals Ltd",157]
["Traffic Systems Ltd",35]
["Trans Civil",158]
["Tree King",159]
["Tree Scape Ltd",37]
["Treeaction Auckland Ltd",160]
["Troy Wheeler Construction Ltd",161]
["Twomey Construction Ltd",181]
["UCL",162]
["UFB",163]
["Ultimate Rally Group Ltd",187]
["United Civil Ltd",164]
["Universal Communications Group NZ Ltd",186]
["Unknown",41]
["Uprite Scaffolding Ltd",179]
["Vector",110]
["Veola Water",165]
["Visionstream Pty Ltd",38]
["Waste Management NZ Ltd",196]
["Watercare Services Ltd",39]
["Watts & Hughes Ltd",40]
["Wharehine Construction Ltd",97]
["Worx Welding Ltd",96]
["ZTK Structure Ltd",172]

{"sheet":"Principal list","index":12,"n_rows":18,"n_cols":2,"rows_kept":18,"cut":false,"hidden":false,"merged":[]}
["Standard Client / Principal Names"]
["(Private for non company principals)"]
["Principals","Code"]
["Auckland Council",1]
["Auckland Transport",2]
["Chorus",3]
["Counties Power Ltd",4]
["Housing NZ / Creating Communities Ltd",5]
["KiwiRail",6]
["NZTA",7]
["Panuku Development Auckland",89]
["Private",9]
["Transpower",81]
["Unknown",11]
["Vector Gas",12]
["Vector Power",13]
["Vodafone",14]
["WaterCare Services Ltd",15]