{"text_format":"1","workbook":"xlsx","n_sheets":6,"sheets":["RCA Results Table","ONRC Category Results","Region & Peer Group Results","Lookups","Charts","Chart Data"],"not_rendered":{"charts":1,"images":2,"macros":1,"external_links":1,"defined_names":1,"comments":0,"pivot_tables":0},"unopened":[],"bounds":{"document_bytes":16777216,"sheet_cells":100000,"rows_first":2000,"rows_last":500,"rows_between":2000,"halvings":0,"cell_chars":16384,"cell_head_chars":4096},"cells_cut":0,"cells_raw":0,"read":"whole","date_system":"1900"}

{"sheet":"RCA Results Table","index":0,"n_rows":73,"n_cols":20,"rows_kept":73,"cut":false,"hidden":false,"merged":[[2,1,2,11],[2,12,2,19],[3,1,3,3],[3,4,3,11],[3,12,3,14],[3,15,3,18]]}
[null,"DATA QUALITY RESULTS 2018/19 | PERCENTAGE AT THE EXPECTED STANDARD"]
[null,null,null,null,null,null,null,null,null,null,null,null,null,null,null,null,null,null,null,"V0.6: 14-02-2020"]
[null,"ONRC",null,null,null,null,null,null,null,null,null,null,"Asset Management"]
[null,"Quality Dimension",null,null,"Data Sub-Category",null,null,null,null,null,null,null,"Quality Dimension",null,null,"Data Category",null,null,null,"Score"]
["RCA Name","Accuracy","Complete-ness","Timeliness","Carriageway","Treatment Length","Surfacing","Maintenance Activity","Roughness","Traffic Count","Traffic Estimates","Crash","Accuracy","Complete-ness","Timeliness","Network","Asset Inventory","Condition","Maintenance Activity","AM Score"]
["Ashburton District Council",79.166666666666671,90,33.333333333333329,87.5,25,100,100,100,33.333333333333336,83.333333333333329,100,80,41.666666666666671,{"$f":"VLOOKUP(A6,'[1]Flat Table (REG Website)'!$A$5:$O$73,15,FALSE)","v":44.444444444444443},75,42.857142857142861,100,75,70]
["Auckland Transport",83.333333333333343,50,33.333333333333329,100,75,25,100,50,33.333333333333336,83.333333333333329,0,50,66.666666666666671,{"$f":"VLOOKUP(A7,'[1]Flat Table (REG Website)'!$A$5:$O$73,15,FALSE)","v":66.666666666666671},75,57.142857142857146,100,50,75]
["Buller District Council",45.833333333333336,40,75,50,87.5,25,33.333333333333336,50,0,75,50,30,33.333333333333336,{"$f":"VLOOKUP(A8,'[1]Flat Table (REG Website)'!$A$5:$O$73,15,FALSE)","v":22.222222222222221},0,28.571428571428573,100,25,59]
["Carterton District Council",54.166666666666671,70,50,87.5,75,50,33.333333333333336,100,0,50,100,55.555555555555557,50,{"$f":"VLOOKUP(A9,'[1]Flat Table (REG Website)'!$A$5:$O$73,15,FALSE)","v":55.555555555555557},75,52.38095238095238,0,50,72]
["Central Hawke's Bay District Council",79.166666666666671,90,83.333333333333329,100,87.5,50,100,100,100,58.333333333333321,100,50,50,{"$f":"VLOOKUP(A10,'[1]Flat Table (REG Website)'!$A$5:$O$73,15,FALSE)","v":61.111111111111114},25,50,100,75,66]
{"$rows_left_out":64}
{"sheet":"ONRC Category Results","index":1,"n_rows":73,"n_cols":7,"rows_kept":73,"cut":false,"hidden":true,"merged":[[2,1,2,6],[3,1,3,6]]}
["REG DATA QUALITY RESULTS 2018/19 | PERCENTAGE AT THE EXPECTED STANDARD"]
[]
[null,"ONRC"]
[null,"Data Category"]
[null,"Network","Asset Inventory","Maintenance Acitivity","Condition","Demand/Use","Crash"]
["Ashburton District Council",56.25,100,100,100,61.904761904761905,100]
["Auckland Transport",87.5,25,100,50,61.904761904761905,0]
["Buller District Council",68.75,25,33.333333333333336,50,42.857142857142854,50]
["Carterton District Council",81.25,50,33.333333333333336,100,28.571428571428569,100]
["Central Hawke's Bay District Council",93.75,50,100,100,76.190476190476176,100]
{"$rows_left_out":64}
{"sheet":"Region & Peer Group Results","index":2,"n_rows":35,"n_cols":27,"rows_kept":35,"cut":false,"hidden":true,"merged":[[2,21,2,26],[3,21,3,26],[31,1,31,11],[31,12,31,19],[31,21,31,26],[19,1,19,11],[19,12,19,19],[20,1,20,3],[20,4,20,11],[20,12,20,14],[20,15,20,18],[19,21,19,26],[20,21,20,26],[2,1,2,11],[2,12,2,19],[3,1,3,3],[3,4,3,11],[3,12,3,14],[3,15,3,18],[32,1,32,3],[32,4,32,11],[32,12,32,14],[32,15,32,18],[32,21,32,26]]}
["REG DATA QUALITY RESULTS 2018/19 | PERCENTAGE AT THE EXPECTED STANDARD (REGIONS)"]
[]
[null,"ONRC",null,null,null,null,null,null,null,null,null,null,"Asset Management",null,null,null,null,null,null,null,null,"ONRC"]
[null,"Quality Dimension",null,null,"Data Sub-Category",null,null,null,null,null,null,null,"Quality Dimension",null,null,"Data Category",null,null,null,"Score",null,"Data Category"]
["Region","Accuracy","Completeness","Timeliness","Carriageway","Treatment Length","Surfacing","Maintenance Activity","Roughness","Traffic Count","Traffic Estimates","Crash","Accuracy","Completeness","Timeliness","Network","Asset Inventory","Condition","Maintenance Activity","AM Score",null,"Network","Asset Inventory","Maintenance Acitivity","Condition","Demand/Use","Crash"]
["Bay of Plenty",75.694444444444443,63.333333333333336,73.611111111111114,93.75,58.333333333333336,37.5,61.111111111111114,83.333333333333343,66.666666666666671,86.111111111111114,91.666666666666671,62.711864406779661,64.788732394366207,47.222222222222221,60.869565217391305,58.333333333333336,50,81.818181818181813,71.666666666666671,null,76.041666666666671,37.5,61.111111111111114,83.333333333333343,77.777777777777786,91.666666666666671]
["Canterbury",76.388888888888886,70,60.18518518518519,84.722222222222229,50,55.555555555555557,88.888888888888886,94.444444444444443,62.962962962962962,71.296296296296305,83.333333333333343,54.022988505747129,57.943925233644855,33.333333333333329,60.000000000000007,42.328042328042329,66.666666666666671,73.333333333333343,66.333333333333329,null,67.361111111111114,55.555555555555557,88.888888888888886,94.444444444444443,67.724867724867735,83.333333333333343]
["Gisborne and Hawkes Bay",69.166666666666671,70,61.666666666666657,100,37.5,45,86.666666666666671,80,60,71.666666666666657,80,48.979591836734691,63.333333333333336,50,45,52.912621359223301,65,77.777777777777786,65.599999999999994,null,68.75,45,86.666666666666671,80,66.666666666666671,80]
["No Region",43.055555555555557,60,55.55555555555555,70.833333333333343,16.666666666666668,16.666666666666668,44.444444444444443,66.666666666666671,44.444444444444443,88.888888888888886,83.333333333333343,42.857142857142854,42.857142857142861,39.130434782608695,36.363636363636367,44.067796610169495,41.666666666666671,25,55,null,43.75,16.666666666666668,44.444444444444443,66.666666666666671,69.841269841269835,83.333333333333343]
["North Auckland",77.083333333333343,50,70.833333333333329,81.25,68.75,31.25,75,87.5,41.666666666666671,77.083333333333329,75,59.45945945945946,64.583333333333343,58.333333333333336,37.5,65.476190476190482,68.75,40,69.5,null,75,31.25,75,87.5,61.904761904761898,75]
{"$rows_left_out":26}
{"sheet":"Lookups","index":3,"n_rows":70,"n_cols":12,"rows_kept":70,"cut":false,"hidden":true,"merged":[]}
[null,null,null,null,null,null,null,"RCA_ID","RCA_Name","old_RCA_Name","Peer Group","Region"]
["Financial Years",null,null,null,null,null,null,57,"Ashburton District Council","Ashburton District","Rural Districts","Canterbury"]
["2018/19",null,null,null,null,null,null,80,"Auckland Transport","Auckland","Cities","North Auckland"]
["2017/18",null,null,null,null,null,null,58,"Buller District Council","Buller District","Provincial Centres","Top of South Island and West Coast"]
["2016/17",null,null,null,null,null,null,23,"Carterton District Council","Carterton District","Rural Districts","Wellington"]
["2015/16",null,null,null,null,null,null,38,"Central Hawke's Bay District Council","Central Hawkes Bay District","Rural Districts","Gisborne and Hawkes Bay"]
["2014/15",null,null,null,null,null,null,59,"Central Otago District Council","Central Otago District","Rural Districts","Southland and Otago"]
[null,null,null,null,null,null,null,86,"Chatham Islands Council","Chatham Island","Rural Districts","No Region"]
["Comparison",null,null,null,null,null,null,76,"Christchurch City Council","Christchurch City","Cities","Canterbury"]
["National",null,null,null,null,null,null,60,"Clutha District Council","Clutha District","Rural Districts","Southland and Otago"]
{"$rows_left_out":61}
{"sheet":"Charts","index":4,"n_rows":39,"n_cols":9,"rows_kept":39,"cut":false,"hidden":false,"merged":[]}
["DATA QUALITY RESULTS 2018/19 | PERCENTAGE AT THE EXPECTED STANDARD"]
[]
["My RCA:","Waipa District Council","Select RCA from drop down list"]
["Comparison","Peer Group"]
[{"$f":"B4&\":\"","v":"Peer Group:"},{"$f":"IF($B$4=Lookups!$A$10,'Chart Data'!$D$3,IF(Charts!$B$4=Lookups!$A$11,'Chart Data'!$E$3,IF(Charts!$B$4=Lookups!$A$12,'Chart Data'!$F$3,\"\")))","v":"Provincial Centres"}]
[]
[]
[]
[]
[]
{"$rows_left_out":30}
{"sheet":"Chart Data","index":5,"n_rows":20,"n_cols":45,"rows_kept":20,"cut":false,"hidden":true,"merged":[]}
[null,"Financial Year","2018/19"]
[null,"Reported Grade",1,null,null,null,null,null,null,null,null,null,null,null,null,null,null,"RCA",null,"Comparison",null,"10%ile",null,"25%ile",null,"50%ile",null,"75%ile",null,"90%ile"]
[null,"Individual RCA",{"$f":"Charts!$B$3","v":"Waipa District Council"},"National",{"$f":"VLOOKUP($C$3,Table22[[#All],[RCA_Name]:[Region]],4,FALSE)","v":"Waikato"},{"$f":"VLOOKUP($C$3,Table22[[#All],[RCA_Name]:[Region]],3,FALSE)","v":"Provincial Centres"},10,25,50,75,90,"Sector Weight","% of 360","Start Angle","Finish Angle","Chart Label","Theta",null,"Values",null,null,null,"Values",null,"Values",null,"Values",null,"Values",null,"Values",null,null,null,0,0.1,0.2,0.3,0.4,0.5,0.6,0.7,0.8,0.9,1]
["ONRC","Accuracy",{"$f":"VLOOKUP($C$3,'RCA Results Table'!$A$5:$T$73,2,FALSE)/100","v":0.95833333333333348},{"$f":"VLOOKUP($D$3,'Region & Peer Group Results'!$A$34:$AA$35,2,FALSE)/100","v":0.71557971014492761},{"$f":"VLOOKUP($E$3,'Region & Peer Group Results'!$A$5:$AA$15,2,FALSE)/100","v":0.88333333333333341},{"$f":"VLOOKUP($F$3,'Region & Peer Group Results'!$A$22:$AA$27,2,FALSE)/100","v":0.70987654320987648},0.51333333333333331,0.6,0.66666666666666663,0.73333333333333328,0.8666666666666667,2,{"$f":"L4/SUM($L$4:$L$19)","v":8.3333333333333329E-2},0,{"$f":"360*SUM($M$3:M4)","v":30},"Accuracy",{"$f":"(O4-N4)/2+N4","v":15},{"$f":"C4*SIN(Q4/180*PI())","v":0.24803491822324908},{"$f":"C4*COS(Q4/180*PI())","v":0.9256789168603573},{"$f":"IF(Charts!$B$5='Chart Data'!$D$3,D4*SIN(Q4/180*PI()),IF(Charts!$B$5='Chart Data'!$E$3,E4*SIN(Q4/180*PI()),IF(Charts!$B$5='Chart Data'!$F$3,F4*SIN(Q4/180*PI()),\"\")))","v":0.18372956905425852},{"$f":"IF(Charts!$B$5='Chart Data'!$D$3,D4*COS(Q4/180*PI()),IF(Charts!$B$5='Chart Data'!$E$3,E4*COS(Q4/180*PI()),IF(Charts!$B$5='Chart Data'!$F$3,F4*COS(Q4/180*PI()),\"\")))","v":0.68568808656322744},{"$f":"$G4*SIN($Q4/180*PI())","v":0.13286044315262729},{"$f":"$G4*COS($Q4/180*PI())","v":0.49584192416172174},{"$f":"$H4*SIN($Q4/180*PI())","v":0.15529142706151244},{"$f":"$H4*COS($Q4/180*PI())","v":0.57955549577344101},{"$f":"$I4*SIN($Q4/180*PI())","v":0.17254603006834715},{"$f":"$I4*COS($Q4/180*PI())","v":0.6439505508593788},{"$f":"$J4*SIN($Q4/180*PI())","v":0.18980063307518186},{"$f":"$J4*COS($Q4/180*PI())","v":0.7083456059453167},{"$f":"$K4*SIN($Q4/180*PI())","v":0.22430983908885133},{"$f":"$K4*COS($Q4/180*PI())","v":0.83713571611719262},null,null,32.727272727272727,{"$f":"$L4","v":2},{"$f":"$L4","v":2},2,2,2,2,2,2,2,2,2]
["ONRC","Completeness",{"$f":"VLOOKUP($C$3,'RCA Results Table'!$A$5:$T$73,3,FALSE)/100","v":1},{"$f":"VLOOKUP($D$3,'Region & Peer Group Results'!$A$34:$AA$35,3,FALSE)/100","v":0.71159420289855069},{"$f":"VLOOKUP($E$3,'Region & Peer Group Results'!$A$5:$AA$15,3,FALSE)/100","v":0.83},{"$f":"VLOOKUP($F$3,'Region & Peer Group Results'!$A$22:$AA$27,3,FALSE)/100","v":0.71111111111111103},0.4,0.5,0.6,0.7,0.8,2,{"$f":"L5/SUM($L$4:$L$19)","v":8.3333333333333329E-2},{"$f":"O4","v":30},{"$f":"360*SUM($M$3:M5)","v":60},"Completeness",{"$f":"(O5-N5)/2+N5","v":45},0.70710678118654746,0.70710678118654757,{"$f":"IF(Charts!$B$5='Chart Data'!$D$3,D5*SIN(Q5/180*PI()),IF(Charts!$B$5='Chart Data'!$E$3,E5*SIN(Q5/180*PI()),IF(Charts!$B$5='Chart Data'!$F$3,F5*SIN(Q5/180*PI()),\"\")))","v":0.50283148884376705},{"$f":"IF(Charts!$B$5='Chart Data'!$D$3,D5*COS(Q5/180*PI()),IF(Charts!$B$5='Chart Data'!$E$3,E5*COS(Q5/180*PI()),IF(Charts!$B$5='Chart Data'!$F$3,F5*COS(Q5/180*PI()),\"\")))","v":0.50283148884376705},{"$f":"$G5*SIN($Q5/180*PI())","v":0.28284271247461901},{"$f":"$G5*COS($Q5/180*PI())","v":0.28284271247461906},{"$f":"$H5*SIN($Q5/180*PI())","v":0.35355339059327373},{"$f":"$H5*COS($Q5/180*PI())","v":0.35355339059327379},{"$f":"$I5*SIN($Q5/180*PI())","v":0.42426406871192845},{"$f":"$I5*COS($Q5/180*PI())","v":0.42426406871192851},{"$f":"$J5*SIN($Q5/180*PI())","v":0.49497474683058318},{"$f":"$J5*COS($Q5/180*PI())","v":0.49497474683058329},{"$f":"$K5*SIN($Q5/180*PI())","v":0.56568542494923801},{"$f":"$K5*COS($Q5/180*PI())","v":0.56568542494923812},null,null,65.454545454545453,{"$f":"$L5","v":2},2,2,2,2,2,2,2,2,2,2]
["ONRC","Timeliness",{"$f":"VLOOKUP($C$3,'RCA Results Table'!$A$5:$T$73,4,FALSE)/100","v":0.75},{"$f":"VLOOKUP($D$3,'Region & Peer Group Results'!$A$34:$AA$35,4,FALSE)/100","v":0.63345410628019327},{"$f":"VLOOKUP($E$3,'Region & Peer Group Results'!$A$5:$AA$15,4,FALSE)/100","v":0.7416666666666667},{"$f":"VLOOKUP($F$3,'Region & Peer Group Results'!$A$22:$AA$27,4,FALSE)/100","v":0.62654320987654311},0.16666666666666666,0.16666666666666666,0.33333333333333331,0.5,0.66666666666666663,2,8.3333333333333329E-2,{"$f":"O5","v":60},{"$f":"360*SUM($M$3:M6)","v":90},"Timeliness",75,0.72444436971680126,0.19411428382689055,{"$f":"IF(Charts!$B$5='Chart Data'!$D$3,D6*SIN(Q6/180*PI()),IF(Charts!$B$5='Chart Data'!$E$3,E6*SIN(Q6/180*PI()),IF(Charts!$B$5='Chart Data'!$F$3,F6*SIN(Q6/180*PI()),\"\")))","v":0.60519426770580509},{"$f":"IF(Charts!$B$5='Chart Data'!$D$3,D6*COS(Q6/180*PI()),IF(Charts!$B$5='Chart Data'!$E$3,E6*COS(Q6/180*PI()),IF(Charts!$B$5='Chart Data'!$F$3,F6*COS(Q6/180*PI()),\"\")))","v":0.16216131529571512},0.1609876377148447,4.3136507517086788E-2,0.1609876377148447,4.3136507517086788E-2,0.3219752754296894,8.6273015034173575E-2,0.48296291314453416,0.12940952255126037,0.6439505508593788,0.17254603006834715,null,null,98.181818181818173,2,2,2,2,2,2,2,2,2,2,2]
["ONRC","Network",{"$f":"VLOOKUP($C$3,'ONRC Category Results'!$A:$G,2,FALSE)/100","v":0.9375},{"$f":"VLOOKUP($D$3,'Region & Peer Group Results'!$A$34:$AA$35,22,FALSE)/100","v":0.74184782608695654},{"$f":"VLOOKUP($E$3,'Region & Peer Group Results'!$A$5:$AA$15,22,FALSE)/100","v":0.91249999999999998},{"$f":"VLOOKUP($F$3,'Region & Peer Group Results'!$A$22:$AA$27,22,FALSE)/100","v":0.73611111111111105},0.45454545454545453,0.54545454545454541,0.63636363636363635,0.81818181818181823,0.81818181818181823,1,4.1666666666666664E-2,90,{"$f":"360*SUM($M$3:M7)","v":105},"Network",97.5,0.92947955753794731,-0.12236830520629817,{"$f":"IF(Charts!$B$5='Chart Data'!$D$3,D7*SIN(Q7/180*PI()),IF(Charts!$B$5='Chart Data'!$E$3,E7*SIN(Q7/180*PI()),IF(Charts!$B$5='Chart Data'!$F$3,F7*SIN(Q7/180*PI()),\"\")))","v":0.72981357851127715},{"$f":"IF(Charts!$B$5='Chart Data'!$D$3,D7*COS(Q7/180*PI()),IF(Charts!$B$5='Chart Data'!$E$3,E7*COS(Q7/180*PI()),IF(Charts!$B$5='Chart Data'!$F$3,F7*COS(Q7/180*PI()),\"\")))","v":-9.6081780384204479E-2},0.45065675516991383,-5.9330087372750626E-2,0.54078810620389661,-7.1196104847300754E-2,0.63091945723787934,-8.3062122321850881E-2,0.81118215930584503,-0.10679415727095114,0.81118215930584503,-0.10679415727095114,null,null,114.54545454545455,1,1,1,1,1,1,1,1,1,1,1]
["ONRC","Asset Inventory",{"$f":"VLOOKUP($C$3,'ONRC Category Results'!$A:$G,3,FALSE)/100","v":1},{"$f":"VLOOKUP($D$3,'Region & Peer Group Results'!$A$34:$AA$35,23,FALSE)/100","v":0.51811594202898559},{"$f":"VLOOKUP($E$3,'Region & Peer Group Results'!$A$5:$AA$15,23,FALSE)/100","v":0.82499999999999996},{"$f":"VLOOKUP($F$3,'Region & Peer Group Results'!$A$22:$AA$27,23,FALSE)/100","v":0.45370370370370366},0,0.25,0.25,0.5,0.75,1,4.1666666666666664E-2,105,{"$f":"360*SUM($M$3:M8)","v":120.00000000000001},"Asset Inventory",112.5,0.92387953251128674,-0.38268343236508973,{"$f":"IF(Charts!$B$5='Chart Data'!$D$3,D8*SIN(Q8/180*PI()),IF(Charts!$B$5='Chart Data'!$E$3,E8*SIN(Q8/180*PI()),IF(Charts!$B$5='Chart Data'!$F$3,F8*SIN(Q8/180*PI()),\"\")))","v":0.41916756567641711},{"$f":"IF(Charts!$B$5='Chart Data'!$D$3,D8*COS(Q8/180*PI()),IF(Charts!$B$5='Chart Data'!$E$3,E8*COS(Q8/180*PI()),IF(Charts!$B$5='Chart Data'!$F$3,F8*COS(Q8/180*PI()),\"\")))","v":-0.17362489061008698},0,0,0.23096988312782168,-9.5670858091272432E-2,0.23096988312782168,-9.5670858091272432E-2,0.46193976625564337,-0.19134171618254486,0.692909649383465,-0.28701257427381732,null,null,130.90909090909091,1,1,1,1,1,1,1,1,1,1,1]
["ONRC","Maintenance Activity",{"$f":"VLOOKUP($C$3,'ONRC Category Results'!$A:$G,4,FALSE)/100","v":1},{"$f":"VLOOKUP($D$3,'Region & Peer Group Results'!$A$34:$AA$35,24,FALSE)/100","v":0.72946859903381656},{"$f":"VLOOKUP($E$3,'Region & Peer Group Results'!$A$5:$AA$15,24,FALSE)/100","v":0.8666666666666667},{"$f":"VLOOKUP($F$3,'Region & Peer Group Results'!$A$22:$AA$27,24,FALSE)/100","v":0.74074074074074081},0,0.58333333333333326,0.66666666666666663,1,1,1,4.1666666666666664E-2,120.00000000000001,{"$f":"360*SUM($M$3:M9)","v":135.00000000000003},"Maintenance Activtity",127.50000000000003,0.79335334029123483,-0.60876142900872099,{"$f":"IF(Charts!$B$5='Chart Data'!$D$3,D9*SIN(Q9/180*PI()),IF(Charts!$B$5='Chart Data'!$E$3,E9*SIN(Q9/180*PI()),IF(Charts!$B$5='Chart Data'!$F$3,F9*SIN(Q9/180*PI()),\"\")))","v":0.58766914095647027},{"$f":"IF(Charts!$B$5='Chart Data'!$D$3,D9*COS(Q9/180*PI()),IF(Charts!$B$5='Chart Data'!$E$3,E9*COS(Q9/180*PI()),IF(Charts!$B$5='Chart Data'!$F$3,F9*COS(Q9/180*PI()),\"\")))","v":-0.45093439185831191},0,0,0.46278944850322024,-0.35511083358842055,0.52890222686082322,-0.40584095267248066,0.79335334029123483,-0.60876142900872099,0.79335334029123483,-0.60876142900872099,null,null,147.27272727272728,1,1,1,1,1,1,1,1,1,1,1]
["ONRC","Condition",{"$f":"VLOOKUP($C$3,'ONRC Category Results'!$A:$G,5,FALSE)/100","v":1},{"$f":"VLOOKUP($D$3,'Region & Peer Group Results'!$A$34:$AA$35,25,FALSE)/100","v":0.9057971014492755},{"$f":"VLOOKUP($E$3,'Region & Peer Group Results'!$A$5:$AA$15,25,FALSE)/100","v":0.8},{"$f":"VLOOKUP($F$3,'Region & Peer Group Results'!$A$22:$AA$27,25,FALSE)/100","v":0.88888888888888884},0.5,1,1,1,1,1,4.1666666666666664E-2,135.00000000000003,{"$f":"360*SUM($M$3:M10)","v":150.00000000000003},"Condition",142.50000000000003,0.6087614290087201,-0.79335334029123561,{"$f":"IF(Charts!$B$5='Chart Data'!$D$3,D10*SIN(Q10/180*PI()),IF(Charts!$B$5='Chart Data'!$E$3,E10*SIN(Q10/180*PI()),IF(Charts!$B$5='Chart Data'!$F$3,F10*SIN(Q10/180*PI()),\"\")))","v":0.54112127022997336},{"$f":"IF(Charts!$B$5='Chart Data'!$D$3,D10*COS(Q10/180*PI()),IF(Charts!$B$5='Chart Data'!$E$3,E10*COS(Q10/180*PI()),IF(Charts!$B$5='Chart Data'!$F$3,F10*COS(Q10/180*PI()),\"\")))","v":-0.70520296914776492},0.30438071450436005,-0.3966766701456178,0.6087614290087201,-0.79335334029123561,0.6087614290087201,-0.79335334029123561,0.6087614290087201,-0.79335334029123561,0.6087614290087201,-0.79335334029123561,null,null,163.63636363636365,1,1,1,1,1,1,1,1,1,1,1]
{"$rows_left_out":10}