{"text_format":"1","workbook":"xlsx","n_sheets":6,"sheets":["RCA Results Table","ONRC Category Results","Region & Peer Group Results","Lookups","Charts","Chart Data"],"not_rendered":{"charts":1,"images":2,"macros":1,"external_links":0,"defined_names":1,"comments":0,"pivot_tables":0},"unopened":[],"bounds":{"document_bytes":16777216,"sheet_cells":100000,"rows_first":2000,"rows_last":500,"rows_between":2000,"halvings":0,"cell_chars":16384,"cell_head_chars":4096},"cells_cut":0,"cells_raw":0,"read":"whole","date_system":"1900"}

{"sheet":"RCA Results Table","index":0,"n_rows":73,"n_cols":20,"rows_kept":73,"cut":false,"hidden":false,"merged":[[2,1,2,11],[2,12,2,19],[3,1,3,3],[3,4,3,11],[3,12,3,14],[3,15,3,18]]}
[null,"DATA QUALITY RESULTS 2017/18 | PERCENTAGE AT THE EXPECTED STANDARD"]
[]
[null,"ONRC",null,null,null,null,null,null,null,null,null,null,"Asset Management"]
[null,"Quality Dimension",null,null,"Data Sub-Category",null,null,null,null,null,null,null,"Quality Dimension",null,null,"Data Category",null,null,null,"Score"]
["RCA Name","Accuracy","Complete-ness","Timeliness","Carriageway","Treatment Length","Surfacing","Maintenance Activity","Roughness","Traffic Count","Traffic Estimates","Crash","Accuracy","Complete-ness","Timeliness","Network","Asset Inventory","Condition","Maintenance Activity","AM Score"]
["Ashburton District Council",87.5,70,16.666666666666664,87.5,25,75,100,100,33.333333333333336,91.666666666666657,50,60,50,66.666666666666671,100,42.857142857142861,100,75,75]
["Auckland Transport",83.333333333333343,40,49.999999999999993,100,50,25,66.666666666666671,50,66.666666666666671,75,0,40,50,77.777777777777786,50,57.142857142857146,50,50,63]
["Buller District Council",33.333333333333336,50,25,50,50,0,0,100,0,100,0,20,25,11.111111111111111,0,19.047619047619047,100,0,40]
["Carterton District Council",70.833333333333343,70,12.5,87.5,50,25,100,100,33.333333333333336,62.5,50,50,25,66.666666666666671,75,38.095238095238095,50,50,56]
["Central Hawke's Bay District Council",66.666666666666671,60,33.333333333333329,100,25,25,66.666666666666671,100,100,58.333333333333321,0,40,41.666666666666671,44.444444444444443,25,33.333333333333336,100,75,56]
{"$rows_left_out":64}
{"sheet":"ONRC Category Results","index":1,"n_rows":73,"n_cols":7,"rows_kept":73,"cut":false,"hidden":true,"merged":[[2,1,2,6],[3,1,3,6]]}
["REG DATA QUALITY RESULTS 2018/19 | PERCENTAGE AT THE EXPECTED STANDARD"]
[]
[null,"ONRC"]
[null,"Data Category"]
[null,"Network","Asset Inventory","Maintenance Acitivity","Condition","Demand/Use","Crash"]
["Ashburton District Council",56.25,75,100,100,66.666666666666671,50]
["Auckland Transport",75,25,66.666666666666671,50,71.428571428571416,0]
["Buller District Council",50,0,0,100,57.142857142857139,0]
["Carterton District Council",68.75,25,100,100,49.999999999999993,50]
["Central Hawke's Bay District Council",62.5,25,66.666666666666671,100,76.190476190476176,0]
{"$rows_left_out":64}
{"sheet":"Region & Peer Group Results","index":2,"n_rows":35,"n_cols":27,"rows_kept":35,"cut":false,"hidden":true,"merged":[[32,1,32,3],[32,4,32,11],[32,12,32,14],[32,15,32,18],[32,21,32,26],[2,21,2,26],[3,21,3,26],[31,1,31,11],[31,12,31,19],[31,21,31,26],[19,1,19,11],[19,12,19,19],[20,1,20,3],[20,4,20,11],[20,12,20,14],[20,15,20,18],[2,1,2,11],[2,12,2,19],[3,1,3,3],[3,4,3,11],[3,12,3,14],[3,15,3,18],[19,21,19,26],[20,21,20,26]]}
["REG DATA QUALITY RESULTS 2017/18 | PERCENTAGE AT THE EXPECTED STANDARD (REGIONS)"]
[]
[null,"ONRC",null,null,null,null,null,null,null,null,null,null,"Asset Management",null,null,null,null,null,null,null,null,"ONRC"]
[null,"Quality Dimension",null,null,"Data Sub-Category",null,null,null,null,null,null,null,"Quality Dimension",null,null,"Data Category",null,null,null,"Score",null,"Data Category"]
["Region","Accuracy","Completeness","Timeliness","Carriageway","Treatment Length","Surfacing","Maintenance Activity","Roughness","Traffic Count","Traffic Estimates","Crash","Accuracy","Completeness","Timeliness","Network","Asset Inventory","Condition","Maintenance Activity","AM Score",null,"Network","Asset Inventory","Maintenance Acitivity","Condition","Demand/Use","Crash"]
["Bay of Plenty",68.75,58.333333333333336,38.19444444444445,95.833333333333343,64.583333333333343,33.333333333333336,61.111111111111114,83.333333333333343,38.888888888888893,63.19444444444445,33.333333333333336,50,59.722222222222221,51.851851851851848,41.666666666666671,54.761904761904759,75,54.166666666666671,null,null,80.208333333333343,33.333333333333336,61.111111111111114,83.333333333333343,52.777777777777771,33.333333333333336]
["Canterbury",71.296296296296291,66.666666666666671,34.259259259259267,81.944444444444443,37.5,41.666666666666671,74.074074074074076,100,59.259259259259252,81.481481481481495,44.444444444444443,44.444444444444443,46.296296296296291,48.734177215189874,52.777777777777779,43.048128342245988,66.666666666666671,47.222222222222221,null,null,59.722222222222221,41.666666666666671,74.074074074074076,100,71.957671957671963,44.444444444444443]
["Gisborne and Hawkes Bay",63.333333333333336,62,35.833333333333329,95,15,45,86.666666666666671,80,60,60.833333333333329,30,44.897959183673471,55,50,42.10526315789474,47.142857142857139,60,70,null,null,55,45,86.666666666666671,80,60.476190476190482,30]
["No Region",35.416666666666671,50,37.5,62.5,18.75,12.5,16.666666666666668,100,33.333333333333336,75,25,25,16.666666666666668,60,37.5,35.897435897435898,0,12.5,null,null,40.625,12.5,16.666666666666668,100,57.142857142857139,25]
["North Auckland",66.31578947368422,45,41.666666666666664,81.25,35.483870967741936,18.75,83.333333333333343,87.5,33.333333333333336,66.666666666666671,37.5,30,54.166666666666671,66.666666666666671,43.75,53.571428571428577,12.5,56.25,null,null,58.730158730158728,18.75,83.333333333333343,87.5,52.380952380952372,37.5]
{"$rows_left_out":26}
{"sheet":"Lookups","index":3,"n_rows":70,"n_cols":12,"rows_kept":70,"cut":false,"hidden":true,"merged":[]}
[null,null,null,null,null,null,null,"RCA_ID","RCA_Name","old_RCA_Name","Peer Group","Region"]
["Financial Years",null,null,null,null,null,null,57,"Ashburton District Council","Ashburton District","Rural Districts","Canterbury"]
["2018/19",null,null,null,null,null,null,80,"Auckland Transport","Auckland","Cities","North Auckland"]
["2017/18",null,null,null,null,null,null,58,"Buller District Council","Buller District","Provincial Centres","Top of South Island and West Coast"]
["2016/17",null,null,null,null,null,null,23,"Carterton District Council","Carterton District","Rural Districts","Wellington"]
["2015/16",null,null,null,null,null,null,38,"Central Hawke's Bay District Council","Central Hawkes Bay District","Rural Districts","Gisborne and Hawkes Bay"]
["2014/15",null,null,null,null,null,null,59,"Central Otago District Council","Central Otago District","Rural Districts","Southland and Otago"]
[null,null,null,null,null,null,null,86,"Chatham Islands Council","Chatham Island","Rural Districts","No Region"]
["Comparison",null,null,null,null,null,null,76,"Christchurch City Council","Christchurch City","Cities","Canterbury"]
["National",null,null,null,null,null,null,60,"Clutha District Council","Clutha District","Rural Districts","Southland and Otago"]
{"$rows_left_out":61}
{"sheet":"Charts","index":4,"n_rows":5,"n_cols":3,"rows_kept":5,"cut":false,"hidden":false,"merged":[]}
["DATA QUALITY RESULTS 2017/18 | PERCENTAGE AT THE EXPECTED STANDARD"]
[]
["My RCA:","Ashburton District Council","Select RCA from drop down list"]
["Comparison","Peer Group"]
[{"$f":"B4&\":\"","v":"Peer Group:"},{"$f":"IF($B$4=Lookups!$A$10,'Chart Data'!$D$3,IF(Charts!$B$4=Lookups!$A$11,'Chart Data'!$E$3,IF(Charts!$B$4=Lookups!$A$12,'Chart Data'!$F$3,\"\")))","v":"Rural Districts"}]

{"sheet":"Chart Data","index":5,"n_rows":20,"n_cols":45,"rows_kept":20,"cut":false,"hidden":true,"merged":[]}
[null,"Financial Year","2018/19"]
[null,"Reported Grade",1,null,null,null,null,null,null,null,null,null,null,null,null,null,null,"RCA",null,"Comparison",null,"10%ile",null,"25%ile",null,"50%ile",null,"75%ile",null,"90%ile"]
[null,"Individual RCA",{"$f":"Charts!$B$3","v":"Ashburton District Council"},"National",{"$f":"VLOOKUP($C$3,Table22[[#All],[RCA_Name]:[Region]],4,FALSE)","v":"Canterbury"},{"$f":"VLOOKUP($C$3,Table22[[#All],[RCA_Name]:[Region]],3,FALSE)","v":"Rural Districts"},10,25,50,75,90,"Sector Weight","% of 360","Start Angle","Finish Angle","Chart Label","Theta",null,"Values",null,null,null,"Values",null,"Values",null,"Values",null,"Values",null,"Values",null,null,null,0,0.1,0.2,0.3,0.4,0.5,0.6,0.7,0.8,0.9,1]
["ONRC","Accuracy",{"$f":"VLOOKUP($C$3,'RCA Results Table'!$A$5:$T$73,2,FALSE)/100","v":0.875},{"$f":"VLOOKUP($D$3,'Region & Peer Group Results'!$A$34:$AA$35,2,FALSE)/100","v":0.65318627450980382},{"$f":"VLOOKUP($E$3,'Region & Peer Group Results'!$A$5:$AA$15,2,FALSE)/100","v":0.71296296296296291},{"$f":"VLOOKUP($F$3,'Region & Peer Group Results'!$A$22:$AA$27,2,FALSE)/100","v":0.65650080256821819},0.51333333333333331,0.6,0.66666666666666663,0.73333333333333328,0.8666666666666667,2,{"$f":"L4/SUM($L$4:$L$19)","v":8.3333333333333329E-2},0,{"$f":"360*SUM($M$3:M4)","v":30},"Accuracy",{"$f":"(O4-N4)/2+N4","v":15},{"$f":"C4*SIN(Q4/180*PI())","v":0.22646666446470565},{"$f":"C4*COS(Q4/180*PI())","v":0.84518509800293473},{"$f":"IF(Charts!$B$5='Chart Data'!$D$3,D4*SIN(Q4/180*PI()),IF(Charts!$B$5='Chart Data'!$E$3,E4*SIN(Q4/180*PI()),IF(Charts!$B$5='Chart Data'!$F$3,F4*SIN(Q4/180*PI()),\"\")))","v":0.16991491082974472},{"$f":"IF(Charts!$B$5='Chart Data'!$D$3,D4*COS(Q4/180*PI()),IF(Charts!$B$5='Chart Data'!$E$3,E4*COS(Q4/180*PI()),IF(Charts!$B$5='Chart Data'!$F$3,F4*COS(Q4/180*PI()),\"\")))","v":0.63413108018014264},{"$f":"$G4*SIN($Q4/180*PI())","v":0.13286044315262729},{"$f":"$G4*COS($Q4/180*PI())","v":0.49584192416172174},{"$f":"$H4*SIN($Q4/180*PI())","v":0.15529142706151244},{"$f":"$H4*COS($Q4/180*PI())","v":0.57955549577344101},{"$f":"$I4*SIN($Q4/180*PI())","v":0.17254603006834715},{"$f":"$I4*COS($Q4/180*PI())","v":0.6439505508593788},{"$f":"$J4*SIN($Q4/180*PI())","v":0.18980063307518186},{"$f":"$J4*COS($Q4/180*PI())","v":0.7083456059453167},{"$f":"$K4*SIN($Q4/180*PI())","v":0.22430983908885133},{"$f":"$K4*COS($Q4/180*PI())","v":0.83713571611719262},null,null,32.727272727272727,{"$f":"$L4","v":2},{"$f":"$L4","v":2},2,2,2,2,2,2,2,2,2]
["ONRC","Completeness",{"$f":"VLOOKUP($C$3,'RCA Results Table'!$A$5:$T$73,3,FALSE)/100","v":0.7},{"$f":"VLOOKUP($D$3,'Region & Peer Group Results'!$A$34:$AA$35,3,FALSE)/100","v":0.59852941176470587},{"$f":"VLOOKUP($E$3,'Region & Peer Group Results'!$A$5:$AA$15,3,FALSE)/100","v":0.66666666666666674},{"$f":"VLOOKUP($F$3,'Region & Peer Group Results'!$A$22:$AA$27,3,FALSE)/100","v":0.62307692307692308},0.4,0.5,0.6,0.7,0.8,2,{"$f":"L5/SUM($L$4:$L$19)","v":8.3333333333333329E-2},{"$f":"O4","v":30},{"$f":"360*SUM($M$3:M5)","v":60},"Completeness",{"$f":"(O5-N5)/2+N5","v":45},0.49497474683058318,0.49497474683058329,{"$f":"IF(Charts!$B$5='Chart Data'!$D$3,D5*SIN(Q5/180*PI()),IF(Charts!$B$5='Chart Data'!$E$3,E5*SIN(Q5/180*PI()),IF(Charts!$B$5='Chart Data'!$F$3,F5*SIN(Q5/180*PI()),\"\")))","v":0.44058191750854114},{"$f":"IF(Charts!$B$5='Chart Data'!$D$3,D5*COS(Q5/180*PI()),IF(Charts!$B$5='Chart Data'!$E$3,E5*COS(Q5/180*PI()),IF(Charts!$B$5='Chart Data'!$F$3,F5*COS(Q5/180*PI()),\"\")))","v":0.4405819175085412},{"$f":"$G5*SIN($Q5/180*PI())","v":0.28284271247461901},{"$f":"$G5*COS($Q5/180*PI())","v":0.28284271247461906},{"$f":"$H5*SIN($Q5/180*PI())","v":0.35355339059327373},{"$f":"$H5*COS($Q5/180*PI())","v":0.35355339059327379},{"$f":"$I5*SIN($Q5/180*PI())","v":0.42426406871192845},{"$f":"$I5*COS($Q5/180*PI())","v":0.42426406871192851},{"$f":"$J5*SIN($Q5/180*PI())","v":0.49497474683058318},{"$f":"$J5*COS($Q5/180*PI())","v":0.49497474683058329},{"$f":"$K5*SIN($Q5/180*PI())","v":0.56568542494923801},{"$f":"$K5*COS($Q5/180*PI())","v":0.56568542494923812},null,null,65.454545454545453,{"$f":"$L5","v":2},2,2,2,2,2,2,2,2,2,2]
["ONRC","Timeliness",{"$f":"VLOOKUP($C$3,'RCA Results Table'!$A$5:$T$73,4,FALSE)/100","v":0.16666666666666663},{"$f":"VLOOKUP($D$3,'Region & Peer Group Results'!$A$34:$AA$35,4,FALSE)/100","v":0.33149509803921567},{"$f":"VLOOKUP($E$3,'Region & Peer Group Results'!$A$5:$AA$15,4,FALSE)/100","v":0.34259259259259267},{"$f":"VLOOKUP($F$3,'Region & Peer Group Results'!$A$22:$AA$27,4,FALSE)/100","v":0.35096153846153849},0.16666666666666666,0.16666666666666666,0.33333333333333331,0.5,0.66666666666666663,2,8.3333333333333329E-2,{"$f":"O5","v":60},{"$f":"360*SUM($M$3:M6)","v":90},"Timeliness",75,0.16098763771484467,4.3136507517086781E-2,{"$f":"IF(Charts!$B$5='Chart Data'!$D$3,D6*SIN(Q6/180*PI()),IF(Charts!$B$5='Chart Data'!$E$3,E6*SIN(Q6/180*PI()),IF(Charts!$B$5='Chart Data'!$F$3,F6*SIN(Q6/180*PI()),\"\")))","v":0.33900281403414417},{"$f":"IF(Charts!$B$5='Chart Data'!$D$3,D6*COS(Q6/180*PI()),IF(Charts!$B$5='Chart Data'!$E$3,E6*COS(Q6/180*PI()),IF(Charts!$B$5='Chart Data'!$F$3,F6*COS(Q6/180*PI()),\"\")))","v":9.0835530252327004E-2},0.1609876377148447,4.3136507517086788E-2,0.1609876377148447,4.3136507517086788E-2,0.3219752754296894,8.6273015034173575E-2,0.48296291314453416,0.12940952255126037,0.6439505508593788,0.17254603006834715,null,null,98.181818181818173,2,2,2,2,2,2,2,2,2,2,2]
["ONRC","Network",{"$f":"VLOOKUP($C$3,'ONRC Category Results'!$A:$G,2,FALSE)/100","v":0.5625},{"$f":"VLOOKUP($D$3,'Region & Peer Group Results'!$A$34:$AA$35,22,FALSE)/100","v":0.65625},{"$f":"VLOOKUP($E$3,'Region & Peer Group Results'!$A$5:$AA$15,22,FALSE)/100","v":0.59722222222222221},{"$f":"VLOOKUP($F$3,'Region & Peer Group Results'!$A$22:$AA$27,22,FALSE)/100","v":0.6433734939759036},0.45454545454545453,0.54545454545454541,0.63636363636363635,0.81818181818181823,0.81818181818181823,1,4.1666666666666664E-2,90,{"$f":"360*SUM($M$3:M7)","v":105},"Network",97.5,0.55768773452276843,-7.3420983123778899E-2,{"$f":"IF(Charts!$B$5='Chart Data'!$D$3,D7*SIN(Q7/180*PI()),IF(Charts!$B$5='Chart Data'!$E$3,E7*SIN(Q7/180*PI()),IF(Charts!$B$5='Chart Data'!$F$3,F7*SIN(Q7/180*PI()),\"\")))","v":0.63786934454652389},{"$f":"IF(Charts!$B$5='Chart Data'!$D$3,D7*COS(Q7/180*PI()),IF(Charts!$B$5='Chart Data'!$E$3,E7*COS(Q7/180*PI()),IF(Charts!$B$5='Chart Data'!$F$3,F7*COS(Q7/180*PI()),\"\")))","v":-8.3977092343984858E-2},0.45065675516991383,-5.9330087372750626E-2,0.54078810620389661,-7.1196104847300754E-2,0.63091945723787934,-8.3062122321850881E-2,0.81118215930584503,-0.10679415727095114,0.81118215930584503,-0.10679415727095114,null,null,114.54545454545455,1,1,1,1,1,1,1,1,1,1,1]
["ONRC","Asset Inventory",{"$f":"VLOOKUP($C$3,'ONRC Category Results'!$A:$G,3,FALSE)/100","v":0.75},{"$f":"VLOOKUP($D$3,'Region & Peer Group Results'!$A$34:$AA$35,23,FALSE)/100","v":0.31985294117647056},{"$f":"VLOOKUP($E$3,'Region & Peer Group Results'!$A$5:$AA$15,23,FALSE)/100","v":0.41666666666666674},{"$f":"VLOOKUP($F$3,'Region & Peer Group Results'!$A$22:$AA$27,23,FALSE)/100","v":0.34615384615384615},0,0.25,0.25,0.5,0.75,1,4.1666666666666664E-2,105,{"$f":"360*SUM($M$3:M8)","v":120.00000000000001},"Asset Inventory",112.5,0.692909649383465,-0.28701257427381732,{"$f":"IF(Charts!$B$5='Chart Data'!$D$3,D8*SIN(Q8/180*PI()),IF(Charts!$B$5='Chart Data'!$E$3,E8*SIN(Q8/180*PI()),IF(Charts!$B$5='Chart Data'!$F$3,F8*SIN(Q8/180*PI()),\"\")))","v":0.31980445356159926},{"$f":"IF(Charts!$B$5='Chart Data'!$D$3,D8*COS(Q8/180*PI()),IF(Charts!$B$5='Chart Data'!$E$3,E8*COS(Q8/180*PI()),IF(Charts!$B$5='Chart Data'!$F$3,F8*COS(Q8/180*PI()),\"\")))","v":-0.13246734197253104},0,0,0.23096988312782168,-9.5670858091272432E-2,0.23096988312782168,-9.5670858091272432E-2,0.46193976625564337,-0.19134171618254486,0.692909649383465,-0.28701257427381732,null,null,130.90909090909091,1,1,1,1,1,1,1,1,1,1,1]
["ONRC","Maintenance Activity",{"$f":"VLOOKUP($C$3,'ONRC Category Results'!$A:$G,4,FALSE)/100","v":1},{"$f":"VLOOKUP($D$3,'Region & Peer Group Results'!$A$34:$AA$35,24,FALSE)/100","v":0.67647058823529405},{"$f":"VLOOKUP($E$3,'Region & Peer Group Results'!$A$5:$AA$15,24,FALSE)/100","v":0.74074074074074081},{"$f":"VLOOKUP($F$3,'Region & Peer Group Results'!$A$22:$AA$27,24,FALSE)/100","v":0.69230769230769229},0,0.58333333333333326,0.66666666666666663,1,1,1,4.1666666666666664E-2,120.00000000000001,{"$f":"360*SUM($M$3:M9)","v":135.00000000000003},"Maintenance Activtity",127.50000000000003,0.79335334029123483,-0.60876142900872099,{"$f":"IF(Charts!$B$5='Chart Data'!$D$3,D9*SIN(Q9/180*PI()),IF(Charts!$B$5='Chart Data'!$E$3,E9*SIN(Q9/180*PI()),IF(Charts!$B$5='Chart Data'!$F$3,F9*SIN(Q9/180*PI()),\"\")))","v":0.54924462020162412},{"$f":"IF(Charts!$B$5='Chart Data'!$D$3,D9*COS(Q9/180*PI()),IF(Charts!$B$5='Chart Data'!$E$3,E9*COS(Q9/180*PI()),IF(Charts!$B$5='Chart Data'!$F$3,F9*COS(Q9/180*PI()),\"\")))","v":-0.42145022008296068},0,0,0.46278944850322024,-0.35511083358842055,0.52890222686082322,-0.40584095267248066,0.79335334029123483,-0.60876142900872099,0.79335334029123483,-0.60876142900872099,null,null,147.27272727272728,1,1,1,1,1,1,1,1,1,1,1]
["ONRC","Condition",{"$f":"VLOOKUP($C$3,'ONRC Category Results'!$A:$G,5,FALSE)/100","v":1},{"$f":"VLOOKUP($D$3,'Region & Peer Group Results'!$A$34:$AA$35,25,FALSE)/100","v":0.91176470588235292},{"$f":"VLOOKUP($E$3,'Region & Peer Group Results'!$A$5:$AA$15,25,FALSE)/100","v":1},{"$f":"VLOOKUP($F$3,'Region & Peer Group Results'!$A$22:$AA$27,25,FALSE)/100","v":0.94230769230769229},0.5,1,1,1,1,1,4.1666666666666664E-2,135.00000000000003,{"$f":"360*SUM($M$3:M10)","v":150.00000000000003},"Condition",142.50000000000003,0.6087614290087201,-0.79335334029123561,{"$f":"IF(Charts!$B$5='Chart Data'!$D$3,D10*SIN(Q10/180*PI()),IF(Charts!$B$5='Chart Data'!$E$3,E10*SIN(Q10/180*PI()),IF(Charts!$B$5='Chart Data'!$F$3,F10*SIN(Q10/180*PI()),\"\")))","v":0.57364057733514007},{"$f":"IF(Charts!$B$5='Chart Data'!$D$3,D10*COS(Q10/180*PI()),IF(Charts!$B$5='Chart Data'!$E$3,E10*COS(Q10/180*PI()),IF(Charts!$B$5='Chart Data'!$F$3,F10*COS(Q10/180*PI()),\"\")))","v":-0.74758295527443352},0.30438071450436005,-0.3966766701456178,0.6087614290087201,-0.79335334029123561,0.6087614290087201,-0.79335334029123561,0.6087614290087201,-0.79335334029123561,0.6087614290087201,-0.79335334029123561,null,null,163.63636363636365,1,1,1,1,1,1,1,1,1,1,1]
{"$rows_left_out":10}